"./operations.test -test.v -test.timeout 3h0m0s -remote TestDosya: -verbose" - Starting (try 1/5) 2026/10/08 02:27:13 DEBUG : Creating backend with remote "TestDosya:rclone-test-guqunuq0rise" 2026/10/08 02:27:13 DEBUG : Using config file from "/home/rclone/.rclone.conf" 2026/10/08 02:27:17 DEBUG : Creating backend with remote "/tmp/rclone554740044" === RUN TestDoMultiThreadCopy --- PASS: TestDoMultiThreadCopy (0.00s) === RUN TestMultithreadCalculateNumChunks === RUN TestMultithreadCalculateNumChunks/{size:1_chunkSize:65536_wantNumChunks:1} === RUN TestMultithreadCalculateNumChunks/{size:1048576_chunkSize:1_wantNumChunks:1048576} === RUN TestMultithreadCalculateNumChunks/{size:1048576_chunkSize:2_wantNumChunks:524288} === RUN TestMultithreadCalculateNumChunks/{size:1048577_chunkSize:2_wantNumChunks:524289} === RUN TestMultithreadCalculateNumChunks/{size:1048575_chunkSize:2_wantNumChunks:524288} --- PASS: TestMultithreadCalculateNumChunks (0.00s) --- PASS: TestMultithreadCalculateNumChunks/{size:1_chunkSize:65536_wantNumChunks:1} (0.00s) --- PASS: TestMultithreadCalculateNumChunks/{size:1048576_chunkSize:1_wantNumChunks:1048576} (0.00s) --- PASS: TestMultithreadCalculateNumChunks/{size:1048576_chunkSize:2_wantNumChunks:524288} (0.00s) --- PASS: TestMultithreadCalculateNumChunks/{size:1048577_chunkSize:2_wantNumChunks:524289} (0.00s) --- PASS: TestMultithreadCalculateNumChunks/{size:1048575_chunkSize:2_wantNumChunks:524288} (0.00s) === RUN TestMultithreadCopy run.go:198: Remote "dosya.dev root 'rclone-test-guqunuq0rise'", Local "Local file system at /tmp/rclone554740044", Modify Window "1s" multithread_test.go:120: multithread writing not supported 2026/10/08 02:27:17 ERROR : error listing: directory not found --- SKIP: TestMultithreadCopy (0.39s) === RUN TestMultithreadCopyAbort run.go:198: Remote "dosya.dev root 'rclone-test-guqunuq0rise'", Local "Local file system at /tmp/rclone554740044", Modify Window "1s" multithread_test.go:120: multithread writing not supported 2026/10/08 02:27:18 ERROR : error listing: directory not found --- SKIP: TestMultithreadCopyAbort (0.41s) === RUN TestMultithreadCopyWriterAtErrors === RUN TestMultithreadCopyWriterAtErrors/open/fatal=false 2026/10/08 02:27:18 DEBUG : file.txt: multi-thread copy: disabling buffering because destination uses OpenWriterAt === RUN TestMultithreadCopyWriterAtErrors/open/fatal=true 2026/10/08 02:27:18 DEBUG : file.txt: multi-thread copy: disabling buffering because destination uses OpenWriterAt === RUN TestMultithreadCopyWriterAtErrors/write/fatal=false 2026/10/08 02:27:18 DEBUG : file.txt: multi-thread copy: disabling buffering because destination uses OpenWriterAt 2026/10/08 02:27:18 DEBUG : file.txt: Starting multi-thread copy with 4 chunks of size 4 with 2 parallel streams 2026/10/08 02:27:18 DEBUG : file.txt: multi-thread copy: chunk 2/4 (4-8) size 4 starting 2026/10/08 02:27:18 DEBUG : file.txt: writing chunk 1 2026/10/08 02:27:18 DEBUG : file.txt: multi-thread copy: chunk 2/4 failed: multi-thread copy: failed to write chunk: disk full 2026/10/08 02:27:18 DEBUG : file.txt: multi-thread copy: chunk 3/4 (8-12) size 4 starting 2026/10/08 02:27:18 DEBUG : file.txt: writing chunk 2 2026/10/08 02:27:18 DEBUG : file.txt: multi-thread copy: chunk 1/4 (0-4) size 4 starting 2026/10/08 02:27:18 DEBUG : file.txt: writing chunk 0 2026/10/08 02:27:18 DEBUG : file.txt: multi-thread copy: chunk 3/4 failed: multi-thread copy: failed to write chunk: disk full 2026/10/08 02:27:18 DEBUG : file.txt: multi-thread copy: chunk 1/4 failed: multi-thread copy: failed to write chunk: disk full 2026/10/08 02:27:18 DEBUG : file.txt: multi-thread copy: cancelling transfer on exit 2026/10/08 02:27:18 DEBUG : file.txt: multi-thread copy: abort failed: multi-thread copy: failed to find temp file when aborting chunk writer: object not found === RUN TestMultithreadCopyWriterAtErrors/write/fatal=true 2026/10/08 02:27:18 DEBUG : file.txt: multi-thread copy: disabling buffering because destination uses OpenWriterAt 2026/10/08 02:27:18 DEBUG : file.txt: Starting multi-thread copy with 4 chunks of size 4 with 2 parallel streams 2026/10/08 02:27:18 DEBUG : file.txt: multi-thread copy: chunk 2/4 (4-8) size 4 starting 2026/10/08 02:27:18 DEBUG : file.txt: writing chunk 1 2026/10/08 02:27:18 DEBUG : file.txt: multi-thread copy: chunk 2/4 failed: multi-thread copy: failed to write chunk: disk full 2026/10/08 02:27:18 DEBUG : file.txt: multi-thread copy: chunk 3/4 (8-12) size 4 starting 2026/10/08 02:27:18 DEBUG : file.txt: writing chunk 2 2026/10/08 02:27:18 DEBUG : file.txt: multi-thread copy: chunk 3/4 failed: multi-thread copy: failed to write chunk: disk full 2026/10/08 02:27:18 DEBUG : file.txt: multi-thread copy: chunk 1/4 (0-4) size 4 starting 2026/10/08 02:27:18 DEBUG : file.txt: writing chunk 0 2026/10/08 02:27:18 DEBUG : file.txt: multi-thread copy: chunk 1/4 failed: multi-thread copy: failed to write chunk: disk full 2026/10/08 02:27:18 DEBUG : file.txt: multi-thread copy: cancelling transfer on exit 2026/10/08 02:27:18 DEBUG : file.txt: multi-thread copy: abort failed: multi-thread copy: failed to find temp file when aborting chunk writer: object not found === RUN TestMultithreadCopyWriterAtErrors/close/fatal=false 2026/10/08 02:27:18 DEBUG : file.txt: multi-thread copy: disabling buffering because destination uses OpenWriterAt 2026/10/08 02:27:18 DEBUG : file.txt: Starting multi-thread copy with 4 chunks of size 4 with 2 parallel streams 2026/10/08 02:27:18 DEBUG : file.txt: multi-thread copy: chunk 2/4 (4-8) size 4 starting 2026/10/08 02:27:18 DEBUG : file.txt: writing chunk 1 2026/10/08 02:27:18 DEBUG : file.txt: multi-thread copy: chunk 2/4 (4-8) size 4 finished 2026/10/08 02:27:18 DEBUG : file.txt: multi-thread copy: chunk 3/4 (8-12) size 4 starting 2026/10/08 02:27:18 DEBUG : file.txt: writing chunk 2 2026/10/08 02:27:18 DEBUG : file.txt: multi-thread copy: chunk 3/4 (8-12) size 4 finished 2026/10/08 02:27:18 DEBUG : file.txt: multi-thread copy: chunk 4/4 (12-16) size 4 starting 2026/10/08 02:27:18 DEBUG : file.txt: writing chunk 3 2026/10/08 02:27:18 DEBUG : file.txt: multi-thread copy: chunk 4/4 (12-16) size 4 finished 2026/10/08 02:27:18 DEBUG : file.txt: multi-thread copy: chunk 1/4 (0-4) size 4 starting 2026/10/08 02:27:18 DEBUG : file.txt: writing chunk 0 2026/10/08 02:27:18 DEBUG : file.txt: multi-thread copy: chunk 1/4 (0-4) size 4 finished 2026/10/08 02:27:18 DEBUG : file.txt: multi-thread copy: cancelling transfer on exit 2026/10/08 02:27:18 DEBUG : file.txt: multi-thread copy: abort failed: multi-thread copy: failed to find temp file when aborting chunk writer: object not found === RUN TestMultithreadCopyWriterAtErrors/close/fatal=true 2026/10/08 02:27:18 DEBUG : file.txt: multi-thread copy: disabling buffering because destination uses OpenWriterAt 2026/10/08 02:27:18 DEBUG : file.txt: Starting multi-thread copy with 4 chunks of size 4 with 2 parallel streams 2026/10/08 02:27:18 DEBUG : file.txt: multi-thread copy: chunk 2/4 (4-8) size 4 starting 2026/10/08 02:27:18 DEBUG : file.txt: writing chunk 1 2026/10/08 02:27:18 DEBUG : file.txt: multi-thread copy: chunk 2/4 (4-8) size 4 finished 2026/10/08 02:27:18 DEBUG : file.txt: multi-thread copy: chunk 3/4 (8-12) size 4 starting 2026/10/08 02:27:18 DEBUG : file.txt: writing chunk 2 2026/10/08 02:27:18 DEBUG : file.txt: multi-thread copy: chunk 3/4 (8-12) size 4 finished 2026/10/08 02:27:18 DEBUG : file.txt: multi-thread copy: chunk 4/4 (12-16) size 4 starting 2026/10/08 02:27:18 DEBUG : file.txt: writing chunk 3 2026/10/08 02:27:18 DEBUG : file.txt: multi-thread copy: chunk 4/4 (12-16) size 4 finished 2026/10/08 02:27:18 DEBUG : file.txt: multi-thread copy: chunk 1/4 (0-4) size 4 starting 2026/10/08 02:27:18 DEBUG : file.txt: writing chunk 0 2026/10/08 02:27:18 DEBUG : file.txt: multi-thread copy: chunk 1/4 (0-4) size 4 finished 2026/10/08 02:27:18 DEBUG : file.txt: multi-thread copy: cancelling transfer on exit 2026/10/08 02:27:18 DEBUG : file.txt: multi-thread copy: abort failed: multi-thread copy: failed to find temp file when aborting chunk writer: object not found --- PASS: TestMultithreadCopyWriterAtErrors (0.00s) --- PASS: TestMultithreadCopyWriterAtErrors/open/fatal=false (0.00s) --- PASS: TestMultithreadCopyWriterAtErrors/open/fatal=true (0.00s) --- PASS: TestMultithreadCopyWriterAtErrors/write/fatal=false (0.00s) --- PASS: TestMultithreadCopyWriterAtErrors/write/fatal=true (0.00s) --- PASS: TestMultithreadCopyWriterAtErrors/close/fatal=false (0.00s) --- PASS: TestMultithreadCopyWriterAtErrors/close/fatal=true (0.00s) === RUN TestSizeDiffers 2026/10/08 02:27:18 DEBUG : a: size = 0 OK 2026/10/08 02:27:18 DEBUG : a: size = 1 (memory) 2026/10/08 02:27:18 DEBUG : a: size = 2 (memory) --- PASS: TestSizeDiffers (0.00s) === RUN TestDirTransferEntry --- PASS: TestDirTransferEntry (0.00s) === RUN TestReOpen === RUN TestReOpen/Normal === RUN TestReOpen/Normal/Basics 2026/10/08 02:27:18 DEBUG : potato: Seek from 10 to 0 === RUN TestReOpen/Normal/ErrorAtStart === RUN TestReOpen/Normal/WithErrors 2026/10/08 02:27:18 DEBUG : potato: Reopening on read failure after offset 2 bytes: retry 1/10: test error 2026/10/08 02:27:18 DEBUG : potato: Reopening on read failure after offset 3 bytes: retry 2/10: test error 2026/10/08 02:27:18 DEBUG : potato: Reopening on read failure after offset 6 bytes: retry 3/10: test error === RUN TestReOpen/Normal/TooManyErrors 2026/10/08 02:27:18 DEBUG : potato: Reopening on read failure after offset 2 bytes: retry 1/3: test error 2026/10/08 02:27:18 DEBUG : potato: Reopening on read failure after offset 3 bytes: retry 2/3: test error 2026/10/08 02:27:18 DEBUG : potato: Reopening on read failure after offset 6 bytes: retry 3/3: test error 2026/10/08 02:27:18 DEBUG : potato: Reopen failed after offset 6 bytes read: failed to reopen: too many retries === RUN TestReOpen/Normal/ReadAt 2026/10/08 02:27:18 DEBUG : potato: Reopening on read failure after offset 2 bytes: retry 0/10: test error 2026/10/08 02:27:18 DEBUG : potato: Reopening on read failure after offset 3 bytes: retry 1/10: test error 2026/10/08 02:27:18 DEBUG : potato: Seek from 5 to 1 === RUN TestReOpen/Normal/Seek 2026/10/08 02:27:18 DEBUG : potato: Reopening on read failure after offset 2 bytes: retry 0/10: test error 2026/10/08 02:27:18 DEBUG : potato: Reopening on read failure after offset 3 bytes: retry 1/10: test error 2026/10/08 02:27:18 DEBUG : potato: Seek from 5 to 2 === RUN TestReOpen/Normal/AccountRead === RUN TestReOpen/Normal/AccountReadDelay 2026/10/08 02:27:18 DEBUG : potato: Seek from 10 to 0 2026/10/08 02:27:18 DEBUG : potato: Seek from 10 to 0 2026/10/08 02:27:18 DEBUG : potato: Seek from 10 to 0 === RUN TestReOpen/Normal/AccountReadError === RUN TestReOpen/WithRangeOption === RUN TestReOpen/WithRangeOption/Basics 2026/10/08 02:27:18 DEBUG : potato: Seek from 7 to 0 === RUN TestReOpen/WithRangeOption/ErrorAtStart === RUN TestReOpen/WithRangeOption/WithErrors 2026/10/08 02:27:18 DEBUG : potato: Reopening on read failure after offset 2 bytes: retry 1/10: test error 2026/10/08 02:27:18 DEBUG : potato: Reopening on read failure after offset 3 bytes: retry 2/10: test error 2026/10/08 02:27:18 DEBUG : potato: Reopening on read failure after offset 6 bytes: retry 3/10: test error === RUN TestReOpen/WithRangeOption/TooManyErrors 2026/10/08 02:27:18 DEBUG : potato: Reopening on read failure after offset 2 bytes: retry 1/3: test error 2026/10/08 02:27:18 DEBUG : potato: Reopening on read failure after offset 3 bytes: retry 2/3: test error 2026/10/08 02:27:18 DEBUG : potato: Reopening on read failure after offset 6 bytes: retry 3/3: test error 2026/10/08 02:27:18 DEBUG : potato: Reopen failed after offset 6 bytes read: failed to reopen: too many retries === RUN TestReOpen/WithRangeOption/ReadAt 2026/10/08 02:27:18 DEBUG : potato: Reopening on read failure after offset 2 bytes: retry 0/10: test error 2026/10/08 02:27:18 DEBUG : potato: Reopening on read failure after offset 3 bytes: retry 1/10: test error 2026/10/08 02:27:18 DEBUG : potato: Seek from 5 to 1 === RUN TestReOpen/WithRangeOption/Seek 2026/10/08 02:27:18 DEBUG : potato: Reopening on read failure after offset 2 bytes: retry 0/10: test error 2026/10/08 02:27:18 DEBUG : potato: Reopening on read failure after offset 3 bytes: retry 1/10: test error 2026/10/08 02:27:18 DEBUG : potato: Seek from 5 to 2 2026/10/08 02:27:18 DEBUG : potato: Seek from 7 to 4 === RUN TestReOpen/WithRangeOption/AccountRead === RUN TestReOpen/WithRangeOption/AccountReadDelay 2026/10/08 02:27:18 DEBUG : potato: Seek from 7 to 0 2026/10/08 02:27:18 DEBUG : potato: Seek from 7 to 0 2026/10/08 02:27:18 DEBUG : potato: Seek from 7 to 0 === RUN TestReOpen/WithRangeOption/AccountReadError === RUN TestReOpen/WithSeekOption === RUN TestReOpen/WithSeekOption/Basics 2026/10/08 02:27:18 DEBUG : potato: Seek from 8 to 0 === RUN TestReOpen/WithSeekOption/ErrorAtStart === RUN TestReOpen/WithSeekOption/WithErrors 2026/10/08 02:27:18 DEBUG : potato: Reopening on read failure after offset 2 bytes: retry 1/10: test error 2026/10/08 02:27:18 DEBUG : potato: Reopening on read failure after offset 3 bytes: retry 2/10: test error 2026/10/08 02:27:18 DEBUG : potato: Reopening on read failure after offset 6 bytes: retry 3/10: test error === RUN TestReOpen/WithSeekOption/TooManyErrors 2026/10/08 02:27:18 DEBUG : potato: Reopening on read failure after offset 2 bytes: retry 1/3: test error 2026/10/08 02:27:18 DEBUG : potato: Reopening on read failure after offset 3 bytes: retry 2/3: test error 2026/10/08 02:27:18 DEBUG : potato: Reopening on read failure after offset 6 bytes: retry 3/3: test error 2026/10/08 02:27:18 DEBUG : potato: Reopen failed after offset 6 bytes read: failed to reopen: too many retries === RUN TestReOpen/WithSeekOption/ReadAt 2026/10/08 02:27:18 DEBUG : potato: Reopening on read failure after offset 2 bytes: retry 0/10: test error 2026/10/08 02:27:18 DEBUG : potato: Reopening on read failure after offset 3 bytes: retry 1/10: test error 2026/10/08 02:27:18 DEBUG : potato: Seek from 5 to 1 === RUN TestReOpen/WithSeekOption/Seek 2026/10/08 02:27:18 DEBUG : potato: Reopening on read failure after offset 2 bytes: retry 0/10: test error 2026/10/08 02:27:18 DEBUG : potato: Reopening on read failure after offset 3 bytes: retry 1/10: test error 2026/10/08 02:27:18 DEBUG : potato: Seek from 5 to 2 2026/10/08 02:27:18 DEBUG : potato: Seek from 7 to 5 === RUN TestReOpen/WithSeekOption/AccountRead === RUN TestReOpen/WithSeekOption/AccountReadDelay 2026/10/08 02:27:18 DEBUG : potato: Seek from 8 to 0 2026/10/08 02:27:18 DEBUG : potato: Seek from 8 to 0 2026/10/08 02:27:18 DEBUG : potato: Seek from 8 to 0 === RUN TestReOpen/WithSeekOption/AccountReadError === RUN TestReOpen/UnknownSize === RUN TestReOpen/UnknownSize/Basics 2026/10/08 02:27:18 DEBUG : potato: Seek from 9 to 0 === RUN TestReOpen/UnknownSize/ErrorAtStart === RUN TestReOpen/UnknownSize/WithErrors 2026/10/08 02:27:18 DEBUG : potato: Reopening on read failure after offset 2 bytes: retry 1/10: test error 2026/10/08 02:27:18 DEBUG : potato: Reopening on read failure after offset 3 bytes: retry 2/10: test error 2026/10/08 02:27:18 DEBUG : potato: Reopening on read failure after offset 6 bytes: retry 3/10: test error === RUN TestReOpen/UnknownSize/TooManyErrors 2026/10/08 02:27:18 DEBUG : potato: Reopening on read failure after offset 2 bytes: retry 1/3: test error 2026/10/08 02:27:18 DEBUG : potato: Reopening on read failure after offset 3 bytes: retry 2/3: test error 2026/10/08 02:27:18 DEBUG : potato: Reopening on read failure after offset 6 bytes: retry 3/3: test error 2026/10/08 02:27:18 DEBUG : potato: Reopen failed after offset 6 bytes read: failed to reopen: too many retries === RUN TestReOpen/UnknownSize/ReadAt 2026/10/08 02:27:18 DEBUG : potato: Reopening on read failure after offset 2 bytes: retry 0/10: test error 2026/10/08 02:27:18 DEBUG : potato: Reopening on read failure after offset 3 bytes: retry 1/10: test error 2026/10/08 02:27:18 DEBUG : potato: Seek from 5 to 1 === RUN TestReOpen/UnknownSize/Seek 2026/10/08 02:27:18 DEBUG : potato: Reopening on read failure after offset 2 bytes: retry 0/10: test error 2026/10/08 02:27:18 DEBUG : potato: Reopening on read failure after offset 3 bytes: retry 1/10: test error 2026/10/08 02:27:18 DEBUG : potato: Seek from 5 to 2 2026/10/08 02:27:18 DEBUG : potato: Seek from 7 to 6 === RUN TestReOpen/UnknownSize/AccountRead === RUN TestReOpen/UnknownSize/AccountReadDelay 2026/10/08 02:27:18 DEBUG : potato: Seek from 9 to 0 2026/10/08 02:27:18 DEBUG : potato: Seek from 9 to 0 2026/10/08 02:27:18 DEBUG : potato: Seek from 9 to 0 === RUN TestReOpen/UnknownSize/AccountReadError --- PASS: TestReOpen (0.01s) --- PASS: TestReOpen/Normal (0.00s) --- PASS: TestReOpen/Normal/Basics (0.00s) --- PASS: TestReOpen/Normal/ErrorAtStart (0.00s) --- PASS: TestReOpen/Normal/WithErrors (0.00s) --- PASS: TestReOpen/Normal/TooManyErrors (0.00s) --- PASS: TestReOpen/Normal/ReadAt (0.00s) --- PASS: TestReOpen/Normal/Seek (0.00s) --- PASS: TestReOpen/Normal/AccountRead (0.00s) --- PASS: TestReOpen/Normal/AccountReadDelay (0.00s) --- PASS: TestReOpen/Normal/AccountReadError (0.00s) --- PASS: TestReOpen/WithRangeOption (0.00s) --- PASS: TestReOpen/WithRangeOption/Basics (0.00s) --- PASS: TestReOpen/WithRangeOption/ErrorAtStart (0.00s) --- PASS: TestReOpen/WithRangeOption/WithErrors (0.00s) --- PASS: TestReOpen/WithRangeOption/TooManyErrors (0.00s) --- PASS: TestReOpen/WithRangeOption/ReadAt (0.00s) --- PASS: TestReOpen/WithRangeOption/Seek (0.00s) --- PASS: TestReOpen/WithRangeOption/AccountRead (0.00s) --- PASS: TestReOpen/WithRangeOption/AccountReadDelay (0.00s) --- PASS: TestReOpen/WithRangeOption/AccountReadError (0.00s) --- PASS: TestReOpen/WithSeekOption (0.00s) --- PASS: TestReOpen/WithSeekOption/Basics (0.00s) --- PASS: TestReOpen/WithSeekOption/ErrorAtStart (0.00s) --- PASS: TestReOpen/WithSeekOption/WithErrors (0.00s) --- PASS: TestReOpen/WithSeekOption/TooManyErrors (0.00s) --- PASS: TestReOpen/WithSeekOption/ReadAt (0.00s) --- PASS: TestReOpen/WithSeekOption/Seek (0.00s) --- PASS: TestReOpen/WithSeekOption/AccountRead (0.00s) --- PASS: TestReOpen/WithSeekOption/AccountReadDelay (0.00s) --- PASS: TestReOpen/WithSeekOption/AccountReadError (0.00s) --- PASS: TestReOpen/UnknownSize (0.00s) --- PASS: TestReOpen/UnknownSize/Basics (0.00s) --- PASS: TestReOpen/UnknownSize/ErrorAtStart (0.00s) --- PASS: TestReOpen/UnknownSize/WithErrors (0.00s) --- PASS: TestReOpen/UnknownSize/TooManyErrors (0.00s) --- PASS: TestReOpen/UnknownSize/ReadAt (0.00s) --- PASS: TestReOpen/UnknownSize/Seek (0.00s) --- PASS: TestReOpen/UnknownSize/AccountRead (0.00s) --- PASS: TestReOpen/UnknownSize/AccountReadDelay (0.00s) --- PASS: TestReOpen/UnknownSize/AccountReadError (0.00s) === RUN TestCheck run.go:198: Remote "dosya.dev root 'rclone-test-guqunuq0rise'", Local "Local file system at /tmp/rclone554740044", Modify Window "1s" === RUN TestCheck/1 === RUN TestCheck/2 === RUN TestCheck/3 === RUN TestCheck/4 === RUN TestCheck/5 === RUN TestCheck/6 === RUN TestCheck/7 --- PASS: TestCheck (22.23s) --- PASS: TestCheck/1 (0.39s) --- PASS: TestCheck/2 (0.40s) --- PASS: TestCheck/3 (0.39s) --- PASS: TestCheck/4 (0.40s) --- PASS: TestCheck/5 (0.41s) --- PASS: TestCheck/6 (0.55s) --- PASS: TestCheck/7 (0.40s) === RUN TestCheckFsError 2026/10/08 02:27:40 DEBUG : Creating backend with remote "nonexistent" 2026/10/08 02:27:40 DEBUG : Creating backend with remote "nonexistent" 2026/10/08 02:27:40 DEBUG : Local file system at nonexistent: Waiting for checks to finish 2026/10/08 02:27:40 ERROR : Local file system at nonexistent: error reading source root directory: directory not found 2026/10/08 02:27:40 NOTICE: Local file system at nonexistent: 0 differences found 2026/10/08 02:27:40 NOTICE: Local file system at nonexistent: 2 errors while checking --- PASS: TestCheckFsError (0.00s) === RUN TestCheckDownload run.go:198: Remote "dosya.dev root 'rclone-test-guqunuq0rise'", Local "Local file system at /tmp/rclone554740044", Modify Window "1s" === RUN TestCheckDownload/1 === RUN TestCheckDownload/2 === RUN TestCheckDownload/3 === RUN TestCheckDownload/4 === RUN TestCheckDownload/5 === RUN TestCheckDownload/6 === RUN TestCheckDownload/7 --- PASS: TestCheckDownload (31.24s) --- PASS: TestCheckDownload/1 (2.03s) --- PASS: TestCheckDownload/2 (1.92s) --- PASS: TestCheckDownload/3 (1.89s) --- PASS: TestCheckDownload/4 (2.02s) --- PASS: TestCheckDownload/5 (2.05s) --- PASS: TestCheckDownload/6 (2.02s) --- PASS: TestCheckDownload/7 (2.00s) === RUN TestCheckSizeOnly run.go:198: Remote "dosya.dev root 'rclone-test-guqunuq0rise'", Local "Local file system at /tmp/rclone554740044", Modify Window "1s" === RUN TestCheckSizeOnly/1 === RUN TestCheckSizeOnly/2 === RUN TestCheckSizeOnly/3 === RUN TestCheckSizeOnly/4 === RUN TestCheckSizeOnly/5 === RUN TestCheckSizeOnly/6 === RUN TestCheckSizeOnly/7 --- PASS: TestCheckSizeOnly (20.46s) --- PASS: TestCheckSizeOnly/1 (0.38s) --- PASS: TestCheckSizeOnly/2 (0.39s) --- PASS: TestCheckSizeOnly/3 (0.39s) --- PASS: TestCheckSizeOnly/4 (0.38s) --- PASS: TestCheckSizeOnly/5 (0.38s) --- PASS: TestCheckSizeOnly/6 (0.40s) --- PASS: TestCheckSizeOnly/7 (0.40s) === RUN TestCheckEqualReaders --- PASS: TestCheckEqualReaders (0.01s) === RUN TestParseSumFile run.go:198: Remote "dosya.dev root 'rclone-test-guqunuq0rise'", Local "Local file system at /tmp/rclone554740044", Modify Window "1s" 2026/10/08 02:28:36 NOTICE: test.sum: improperly formatted checksum line 4 2026/10/08 02:28:36 NOTICE: test.sum: improperly formatted checksum line 5 2026/10/08 02:28:36 NOTICE: test.sum: improperly formatted checksum line 6 2026/10/08 02:28:36 NOTICE: test.sum: 2 warning(s) suppressed... 2026/10/08 02:28:42 NOTICE: test.sum: improperly formatted checksum line 4 2026/10/08 02:28:42 NOTICE: test.sum: improperly formatted checksum line 5 2026/10/08 02:28:42 NOTICE: test.sum: improperly formatted checksum line 6 2026/10/08 02:28:42 NOTICE: test.sum: 2 warning(s) suppressed... --- PASS: TestParseSumFile (11.90s) === RUN TestCheckSum run.go:198: Remote "dosya.dev root 'rclone-test-guqunuq0rise'", Local "Local file system at /tmp/rclone554740044", Modify Window "1s" 2026/10/08 02:28:43 DEBUG : Creating backend with remote "TestDosya:rclone-test-guqunuq0rise/data" 2026/10/08 02:28:43 DEBUG : Config file has changed externally - reloading check_test.go:354: dosya.dev root 'rclone-test-guqunuq0rise/data' lacks md5, skipping --- SKIP: TestCheckSum (2.37s) === RUN TestCheckSumDownload run.go:198: Remote "dosya.dev root 'rclone-test-guqunuq0rise'", Local "Local file system at /tmp/rclone554740044", Modify Window "1s" 2026/10/08 02:28:46 DEBUG : Creating backend with remote "TestDosya:rclone-test-guqunuq0rise/data" === RUN TestCheckSumDownload/subtest1 === RUN TestCheckSumDownload/subtest2 === RUN TestCheckSumDownload/subtest3 === RUN TestCheckSumDownload/subtest4 === RUN TestCheckSumDownload/subtest5 === RUN TestCheckSumDownload/subtest6 === RUN TestCheckSumDownload/subtest7 --- PASS: TestCheckSumDownload (77.99s) --- PASS: TestCheckSumDownload/subtest1 (4.71s) --- PASS: TestCheckSumDownload/subtest2 (3.80s) --- PASS: TestCheckSumDownload/subtest3 (4.42s) --- PASS: TestCheckSumDownload/subtest4 (4.00s) --- PASS: TestCheckSumDownload/subtest5 (4.42s) --- PASS: TestCheckSumDownload/subtest6 (3.90s) --- PASS: TestCheckSumDownload/subtest7 (4.04s) === RUN TestCheckSumConcurrency 2026/10/08 02:30:04 DEBUG : file0: md5 = 022eb0c0085c731f335df970fafa7446 OK 2026/10/08 02:30:04 DEBUG : file2: md5 = a58f09ae3db8ae4b943fdbaace096072 OK 2026/10/08 02:30:04 DEBUG : file1: md5 = 17fbabbccbdea0e6be9eb64c8c6fea41 OK 2026/10/08 02:30:04 DEBUG : file3: md5 = e0639b17e0744aca9a3ba29c049e59ee OK 2026/10/08 02:30:04 NOTICE: Mock file system at checkSum: 0 differences found 2026/10/08 02:30:04 NOTICE: Mock file system at checkSum: 4 matching files --- PASS: TestCheckSumConcurrency (0.00s) === RUN TestCheckSumDownloadConcurrency 2026/10/08 02:30:04 DEBUG : file0: md5 = 022eb0c0085c731f335df970fafa7446 OK 2026/10/08 02:30:04 DEBUG : file2: md5 = a58f09ae3db8ae4b943fdbaace096072 OK 2026/10/08 02:30:04 DEBUG : file1: md5 = 17fbabbccbdea0e6be9eb64c8c6fea41 OK 2026/10/08 02:30:04 DEBUG : file3: md5 = e0639b17e0744aca9a3ba29c049e59ee OK 2026/10/08 02:30:04 NOTICE: Mock file system at checkSum: 0 differences found 2026/10/08 02:30:04 NOTICE: Mock file system at checkSum: 4 matching files --- PASS: TestCheckSumDownloadConcurrency (0.00s) === RUN TestApplyTransforms 2026/10/08 02:30:04 DEBUG : Creating backend with remote "TestDosya:rclone-test-mayutax8boze" 2026/10/08 02:30:04 DEBUG : Using config file from "/home/rclone/.rclone.conf" 2026/10/08 02:30:05 DEBUG : Creating backend with remote "/tmp/rclone1612880201" 2026/10/08 02:30:05 DEBUG : Config file has changed externally - reloading run.go:198: Remote "dosya.dev root 'rclone-test-mayutax8boze'", Local "Local file system at /tmp/rclone1612880201", Modify Window "1s" upper checkfile vs. lower remote (without normalization) 2026/10/08 02:30:09 ERROR : hello, world!: sum not found 2026/10/08 02:30:09 ERROR : HELLO, WORLD!: file not in dosya.dev root 'rclone-test-mayutax8boze' 2026/10/08 02:30:09 NOTICE: dosya.dev root 'rclone-test-mayutax8boze': 1 files missing 2026/10/08 02:30:09 NOTICE: 1 hashes missing 2026/10/08 02:30:09 NOTICE: dosya.dev root 'rclone-test-mayutax8boze': 1 differences found 2026/10/08 02:30:09 NOTICE: dosya.dev root 'rclone-test-mayutax8boze': 2 errors while checking upper checkfile vs. lower remote (with normalization) 2026/10/08 02:30:11 DEBUG : hello, world!: md5 = 65a8e27d8879283831b664bd8b7f0ad4 OK 2026/10/08 02:30:11 NOTICE: dosya.dev root 'rclone-test-mayutax8boze': 0 differences found 2026/10/08 02:30:11 NOTICE: dosya.dev root 'rclone-test-mayutax8boze': 1 matching files 2026/10/08 02:30:11 DEBUG : Creating backend with remote "TestDosya:rclone-test-yuriyat0vika" 2026/10/08 02:30:11 DEBUG : Using config file from "/home/rclone/.rclone.conf" 2026/10/08 02:30:12 DEBUG : Creating backend with remote "/tmp/rclone186762999" run.go:198: Remote "dosya.dev root 'rclone-test-yuriyat0vika'", Local "Local file system at /tmp/rclone186762999", Modify Window "1s" lower checkfile vs. upper remote (without normalization) 2026/10/08 02:30:17 ERROR : HELLO, WORLD!: sum not found 2026/10/08 02:30:17 ERROR : hello, world!: file not in dosya.dev root 'rclone-test-yuriyat0vika' 2026/10/08 02:30:17 NOTICE: dosya.dev root 'rclone-test-yuriyat0vika': 1 files missing 2026/10/08 02:30:17 NOTICE: 1 hashes missing 2026/10/08 02:30:17 NOTICE: dosya.dev root 'rclone-test-yuriyat0vika': 1 differences found 2026/10/08 02:30:17 NOTICE: dosya.dev root 'rclone-test-yuriyat0vika': 2 errors while checking lower checkfile vs. upper remote (with normalization) 2026/10/08 02:30:19 DEBUG : HELLO, WORLD!: md5 = 65a8e27d8879283831b664bd8b7f0ad4 OK 2026/10/08 02:30:19 NOTICE: dosya.dev root 'rclone-test-yuriyat0vika': 0 differences found 2026/10/08 02:30:19 NOTICE: dosya.dev root 'rclone-test-yuriyat0vika': 1 matching files 2026/10/08 02:30:19 DEBUG : Creating backend with remote "TestDosya:rclone-test-nizujin5wavo" 2026/10/08 02:30:19 DEBUG : Using config file from "/home/rclone/.rclone.conf" 2026/10/08 02:30:20 DEBUG : Creating backend with remote "/tmp/rclone448083179" run.go:198: Remote "dosya.dev root 'rclone-test-nizujin5wavo'", Local "Local file system at /tmp/rclone448083179", Modify Window "1s" lower checkfile vs. upperlowermixed remote (without normalization) 2026/10/08 02:30:25 ERROR : HeLlO, wOrLd!: sum not found 2026/10/08 02:30:25 ERROR : hello, world!: file not in dosya.dev root 'rclone-test-nizujin5wavo' 2026/10/08 02:30:25 NOTICE: dosya.dev root 'rclone-test-nizujin5wavo': 1 files missing 2026/10/08 02:30:25 NOTICE: 1 hashes missing 2026/10/08 02:30:25 NOTICE: dosya.dev root 'rclone-test-nizujin5wavo': 1 differences found 2026/10/08 02:30:25 NOTICE: dosya.dev root 'rclone-test-nizujin5wavo': 2 errors while checking lower checkfile vs. upperlowermixed remote (with normalization) 2026/10/08 02:30:27 DEBUG : HeLlO, wOrLd!: md5 = 65a8e27d8879283831b664bd8b7f0ad4 OK 2026/10/08 02:30:27 NOTICE: dosya.dev root 'rclone-test-nizujin5wavo': 0 differences found 2026/10/08 02:30:27 NOTICE: dosya.dev root 'rclone-test-nizujin5wavo': 1 matching files 2026/10/08 02:30:27 DEBUG : Creating backend with remote "TestDosya:rclone-test-gejexof2kedi" 2026/10/08 02:30:27 DEBUG : Using config file from "/home/rclone/.rclone.conf" 2026/10/08 02:30:28 DEBUG : Creating backend with remote "/tmp/rclone2153322307" run.go:198: Remote "dosya.dev root 'rclone-test-gejexof2kedi'", Local "Local file system at /tmp/rclone2153322307", Modify Window "1s" upperlowermixed checkfile vs. upper remote (without normalization) 2026/10/08 02:30:33 ERROR : HELLO, WORLD!: sum not found 2026/10/08 02:30:33 ERROR : HeLlO, wOrLd!: file not in dosya.dev root 'rclone-test-gejexof2kedi' 2026/10/08 02:30:33 NOTICE: dosya.dev root 'rclone-test-gejexof2kedi': 1 files missing 2026/10/08 02:30:33 NOTICE: 1 hashes missing 2026/10/08 02:30:33 NOTICE: dosya.dev root 'rclone-test-gejexof2kedi': 1 differences found 2026/10/08 02:30:33 NOTICE: dosya.dev root 'rclone-test-gejexof2kedi': 2 errors while checking upperlowermixed checkfile vs. upper remote (with normalization) 2026/10/08 02:30:35 DEBUG : HELLO, WORLD!: md5 = 65a8e27d8879283831b664bd8b7f0ad4 OK 2026/10/08 02:30:35 NOTICE: dosya.dev root 'rclone-test-gejexof2kedi': 0 differences found 2026/10/08 02:30:35 NOTICE: dosya.dev root 'rclone-test-gejexof2kedi': 1 matching files 2026/10/08 02:30:35 DEBUG : Creating backend with remote "TestDosya:rclone-test-qaxovoh4qiro" 2026/10/08 02:30:35 DEBUG : Using config file from "/home/rclone/.rclone.conf" 2026/10/08 02:30:36 DEBUG : Creating backend with remote "/tmp/rclone1893118252" run.go:198: Remote "dosya.dev root 'rclone-test-qaxovoh4qiro'", Local "Local file system at /tmp/rclone1893118252", Modify Window "1s" NFD checkfile vs. NFC remote (without normalization) 2026/10/08 02:30:40 ERROR : 測試_Русский___ě_áñ: sum not found 2026/10/08 02:30:40 ERROR : 測試_Русский___ě_áñ: file not in dosya.dev root 'rclone-test-qaxovoh4qiro' 2026/10/08 02:30:40 NOTICE: dosya.dev root 'rclone-test-qaxovoh4qiro': 1 files missing 2026/10/08 02:30:40 NOTICE: 1 hashes missing 2026/10/08 02:30:40 NOTICE: dosya.dev root 'rclone-test-qaxovoh4qiro': 1 differences found 2026/10/08 02:30:40 NOTICE: dosya.dev root 'rclone-test-qaxovoh4qiro': 2 errors while checking NFD checkfile vs. NFC remote (with normalization) 2026/10/08 02:30:42 DEBUG : 測試_Русский___ě_áñ: md5 = 65a8e27d8879283831b664bd8b7f0ad4 OK 2026/10/08 02:30:42 NOTICE: dosya.dev root 'rclone-test-qaxovoh4qiro': 0 differences found 2026/10/08 02:30:42 NOTICE: dosya.dev root 'rclone-test-qaxovoh4qiro': 1 matching files 2026/10/08 02:30:42 DEBUG : Creating backend with remote "TestDosya:rclone-test-wojopah7bika" 2026/10/08 02:30:42 DEBUG : Using config file from "/home/rclone/.rclone.conf" 2026/10/08 02:30:43 DEBUG : Creating backend with remote "/tmp/rclone1276738009" run.go:198: Remote "dosya.dev root 'rclone-test-wojopah7bika'", Local "Local file system at /tmp/rclone1276738009", Modify Window "1s" NFC checkfile vs. NFD remote (without normalization) 2026/10/08 02:30:48 ERROR : 測試_Русский___ě_áñ: sum not found 2026/10/08 02:30:48 ERROR : 測試_Русский___ě_áñ: file not in dosya.dev root 'rclone-test-wojopah7bika' 2026/10/08 02:30:48 NOTICE: dosya.dev root 'rclone-test-wojopah7bika': 1 files missing 2026/10/08 02:30:48 NOTICE: 1 hashes missing 2026/10/08 02:30:48 NOTICE: dosya.dev root 'rclone-test-wojopah7bika': 1 differences found 2026/10/08 02:30:48 NOTICE: dosya.dev root 'rclone-test-wojopah7bika': 2 errors while checking NFC checkfile vs. NFD remote (with normalization) 2026/10/08 02:30:50 DEBUG : 測試_Русский___ě_áñ: md5 = 65a8e27d8879283831b664bd8b7f0ad4 OK 2026/10/08 02:30:50 NOTICE: dosya.dev root 'rclone-test-wojopah7bika': 0 differences found 2026/10/08 02:30:50 NOTICE: dosya.dev root 'rclone-test-wojopah7bika': 1 matching files 2026/10/08 02:30:50 DEBUG : Creating backend with remote "TestDosya:rclone-test-gesesop6qalo" 2026/10/08 02:30:50 DEBUG : Using config file from "/home/rclone/.rclone.conf" 2026/10/08 02:30:51 DEBUG : Creating backend with remote "/tmp/rclone1150277161" run.go:198: Remote "dosya.dev root 'rclone-test-gesesop6qalo'", Local "Local file system at /tmp/rclone1150277161", Modify Window "1s" NFDx2 checkfile vs. both remote (without normalization) 2026/10/08 02:30:55 ERROR : 測試_Русский___ě_áñ測試_Русский___ě_áñ: sum not found 2026/10/08 02:30:55 ERROR : 測試_Русский___ě_áñ測試_Русский___ě_áñ: file not in dosya.dev root 'rclone-test-gesesop6qalo' 2026/10/08 02:30:55 NOTICE: dosya.dev root 'rclone-test-gesesop6qalo': 1 files missing 2026/10/08 02:30:55 NOTICE: 1 hashes missing 2026/10/08 02:30:55 NOTICE: dosya.dev root 'rclone-test-gesesop6qalo': 1 differences found 2026/10/08 02:30:55 NOTICE: dosya.dev root 'rclone-test-gesesop6qalo': 2 errors while checking NFDx2 checkfile vs. both remote (with normalization) 2026/10/08 02:30:57 DEBUG : 測試_Русский___ě_áñ測試_Русский___ě_áñ: md5 = 65a8e27d8879283831b664bd8b7f0ad4 OK 2026/10/08 02:30:57 NOTICE: dosya.dev root 'rclone-test-gesesop6qalo': 0 differences found 2026/10/08 02:30:57 NOTICE: dosya.dev root 'rclone-test-gesesop6qalo': 1 matching files 2026/10/08 02:30:57 DEBUG : Creating backend with remote "TestDosya:rclone-test-mepuzec0xaqu" 2026/10/08 02:30:57 DEBUG : Using config file from "/home/rclone/.rclone.conf" 2026/10/08 02:30:58 DEBUG : Creating backend with remote "/tmp/rclone1024468505" run.go:198: Remote "dosya.dev root 'rclone-test-mepuzec0xaqu'", Local "Local file system at /tmp/rclone1024468505", Modify Window "1s" NFCx2 checkfile vs. both remote (without normalization) 2026/10/08 02:31:03 ERROR : 測試_Русский___ě_áñ測試_Русский___ě_áñ: sum not found 2026/10/08 02:31:03 ERROR : 測試_Русский___ě_áñ測試_Русский___ě_áñ: file not in dosya.dev root 'rclone-test-mepuzec0xaqu' 2026/10/08 02:31:03 NOTICE: dosya.dev root 'rclone-test-mepuzec0xaqu': 1 files missing 2026/10/08 02:31:03 NOTICE: 1 hashes missing 2026/10/08 02:31:03 NOTICE: dosya.dev root 'rclone-test-mepuzec0xaqu': 1 differences found 2026/10/08 02:31:03 NOTICE: dosya.dev root 'rclone-test-mepuzec0xaqu': 2 errors while checking NFCx2 checkfile vs. both remote (with normalization) 2026/10/08 02:31:05 DEBUG : 測試_Русский___ě_áñ測試_Русский___ě_áñ: md5 = 65a8e27d8879283831b664bd8b7f0ad4 OK 2026/10/08 02:31:05 NOTICE: dosya.dev root 'rclone-test-mepuzec0xaqu': 0 differences found 2026/10/08 02:31:05 NOTICE: dosya.dev root 'rclone-test-mepuzec0xaqu': 1 matching files 2026/10/08 02:31:05 DEBUG : Creating backend with remote "TestDosya:rclone-test-rerixis5tidu" 2026/10/08 02:31:05 DEBUG : Using config file from "/home/rclone/.rclone.conf" 2026/10/08 02:31:06 DEBUG : Creating backend with remote "/tmp/rclone51547680" run.go:198: Remote "dosya.dev root 'rclone-test-rerixis5tidu'", Local "Local file system at /tmp/rclone51547680", Modify Window "1s" both checkfile vs. NFDx2 remote (without normalization) 2026/10/08 02:31:10 ERROR : 測試_Русский___ě_áñ測試_Русский___ě_áñ: sum not found 2026/10/08 02:31:10 ERROR : 測試_Русский___ě_áñ測試_Русский___ě_áñ: file not in dosya.dev root 'rclone-test-rerixis5tidu' 2026/10/08 02:31:10 NOTICE: dosya.dev root 'rclone-test-rerixis5tidu': 1 files missing 2026/10/08 02:31:10 NOTICE: 1 hashes missing 2026/10/08 02:31:10 NOTICE: dosya.dev root 'rclone-test-rerixis5tidu': 1 differences found 2026/10/08 02:31:10 NOTICE: dosya.dev root 'rclone-test-rerixis5tidu': 2 errors while checking both checkfile vs. NFDx2 remote (with normalization) 2026/10/08 02:31:12 DEBUG : 測試_Русский___ě_áñ測試_Русский___ě_áñ: md5 = 65a8e27d8879283831b664bd8b7f0ad4 OK 2026/10/08 02:31:12 NOTICE: dosya.dev root 'rclone-test-rerixis5tidu': 0 differences found 2026/10/08 02:31:12 NOTICE: dosya.dev root 'rclone-test-rerixis5tidu': 1 matching files 2026/10/08 02:31:12 DEBUG : Creating backend with remote "TestDosya:rclone-test-cuyicac4pupi" 2026/10/08 02:31:12 DEBUG : Using config file from "/home/rclone/.rclone.conf" 2026/10/08 02:31:14 DEBUG : Creating backend with remote "/tmp/rclone472969013" run.go:198: Remote "dosya.dev root 'rclone-test-cuyicac4pupi'", Local "Local file system at /tmp/rclone472969013", Modify Window "1s" both checkfile vs. NFCx2 remote (without normalization) 2026/10/08 02:31:18 ERROR : 測試_Русский___ě_áñ測試_Русский___ě_áñ: sum not found 2026/10/08 02:31:18 ERROR : 測試_Русский___ě_áñ測試_Русский___ě_áñ: file not in dosya.dev root 'rclone-test-cuyicac4pupi' 2026/10/08 02:31:18 NOTICE: dosya.dev root 'rclone-test-cuyicac4pupi': 1 files missing 2026/10/08 02:31:18 NOTICE: 1 hashes missing 2026/10/08 02:31:18 NOTICE: dosya.dev root 'rclone-test-cuyicac4pupi': 1 differences found 2026/10/08 02:31:18 NOTICE: dosya.dev root 'rclone-test-cuyicac4pupi': 2 errors while checking both checkfile vs. NFCx2 remote (with normalization) 2026/10/08 02:31:20 DEBUG : 測試_Русский___ě_áñ測試_Русский___ě_áñ: md5 = 65a8e27d8879283831b664bd8b7f0ad4 OK 2026/10/08 02:31:20 NOTICE: dosya.dev root 'rclone-test-cuyicac4pupi': 0 differences found 2026/10/08 02:31:20 NOTICE: dosya.dev root 'rclone-test-cuyicac4pupi': 1 matching files 2026/10/08 02:31:20 DEBUG : dosya.dev root 'rclone-test-cuyicac4pupi': Purge remote 2026/10/08 02:31:23 DEBUG : dosya.dev root 'rclone-test-rerixis5tidu': Purge remote 2026/10/08 02:31:26 DEBUG : dosya.dev root 'rclone-test-mepuzec0xaqu': Purge remote 2026/10/08 02:31:29 DEBUG : dosya.dev root 'rclone-test-gesesop6qalo': Purge remote 2026/10/08 02:31:32 DEBUG : dosya.dev root 'rclone-test-wojopah7bika': Purge remote 2026/10/08 02:31:35 DEBUG : dosya.dev root 'rclone-test-qaxovoh4qiro': Purge remote 2026/10/08 02:31:39 DEBUG : dosya.dev root 'rclone-test-gejexof2kedi': Purge remote 2026/10/08 02:31:42 DEBUG : dosya.dev root 'rclone-test-nizujin5wavo': Purge remote 2026/10/08 02:31:45 DEBUG : dosya.dev root 'rclone-test-yuriyat0vika': Purge remote 2026/10/08 02:31:48 DEBUG : dosya.dev root 'rclone-test-mayutax8boze': Purge remote --- PASS: TestApplyTransforms (107.31s) === RUN TestTruncateString --- PASS: TestTruncateString (0.00s) === RUN TestCopyFile run.go:198: Remote "dosya.dev root 'rclone-test-guqunuq0rise'", Local "Local file system at /tmp/rclone554740044", Modify Window "1s" 2026/10/08 02:31:51 DEBUG : file1: Need to transfer - File not found at Destination 2026/10/08 02:31:55 DEBUG : sub/file2: size = 14 OK 2026/10/08 02:31:55 DEBUG : file1: sha256 = 226e7cfa701fb8ba542d42e0f8bd3090cbbcc9f54d834f361c0ab8c3f4846b72 OK 2026/10/08 02:31:55 INFO : file1: Copied (new) to: sub/file2 2026/10/08 02:31:57 DEBUG : sub/file2: size = 14 OK 2026/10/08 02:31:57 DEBUG : file1: Size and modification time the same (differ by -499.999999ms, within tolerance 1s) 2026/10/08 02:31:57 DEBUG : file1: Unchanged skipping 2026/10/08 02:31:57 DEBUG : dosya.dev root 'rclone-test-guqunuq0rise': don't need to copy/move sub/file2, it is already at target location --- PASS: TestCopyFile (10.83s) === RUN TestCopyFileImmutable run.go:198: Remote "dosya.dev root 'rclone-test-guqunuq0rise'", Local "Local file system at /tmp/rclone554740044", Modify Window "1s" 2026/10/08 02:32:02 DEBUG : existing: Need to transfer - File not found at Destination 2026/10/08 02:32:05 DEBUG : existing: size = 6 OK 2026/10/08 02:32:05 DEBUG : existing: sha256 = e91c254ad58860a02c788dfb5c1a65d6a8846ab1dc649631c7db16fef4af2dec OK 2026/10/08 02:32:05 INFO : existing: Copied (new) 2026/10/08 02:32:06 DEBUG : existing: size = 6 OK 2026/10/08 02:32:06 DEBUG : existing: Size and modification time the same (differ by -499.999999ms, within tolerance 1s) 2026/10/08 02:32:06 DEBUG : existing: Unchanged skipping 2026/10/08 02:32:07 DEBUG : existing: size = 8 (Local file system at /tmp/rclone554740044) 2026/10/08 02:32:07 DEBUG : existing: size = 6 (dosya.dev root 'rclone-test-guqunuq0rise') 2026/10/08 02:32:07 DEBUG : existing: Sizes differ 2026/10/08 02:32:07 ERROR : existing: Source and destination exist but do not match: immutable file modified --- PASS: TestCopyFileImmutable (7.17s) === RUN TestCopyLongFile run.go:198: Remote "dosya.dev root 'rclone-test-guqunuq0rise'", Local "Local file system at /tmp/rclone554740044", Modify Window "1s" copy_test.go:188: Test only runs on local --- SKIP: TestCopyLongFile (0.79s) === RUN TestCopyFileBackupDir run.go:198: Remote "dosya.dev root 'rclone-test-guqunuq0rise'", Local "Local file system at /tmp/rclone554740044", Modify Window "1s" 2026/10/08 02:32:15 DEBUG : Creating backend with remote "TestDosya:rclone-test-guqunuq0rise/backup" 2026/10/08 02:32:15 DEBUG : Config file has changed externally - reloading 2026/10/08 02:32:17 DEBUG : dst/file1: size = 14 (Local file system at /tmp/rclone554740044) 2026/10/08 02:32:17 DEBUG : dst/file1: size = 18 (dosya.dev root 'rclone-test-guqunuq0rise') 2026/10/08 02:32:17 DEBUG : dst/file1: Sizes differ 2026/10/08 02:32:20 INFO : dst/file1: Moved (server-side) 2026/10/08 02:32:23 DEBUG : dst/file1: size = 14 OK 2026/10/08 02:32:23 DEBUG : dst/file1: sha256 = 226e7cfa701fb8ba542d42e0f8bd3090cbbcc9f54d834f361c0ab8c3f4846b72 OK 2026/10/08 02:32:23 INFO : dst/file1: Copied (new) --- PASS: TestCopyFileBackupDir (21.14s) === RUN TestCopyFileCompareDest run.go:198: Remote "dosya.dev root 'rclone-test-guqunuq0rise'", Local "Local file system at /tmp/rclone554740044", Modify Window "1s" 2026/10/08 02:32:31 DEBUG : Creating backend with remote "TestDosya:rclone-test-guqunuq0rise/dst" 2026/10/08 02:32:33 DEBUG : Creating backend with remote "TestDosya:rclone-test-guqunuq0rise/CompareDest" 2026/10/08 02:32:34 DEBUG : one: Need to transfer - File not found at Destination 2026/10/08 02:32:39 DEBUG : one: size = 3 OK 2026/10/08 02:32:39 DEBUG : one: sha256 = 7692c3ad3540bb803c020b3aee66cd8887123234ea0c6e7143c0add73ff431ed OK 2026/10/08 02:32:39 INFO : one: Copied (new) 2026/10/08 02:32:40 DEBUG : one: size = 5 (Local file system at /tmp/rclone554740044) 2026/10/08 02:32:40 DEBUG : one: size = 3 (dosya.dev root 'rclone-test-guqunuq0rise/dst') 2026/10/08 02:32:40 DEBUG : one: Sizes differ 2026/10/08 02:32:44 DEBUG : one: size = 5 OK 2026/10/08 02:32:44 DEBUG : one: sha256 = 2b82f49cc03d076e84d5a393c42909b1fc2227c143ab8f84620f261fa795dec9 OK 2026/10/08 02:32:44 INFO : one: Copied (replaced existing) 2026/10/08 02:32:53 DEBUG : one: size = 5 (Local file system at /tmp/rclone554740044) 2026/10/08 02:32:53 DEBUG : one: size = 3 (dosya.dev root 'rclone-test-guqunuq0rise/dst') 2026/10/08 02:32:53 DEBUG : one: Sizes differ 2026/10/08 02:32:54 DEBUG : one: size = 5 OK 2026/10/08 02:32:54 DEBUG : one: Size and modification time the same (differ by -123.456789ms, within tolerance 1s) 2026/10/08 02:32:54 DEBUG : one: Destination found in --compare-dest, skipping 2026/10/08 02:32:58 DEBUG : two: Need to transfer - File not found at Destination 2026/10/08 02:32:59 DEBUG : two: size = 3 OK 2026/10/08 02:32:59 DEBUG : two: Size and modification time the same (differ by -123.456789ms, within tolerance 1s) 2026/10/08 02:32:59 DEBUG : two: Destination found in --compare-dest, skipping 2026/10/08 02:33:00 DEBUG : two: Need to transfer - File not found at Destination 2026/10/08 02:33:00 DEBUG : two: size = 3 OK 2026/10/08 02:33:00 DEBUG : two: Size and modification time the same (differ by -123.456789ms, within tolerance 1s) 2026/10/08 02:33:00 DEBUG : two: Destination found in --compare-dest, skipping 2026/10/08 02:33:03 DEBUG : two: Need to transfer - File not found at Destination 2026/10/08 02:33:03 DEBUG : two: size = 5 (Local file system at /tmp/rclone554740044) 2026/10/08 02:33:03 DEBUG : two: size = 3 (dosya.dev root 'rclone-test-guqunuq0rise/CompareDest') 2026/10/08 02:33:03 DEBUG : two: Sizes differ 2026/10/08 02:33:06 DEBUG : two: size = 5 OK 2026/10/08 02:33:06 DEBUG : two: sha256 = c271f9e8cacd6ad5a9c26bd5bc26c1eb91d7d64a00a417253a1abf88211bd96d OK 2026/10/08 02:33:06 INFO : two: Copied (new) --- PASS: TestCopyFileCompareDest (43.30s) === RUN TestCopyFileCopyDestImmutable run.go:198: Remote "dosya.dev root 'rclone-test-guqunuq0rise'", Local "Local file system at /tmp/rclone554740044", Modify Window "1s" 2026/10/08 02:33:14 DEBUG : Creating backend with remote "TestDosya:rclone-test-guqunuq0rise/dst" 2026/10/08 02:33:14 DEBUG : Config file has changed externally - reloading 2026/10/08 02:33:25 DEBUG : Creating backend with remote "TestDosya:rclone-test-guqunuq0rise/CopyDest" 2026/10/08 02:33:25 DEBUG : Config file has changed externally - reloading 2026/10/08 02:33:26 DEBUG : one: size = 5 (Local file system at /tmp/rclone554740044) 2026/10/08 02:33:26 DEBUG : one: size = 3 (dosya.dev root 'rclone-test-guqunuq0rise/dst') 2026/10/08 02:33:26 DEBUG : one: Sizes differ 2026/10/08 02:33:27 DEBUG : one: size = 5 OK 2026/10/08 02:33:27 DEBUG : one: Size and modification time the same (differ by -123.456789ms, within tolerance 1s) 2026/10/08 02:33:27 DEBUG : one: size = 5 (Local file system at /tmp/rclone554740044) 2026/10/08 02:33:27 DEBUG : one: size = 3 (dosya.dev root 'rclone-test-guqunuq0rise/dst') 2026/10/08 02:33:27 DEBUG : one: Sizes differ 2026/10/08 02:33:27 ERROR : one: Source and destination exist but do not match: immutable file modified --- PASS: TestCopyFileCopyDestImmutable (18.48s) === RUN TestCopyFileCopyDest run.go:198: Remote "dosya.dev root 'rclone-test-guqunuq0rise'", Local "Local file system at /tmp/rclone554740044", Modify Window "1s" 2026/10/08 02:33:33 DEBUG : Creating backend with remote "TestDosya:rclone-test-guqunuq0rise/dst" 2026/10/08 02:33:35 DEBUG : Creating backend with remote "TestDosya:rclone-test-guqunuq0rise/CopyDest" 2026/10/08 02:33:36 DEBUG : one: Need to transfer - File not found at Destination 2026/10/08 02:33:40 DEBUG : one: size = 3 OK 2026/10/08 02:33:40 DEBUG : one: sha256 = 7692c3ad3540bb803c020b3aee66cd8887123234ea0c6e7143c0add73ff431ed OK 2026/10/08 02:33:40 INFO : one: Copied (new) 2026/10/08 02:33:43 DEBUG : one: size = 5 (Local file system at /tmp/rclone554740044) 2026/10/08 02:33:43 DEBUG : one: size = 3 (dosya.dev root 'rclone-test-guqunuq0rise/dst') 2026/10/08 02:33:43 DEBUG : one: Sizes differ 2026/10/08 02:33:46 DEBUG : one: size = 5 OK 2026/10/08 02:33:46 DEBUG : one: sha256 = 2b82f49cc03d076e84d5a393c42909b1fc2227c143ab8f84620f261fa795dec9 OK 2026/10/08 02:33:46 INFO : one: Copied (replaced existing) 2026/10/08 02:33:55 DEBUG : Creating backend with remote "TestDosya:rclone-test-guqunuq0rise/BackupDir" 2026/10/08 02:33:55 DEBUG : Config file has changed externally - reloading 2026/10/08 02:33:56 DEBUG : one: size = 5 (Local file system at /tmp/rclone554740044) 2026/10/08 02:33:56 DEBUG : one: size = 3 (dosya.dev root 'rclone-test-guqunuq0rise/dst') 2026/10/08 02:33:56 DEBUG : one: Sizes differ 2026/10/08 02:33:57 DEBUG : one: size = 5 OK 2026/10/08 02:33:57 DEBUG : one: Size and modification time the same (differ by -123.456789ms, within tolerance 1s) 2026/10/08 02:33:57 DEBUG : one: size = 5 (Local file system at /tmp/rclone554740044) 2026/10/08 02:33:57 DEBUG : one: size = 3 (dosya.dev root 'rclone-test-guqunuq0rise/dst') 2026/10/08 02:33:57 DEBUG : one: Sizes differ 2026/10/08 02:33:59 INFO : one: Moved (server-side) 2026/10/08 02:34:01 DEBUG : one: size = 5 OK 2026/10/08 02:34:01 DEBUG : one: sha256 = 2b82f49cc03d076e84d5a393c42909b1fc2227c143ab8f84620f261fa795dec9 OK 2026/10/08 02:34:01 INFO : one: Copied (server-side copy) 2026/10/08 02:34:01 DEBUG : one: Destination found in --copy-dest, using server-side copy 2026/10/08 02:34:07 DEBUG : two: Need to transfer - File not found at Destination 2026/10/08 02:34:07 DEBUG : two: size = 3 OK 2026/10/08 02:34:07 DEBUG : two: Size and modification time the same (differ by -123.456789ms, within tolerance 1s) 2026/10/08 02:34:09 DEBUG : two: size = 3 OK 2026/10/08 02:34:09 DEBUG : two: sha256 = 3fc4ccfe745870e2c0d99f71f30ff0656c8dedd41cc1d7d3d376b0dbe685e2f3 OK 2026/10/08 02:34:09 INFO : two: Copied (server-side copy) 2026/10/08 02:34:09 DEBUG : two: Destination found in --copy-dest, using server-side copy 2026/10/08 02:34:11 DEBUG : two: size = 3 OK 2026/10/08 02:34:11 DEBUG : two: Size and modification time the same (differ by -123.456789ms, within tolerance 1s) 2026/10/08 02:34:11 DEBUG : two: Unchanged skipping 2026/10/08 02:34:16 DEBUG : three: Need to transfer - File not found at Destination 2026/10/08 02:34:16 DEBUG : three: size = 7 (Local file system at /tmp/rclone554740044) 2026/10/08 02:34:16 DEBUG : three: size = 5 (dosya.dev root 'rclone-test-guqunuq0rise/CopyDest') 2026/10/08 02:34:16 DEBUG : three: Sizes differ 2026/10/08 02:34:16 DEBUG : three: Destination not found in --copy-dest 2026/10/08 02:34:19 DEBUG : three: size = 7 OK 2026/10/08 02:34:19 DEBUG : three: sha256 = 74d2b88f23f6d270b58d49a4fa650fdb150256812e2c71c98015ef86d6e45eb8 OK 2026/10/08 02:34:19 INFO : three: Copied (new) --- PASS: TestCopyFileCopyDest (59.05s) === RUN TestCopyInplace run.go:198: Remote "dosya.dev root 'rclone-test-guqunuq0rise'", Local "Local file system at /tmp/rclone554740044", Modify Window "1s" copy_test.go:434: Partial uploads not supported --- SKIP: TestCopyInplace (0.78s) === RUN TestCopyLongFileName run.go:198: Remote "dosya.dev root 'rclone-test-guqunuq0rise'", Local "Local file system at /tmp/rclone554740044", Modify Window "1s" copy_test.go:467: Partial uploads not supported --- SKIP: TestCopyLongFileName (0.76s) === RUN TestCopyLongFileNameCollision run.go:198: Remote "dosya.dev root 'rclone-test-guqunuq0rise'", Local "Local file system at /tmp/rclone554740044", Modify Window "1s" copy_test.go:500: Partial uploads not supported --- SKIP: TestCopyLongFileNameCollision (0.78s) === RUN TestCopyFileMaxTransfer run.go:198: Remote "dosya.dev root 'rclone-test-guqunuq0rise'", Local "Local file system at /tmp/rclone554740044", Modify Window "1s" 2026/10/08 02:34:34 DEBUG : TestCopyFileMaxTransfer/file1: Need to transfer - File not found at Destination 2026/10/08 02:34:38 DEBUG : TestCopyFileMaxTransfer/file1: size = 14 OK 2026/10/08 02:34:38 DEBUG : TestCopyFileMaxTransfer/file1: sha256 = 226e7cfa701fb8ba542d42e0f8bd3090cbbcc9f54d834f361c0ab8c3f4846b72 OK 2026/10/08 02:34:38 INFO : TestCopyFileMaxTransfer/file1: Copied (new) 2026/10/08 02:34:40 DEBUG : TestCopyFileMaxTransfer/file2: Need to transfer - File not found at Destination 2026/10/08 02:34:42 ERROR : TestCopyFileMaxTransfer/file2: Failed to copy: couldn't upload file: Put "https://api.dosya.dev/api/upload/upl_ws_B6cFhQW4cTQXWGyLCkNg3_ao4QyjZqwec49rULVwMKL": max transfer limit reached as set by --max-transfer 2026/10/08 02:34:43 DEBUG : TestCopyFileMaxTransfer/file3: Need to transfer - File not found at Destination 2026/10/08 02:34:44 DEBUG : TestCopyFileMaxTransfer/file4: Need to transfer - File not found at Destination 2026/10/08 02:34:47 DEBUG : TestCopyFileMaxTransfer/file4: size = 2062 OK 2026/10/08 02:34:47 DEBUG : TestCopyFileMaxTransfer/file4: sha256 = 54e5549b884e0f9b9f365f97d631e9fc8afdb0fad1091f9b4b24824ddf2f01b7 OK 2026/10/08 02:34:47 INFO : TestCopyFileMaxTransfer/file4: Copied (new) --- PASS: TestCopyFileMaxTransfer (17.37s) === RUN TestDeduplicateInteractive run.go:198: Remote "dosya.dev root 'rclone-test-guqunuq0rise'", Local "Local file system at /tmp/rclone554740044", Modify Window "1s" dedupe_test.go:25: Can't test deduplicate - no duplicate files possible --- SKIP: TestDeduplicateInteractive (0.75s) === RUN TestDeduplicateSkip run.go:198: Remote "dosya.dev root 'rclone-test-guqunuq0rise'", Local "Local file system at /tmp/rclone554740044", Modify Window "1s" dedupe_test.go:25: Can't test deduplicate - no duplicate files possible --- SKIP: TestDeduplicateSkip (0.77s) === RUN TestDeduplicateSizeOnly run.go:198: Remote "dosya.dev root 'rclone-test-guqunuq0rise'", Local "Local file system at /tmp/rclone554740044", Modify Window "1s" dedupe_test.go:25: Can't test deduplicate - no duplicate files possible --- SKIP: TestDeduplicateSizeOnly (0.78s) === RUN TestDeduplicateFirst run.go:198: Remote "dosya.dev root 'rclone-test-guqunuq0rise'", Local "Local file system at /tmp/rclone554740044", Modify Window "1s" dedupe_test.go:25: Can't test deduplicate - no duplicate files possible --- SKIP: TestDeduplicateFirst (0.77s) === RUN TestDeduplicateNewest run.go:198: Remote "dosya.dev root 'rclone-test-guqunuq0rise'", Local "Local file system at /tmp/rclone554740044", Modify Window "1s" dedupe_test.go:25: Can't test deduplicate - no duplicate files possible --- SKIP: TestDeduplicateNewest (0.75s) === RUN TestDeduplicateNewestByHash run.go:198: Remote "dosya.dev root 'rclone-test-guqunuq0rise'", Local "Local file system at /tmp/rclone554740044", Modify Window "1s" 2026/10/08 02:35:09 INFO : dosya.dev root 'rclone-test-guqunuq0rise': Looking for duplicate sha256 hashes using newest mode. 2026/10/08 02:35:10 NOTICE: bf017ad4e53a5e2794b782a49dcca3da762624d7543ba5fc60f0bc131f9f7b0d: Found 3 files with duplicate sha256 hashes 2026/10/08 02:35:11 INFO : one: Deleted 2026/10/08 02:35:11 INFO : also/one: Deleted 2026/10/08 02:35:11 NOTICE: bf017ad4e53a5e2794b782a49dcca3da762624d7543ba5fc60f0bc131f9f7b0d: Deleted 2 extra copies --- PASS: TestDeduplicateNewestByHash (21.50s) === RUN TestDeduplicateOldest run.go:198: Remote "dosya.dev root 'rclone-test-guqunuq0rise'", Local "Local file system at /tmp/rclone554740044", Modify Window "1s" dedupe_test.go:25: Can't test deduplicate - no duplicate files possible --- SKIP: TestDeduplicateOldest (0.78s) === RUN TestDeduplicateLargest run.go:198: Remote "dosya.dev root 'rclone-test-guqunuq0rise'", Local "Local file system at /tmp/rclone554740044", Modify Window "1s" dedupe_test.go:25: Can't test deduplicate - no duplicate files possible --- SKIP: TestDeduplicateLargest (0.76s) === RUN TestDeduplicateSmallest run.go:198: Remote "dosya.dev root 'rclone-test-guqunuq0rise'", Local "Local file system at /tmp/rclone554740044", Modify Window "1s" dedupe_test.go:25: Can't test deduplicate - no duplicate files possible --- SKIP: TestDeduplicateSmallest (0.76s) === RUN TestDeduplicateRename run.go:198: Remote "dosya.dev root 'rclone-test-guqunuq0rise'", Local "Local file system at /tmp/rclone554740044", Modify Window "1s" dedupe_test.go:25: Can't test deduplicate - no duplicate files possible --- SKIP: TestDeduplicateRename (0.79s) === RUN TestDeduplicateRenameManyExisting run.go:198: Remote "dosya.dev root 'rclone-test-guqunuq0rise'", Local "Local file system at /tmp/rclone554740044", Modify Window "1s" dedupe_test.go:25: Can't test deduplicate - no duplicate files possible --- SKIP: TestDeduplicateRenameManyExisting (0.75s) === RUN TestMergeDirs run.go:198: Remote "dosya.dev root 'rclone-test-guqunuq0rise'", Local "Local file system at /tmp/rclone554740044", Modify Window "1s" dedupe_test.go:294: Can't merge directories --- SKIP: TestMergeDirs (0.78s) === RUN TestIndex run.go:198: Remote "dosya.dev root 'rclone-test-guqunuq0rise'", Local "Local file system at /tmp/rclone554740044", Modify Window "1s" 2026/10/08 02:35:36 DEBUG : sub/deep/index.html: size = 12087 OK 2026/10/08 02:35:36 DEBUG : sub/deep/index.html: sha256 = d075ac57eedcce5bc43d0b4d45bc9ec64c95d830633cc1a4280b023d19c89419 OK 2026/10/08 02:35:36 INFO : sub/deep/index.html: Copied (new) 2026/10/08 02:35:36 DEBUG : index.html: size = 12147 OK 2026/10/08 02:35:36 DEBUG : index.html: sha256 = 6e737c30c6c8500cb95410b8e395291ffa3cd851bcc716e582cb76fce95daa3a OK 2026/10/08 02:35:36 INFO : index.html: Copied (new) 2026/10/08 02:35:36 DEBUG : caddy.json: size = 259 OK 2026/10/08 02:35:36 DEBUG : caddy.json: sha256 = 78542ea78b9d090f83c9bbe0a255a8552d7d9c95292cd51de4666848e2b5a527 OK 2026/10/08 02:35:36 INFO : caddy.json: Copied (new) 2026/10/08 02:35:37 DEBUG : index.json: size = 213 OK 2026/10/08 02:35:37 DEBUG : index.json: sha256 = 3ae0df74c47f5d5502fff5a24c7ccd6ee4efaa0a44c749e6690964e93b466ef3 OK 2026/10/08 02:35:37 INFO : index.json: Copied (new) 2026/10/08 02:35:39 DEBUG : sub/deep/index.json: size = 119 OK 2026/10/08 02:35:39 DEBUG : sub/deep/index.json: sha256 = d84a31e48b510d081192617ac638adfa55c2b344b799384c3a67913018fd5551 OK 2026/10/08 02:35:39 INFO : sub/deep/index.json: Copied (new) 2026/10/08 02:35:39 DEBUG : sub/index.json: size = 215 OK 2026/10/08 02:35:39 DEBUG : sub/index.json: sha256 = 7c502193aea1582eccb55bae5e547012761204f92c7a2af4d4df5d5204f2ca27 OK 2026/10/08 02:35:39 INFO : sub/index.json: Copied (new) 2026/10/08 02:35:39 DEBUG : sub/index.html: size = 12306 OK 2026/10/08 02:35:39 DEBUG : sub/index.html: sha256 = 952a0b142ce7f5724ffb644b1135b5b38e5ca9834ae4f3688cddb8067dfa81d0 OK 2026/10/08 02:35:39 INFO : sub/index.html: Copied (new) 2026/10/08 02:35:39 DEBUG : sub/deep/caddy.json: size = 131 OK 2026/10/08 02:35:39 DEBUG : sub/deep/caddy.json: sha256 = bef7da4011923b2ea208ce42c69f4445729580f36a2e8687c95427803f32633e OK 2026/10/08 02:35:39 INFO : sub/deep/caddy.json: Copied (new) 2026/10/08 02:35:42 DEBUG : sub/caddy.json: size = 261 OK 2026/10/08 02:35:42 DEBUG : sub/caddy.json: sha256 = b575291703ff8db902ac3c7f47c287acae00cb3d2bf4556beb98234e3da42dcc OK 2026/10/08 02:35:42 INFO : sub/caddy.json: Copied (new) 2026/10/08 02:35:53 DEBUG : index.html: sha256 = 6e737c30c6c8500cb95410b8e395291ffa3cd851bcc716e582cb76fce95daa3a OK 2026/10/08 02:35:53 DEBUG : index.html: Unchanged skipping 2026/10/08 02:35:53 DEBUG : sub/deep/index.html: sha256 = d075ac57eedcce5bc43d0b4d45bc9ec64c95d830633cc1a4280b023d19c89419 OK 2026/10/08 02:35:53 DEBUG : sub/deep/index.html: Unchanged skipping 2026/10/08 02:35:53 DEBUG : sub/index.html: sha256 = 952a0b142ce7f5724ffb644b1135b5b38e5ca9834ae4f3688cddb8067dfa81d0 OK 2026/10/08 02:35:53 DEBUG : sub/index.html: Unchanged skipping 2026/10/08 02:35:53 DEBUG : index.json: sha256 = 3ae0df74c47f5d5502fff5a24c7ccd6ee4efaa0a44c749e6690964e93b466ef3 OK 2026/10/08 02:35:53 DEBUG : index.json: Unchanged skipping 2026/10/08 02:35:53 DEBUG : sub/deep/index.json: sha256 = d84a31e48b510d081192617ac638adfa55c2b344b799384c3a67913018fd5551 OK 2026/10/08 02:35:53 DEBUG : sub/deep/index.json: Unchanged skipping 2026/10/08 02:35:53 DEBUG : sub/index.json: sha256 = 7c502193aea1582eccb55bae5e547012761204f92c7a2af4d4df5d5204f2ca27 OK 2026/10/08 02:35:53 DEBUG : sub/index.json: Unchanged skipping 2026/10/08 02:35:53 DEBUG : caddy.json: sha256 = 78542ea78b9d090f83c9bbe0a255a8552d7d9c95292cd51de4666848e2b5a527 OK 2026/10/08 02:35:53 DEBUG : caddy.json: Unchanged skipping 2026/10/08 02:35:53 DEBUG : sub/deep/caddy.json: sha256 = bef7da4011923b2ea208ce42c69f4445729580f36a2e8687c95427803f32633e OK 2026/10/08 02:35:53 DEBUG : sub/deep/caddy.json: Unchanged skipping 2026/10/08 02:35:53 DEBUG : sub/caddy.json: sha256 = b575291703ff8db902ac3c7f47c287acae00cb3d2bf4556beb98234e3da42dcc OK 2026/10/08 02:35:53 DEBUG : sub/caddy.json: Unchanged skipping 2026/10/08 02:35:57 DEBUG : index.html: size = 12147 OK 2026/10/08 02:35:57 DEBUG : index.html: sha256 = 6e737c30c6c8500cb95410b8e395291ffa3cd851bcc716e582cb76fce95daa3a OK 2026/10/08 02:35:57 INFO : index.html: Copied (replaced existing) 2026/10/08 02:35:57 DEBUG : caddy.json: size = 259 OK 2026/10/08 02:35:57 DEBUG : caddy.json: sha256 = 78542ea78b9d090f83c9bbe0a255a8552d7d9c95292cd51de4666848e2b5a527 OK 2026/10/08 02:35:57 INFO : caddy.json: Copied (replaced existing) 2026/10/08 02:35:57 DEBUG : sub/deep/index.html: size = 12087 OK 2026/10/08 02:35:57 DEBUG : sub/deep/index.html: sha256 = d075ac57eedcce5bc43d0b4d45bc9ec64c95d830633cc1a4280b023d19c89419 OK 2026/10/08 02:35:57 INFO : sub/deep/index.html: Copied (replaced existing) 2026/10/08 02:35:57 DEBUG : index.json: size = 213 OK 2026/10/08 02:35:57 DEBUG : index.json: sha256 = 3ae0df74c47f5d5502fff5a24c7ccd6ee4efaa0a44c749e6690964e93b466ef3 OK 2026/10/08 02:35:57 INFO : index.json: Copied (replaced existing) 2026/10/08 02:36:00 DEBUG : sub/deep/index.json: size = 119 OK 2026/10/08 02:36:00 DEBUG : sub/deep/index.json: sha256 = d84a31e48b510d081192617ac638adfa55c2b344b799384c3a67913018fd5551 OK 2026/10/08 02:36:00 INFO : sub/deep/index.json: Copied (replaced existing) 2026/10/08 02:36:00 DEBUG : sub/index.html: size = 12306 OK 2026/10/08 02:36:00 DEBUG : sub/index.html: sha256 = 952a0b142ce7f5724ffb644b1135b5b38e5ca9834ae4f3688cddb8067dfa81d0 OK 2026/10/08 02:36:00 INFO : sub/index.html: Copied (replaced existing) 2026/10/08 02:36:00 DEBUG : sub/deep/caddy.json: size = 131 OK 2026/10/08 02:36:00 DEBUG : sub/deep/caddy.json: sha256 = bef7da4011923b2ea208ce42c69f4445729580f36a2e8687c95427803f32633e OK 2026/10/08 02:36:00 INFO : sub/deep/caddy.json: Copied (replaced existing) 2026/10/08 02:36:00 DEBUG : sub/index.json: size = 215 OK 2026/10/08 02:36:00 DEBUG : sub/index.json: sha256 = 7c502193aea1582eccb55bae5e547012761204f92c7a2af4d4df5d5204f2ca27 OK 2026/10/08 02:36:00 INFO : sub/index.json: Copied (replaced existing) 2026/10/08 02:36:02 DEBUG : sub/caddy.json: size = 261 OK 2026/10/08 02:36:02 DEBUG : sub/caddy.json: sha256 = b575291703ff8db902ac3c7f47c287acae00cb3d2bf4556beb98234e3da42dcc OK 2026/10/08 02:36:02 INFO : sub/caddy.json: Copied (replaced existing) 2026/10/08 02:36:06 DEBUG : index.html: sha256 = 6e737c30c6c8500cb95410b8e395291ffa3cd851bcc716e582cb76fce95daa3a OK 2026/10/08 02:36:06 DEBUG : index.html: Unchanged skipping 2026/10/08 02:36:06 DEBUG : index.json: sha256 = 3ae0df74c47f5d5502fff5a24c7ccd6ee4efaa0a44c749e6690964e93b466ef3 OK 2026/10/08 02:36:06 DEBUG : index.json: Unchanged skipping 2026/10/08 02:36:06 DEBUG : caddy.json: sha256 = 78542ea78b9d090f83c9bbe0a255a8552d7d9c95292cd51de4666848e2b5a527 OK 2026/10/08 02:36:06 DEBUG : caddy.json: Unchanged skipping 2026/10/08 02:36:06 DEBUG : sub/index.html: sha256 = 952a0b142ce7f5724ffb644b1135b5b38e5ca9834ae4f3688cddb8067dfa81d0 OK 2026/10/08 02:36:06 DEBUG : sub/index.html: Unchanged skipping 2026/10/08 02:36:06 DEBUG : sub/index.json: sha256 = 7c502193aea1582eccb55bae5e547012761204f92c7a2af4d4df5d5204f2ca27 OK 2026/10/08 02:36:06 DEBUG : sub/index.json: Unchanged skipping 2026/10/08 02:36:06 DEBUG : sub/caddy.json: sha256 = b575291703ff8db902ac3c7f47c287acae00cb3d2bf4556beb98234e3da42dcc OK 2026/10/08 02:36:06 DEBUG : sub/caddy.json: Unchanged skipping 2026/10/08 02:36:09 DEBUG : sub/deep/caddy.json: size = 260 OK 2026/10/08 02:36:09 DEBUG : sub/deep/caddy.json: sha256 = ce9b3a1a6f1f6b466f18b4296b4f83ac2d071b6c96622b72f4a53f82195b0e8d OK 2026/10/08 02:36:09 INFO : sub/deep/caddy.json: Copied (replaced existing) 2026/10/08 02:36:09 DEBUG : sub/deep/index.json: size = 235 OK 2026/10/08 02:36:09 DEBUG : sub/deep/index.json: sha256 = 666d190b138d45f6112aced9f5cae5871f1bcdeba06a1acaeca481dd027f4e02 OK 2026/10/08 02:36:09 INFO : sub/deep/index.json: Copied (replaced existing) 2026/10/08 02:36:09 DEBUG : sub/deep/index.html: size = 12346 OK 2026/10/08 02:36:09 DEBUG : sub/deep/index.html: sha256 = 4a8e41162bdbfa70b38a8cb976b665a6a14a0a8e18ee173536fca64d235ffe64 OK 2026/10/08 02:36:09 INFO : sub/deep/index.html: Copied (replaced existing) 2026/10/08 02:36:15 NOTICE: sub/deep/caddy.json: Skipped copy as --dry-run is set (size 389) 2026/10/08 02:36:15 DEBUG : index.html: sha256 = 6e737c30c6c8500cb95410b8e395291ffa3cd851bcc716e582cb76fce95daa3a OK 2026/10/08 02:36:15 DEBUG : index.html: Unchanged skipping 2026/10/08 02:36:15 DEBUG : index.json: sha256 = 3ae0df74c47f5d5502fff5a24c7ccd6ee4efaa0a44c749e6690964e93b466ef3 OK 2026/10/08 02:36:15 DEBUG : index.json: Unchanged skipping 2026/10/08 02:36:15 NOTICE: sub/deep/index.html: Skipped copy as --dry-run is set (size 12.309Ki) 2026/10/08 02:36:15 DEBUG : sub/index.html: sha256 = 952a0b142ce7f5724ffb644b1135b5b38e5ca9834ae4f3688cddb8067dfa81d0 OK 2026/10/08 02:36:15 DEBUG : sub/index.html: Unchanged skipping 2026/10/08 02:36:15 DEBUG : caddy.json: sha256 = 78542ea78b9d090f83c9bbe0a255a8552d7d9c95292cd51de4666848e2b5a527 OK 2026/10/08 02:36:15 DEBUG : caddy.json: Unchanged skipping 2026/10/08 02:36:15 NOTICE: sub/deep/index.json: Skipped copy as --dry-run is set (size 351) 2026/10/08 02:36:15 DEBUG : sub/index.json: sha256 = 7c502193aea1582eccb55bae5e547012761204f92c7a2af4d4df5d5204f2ca27 OK 2026/10/08 02:36:15 DEBUG : sub/index.json: Unchanged skipping 2026/10/08 02:36:15 DEBUG : sub/caddy.json: sha256 = b575291703ff8db902ac3c7f47c287acae00cb3d2bf4556beb98234e3da42dcc OK 2026/10/08 02:36:15 DEBUG : sub/caddy.json: Unchanged skipping --- PASS: TestIndex (73.41s) === RUN TestIndexDelete run.go:198: Remote "dosya.dev root 'rclone-test-guqunuq0rise'", Local "Local file system at /tmp/rclone554740044", Modify Window "1s" 2026/10/08 02:36:49 DEBUG : sub/deep/index.html: size = 12087 OK 2026/10/08 02:36:49 DEBUG : sub/deep/index.html: sha256 = d075ac57eedcce5bc43d0b4d45bc9ec64c95d830633cc1a4280b023d19c89419 OK 2026/10/08 02:36:49 INFO : sub/deep/index.html: Copied (new) 2026/10/08 02:36:49 DEBUG : index.html: size = 12147 OK 2026/10/08 02:36:49 DEBUG : index.html: sha256 = 6e737c30c6c8500cb95410b8e395291ffa3cd851bcc716e582cb76fce95daa3a OK 2026/10/08 02:36:49 INFO : index.html: Copied (new) 2026/10/08 02:36:49 DEBUG : sub/index.html: size = 12306 OK 2026/10/08 02:36:49 DEBUG : sub/index.html: sha256 = 952a0b142ce7f5724ffb644b1135b5b38e5ca9834ae4f3688cddb8067dfa81d0 OK 2026/10/08 02:36:49 INFO : sub/index.html: Copied (new) 2026/10/08 02:36:52 DEBUG : index.html: sha256 = 6e737c30c6c8500cb95410b8e395291ffa3cd851bcc716e582cb76fce95daa3a OK 2026/10/08 02:36:52 DEBUG : index.html: Unchanged skipping 2026/10/08 02:36:52 DEBUG : sub/index.html: sha256 = 952a0b142ce7f5724ffb644b1135b5b38e5ca9834ae4f3688cddb8067dfa81d0 OK 2026/10/08 02:36:52 DEBUG : sub/index.html: Unchanged skipping 2026/10/08 02:36:55 DEBUG : sub/deep/index.html: size = 11829 OK 2026/10/08 02:36:55 DEBUG : sub/deep/index.html: sha256 = 75e7ec8fcd1eee87a86b4807e4097a246ed4424df133b5837b6a826adcf3b420 OK 2026/10/08 02:36:55 INFO : sub/deep/index.html: Copied (replaced existing) --- PASS: TestIndexDelete (33.92s) === RUN TestIndexFilter run.go:198: Remote "dosya.dev root 'rclone-test-guqunuq0rise'", Local "Local file system at /tmp/rclone554740044", Modify Window "1s" 2026/10/08 02:37:27 DEBUG : other/notes.md: Excluded (Path Filter) 2026/10/08 02:37:30 DEBUG : sub/index.html: size = 12056 OK 2026/10/08 02:37:30 DEBUG : sub/index.html: sha256 = 171d90c4d490efc0eeecf12f5fe22294a35b97588628ce315fb89f51d7a9fef4 OK 2026/10/08 02:37:30 INFO : sub/index.html: Copied (new) 2026/10/08 02:37:30 DEBUG : index.html: size = 12399 OK 2026/10/08 02:37:30 DEBUG : index.html: sha256 = 32b41286f2fe2dcc8a7925db857fdd7237e790d0be6c3cd7d167b00832019f70 OK 2026/10/08 02:37:30 INFO : index.html: Copied (new) 2026/10/08 02:37:31 DEBUG : other/index.html: size = 11802 OK 2026/10/08 02:37:31 DEBUG : other/index.html: sha256 = c1ee3cb7d019dbf25527f497340d12cd4927b5db9fedb12f675841805d3dc0fe OK 2026/10/08 02:37:31 INFO : other/index.html: Copied (new) 2026/10/08 02:37:40 DEBUG : other/notes.md: Excluded (Path Filter) 2026/10/08 02:37:41 DEBUG : index.html: sha256 = 32b41286f2fe2dcc8a7925db857fdd7237e790d0be6c3cd7d167b00832019f70 OK 2026/10/08 02:37:41 DEBUG : index.html: Unchanged skipping 2026/10/08 02:37:41 DEBUG : sub/index.html: sha256 = 171d90c4d490efc0eeecf12f5fe22294a35b97588628ce315fb89f51d7a9fef4 OK 2026/10/08 02:37:41 DEBUG : sub/index.html: Unchanged skipping 2026/10/08 02:37:41 DEBUG : other/index.html: sha256 = c1ee3cb7d019dbf25527f497340d12cd4927b5db9fedb12f675841805d3dc0fe OK 2026/10/08 02:37:41 DEBUG : other/index.html: Unchanged skipping --- PASS: TestIndexFilter (44.17s) === RUN TestIndexRules run.go:198: Remote "dosya.dev root 'rclone-test-guqunuq0rise'", Local "Local file system at /tmp/rclone554740044", Modify Window "1s" 2026/10/08 02:38:10 DEBUG : sub/index.html: size = 12306 OK 2026/10/08 02:38:10 DEBUG : sub/index.html: sha256 = 952a0b142ce7f5724ffb644b1135b5b38e5ca9834ae4f3688cddb8067dfa81d0 OK 2026/10/08 02:38:10 INFO : sub/index.html: Copied (new) 2026/10/08 02:38:10 DEBUG : index.html: size = 12147 OK 2026/10/08 02:38:10 DEBUG : index.html: sha256 = 6e737c30c6c8500cb95410b8e395291ffa3cd851bcc716e582cb76fce95daa3a OK 2026/10/08 02:38:10 INFO : index.html: Copied (new) 2026/10/08 02:38:18 DEBUG : sub/index.html: sha256 = 952a0b142ce7f5724ffb644b1135b5b38e5ca9834ae4f3688cddb8067dfa81d0 OK 2026/10/08 02:38:18 DEBUG : sub/index.html: Unchanged skipping 2026/10/08 02:38:21 DEBUG : sub/deep/index.html: size = 12087 OK 2026/10/08 02:38:21 DEBUG : sub/deep/index.html: sha256 = d075ac57eedcce5bc43d0b4d45bc9ec64c95d830633cc1a4280b023d19c89419 OK 2026/10/08 02:38:21 INFO : sub/deep/index.html: Copied (replaced existing) --- PASS: TestIndexRules (39.73s) === RUN TestIndexMaxDepth run.go:198: Remote "dosya.dev root 'rclone-test-guqunuq0rise'", Local "Local file system at /tmp/rclone554740044", Modify Window "1s" 2026/10/08 02:38:47 DEBUG : index.html: size = 12147 OK 2026/10/08 02:38:47 DEBUG : index.html: sha256 = 6e737c30c6c8500cb95410b8e395291ffa3cd851bcc716e582cb76fce95daa3a OK 2026/10/08 02:38:47 INFO : index.html: Copied (new) --- PASS: TestIndexMaxDepth (25.24s) === RUN TestIndexLinkIndex run.go:198: Remote "dosya.dev root 'rclone-test-guqunuq0rise'", Local "Local file system at /tmp/rclone554740044", Modify Window "1s" 2026/10/08 02:39:12 DEBUG : index.html: size = 12167 OK 2026/10/08 02:39:12 DEBUG : index.html: sha256 = 22e049ee81b3c7f2d74d670fa70e3f38e5ff2b4a520cabe98e4d3b166c9dcb03 OK 2026/10/08 02:39:12 INFO : index.html: Copied (new) 2026/10/08 02:39:12 DEBUG : sub/deep/index.html: size = 12128 OK 2026/10/08 02:39:12 DEBUG : sub/deep/index.html: sha256 = e158e42c0998f58ac6e306958c3234dff674847de594a535da66fdcfc25d1410 OK 2026/10/08 02:39:12 INFO : sub/deep/index.html: Copied (new) 2026/10/08 02:39:12 DEBUG : sub/index.html: size = 12347 OK 2026/10/08 02:39:12 DEBUG : sub/index.html: sha256 = 899fa25128465e9f8bb54a58b4e5c256377cbab2b0924b79f20042b2d6038997 OK 2026/10/08 02:39:12 INFO : sub/index.html: Copied (new) --- PASS: TestIndexLinkIndex (27.92s) === RUN TestIndexDirTime run.go:198: Remote "dosya.dev root 'rclone-test-guqunuq0rise'", Local "Local file system at /tmp/rclone554740044", Modify Window "1s" 2026/10/08 02:39:41 DEBUG : index.json: size = 253 OK 2026/10/08 02:39:41 DEBUG : index.json: sha256 = 1655d20ca369a4b209a72edaf3c190e07aea9ee8d92d17af6f8a88c223d00f96 OK 2026/10/08 02:39:41 INFO : index.json: Copied (new) 2026/10/08 02:39:41 DEBUG : sub/deep/index.json: size = 139 OK 2026/10/08 02:39:41 DEBUG : sub/deep/index.json: sha256 = 1495af764ce57300e75e7e2e0a8b1f07685d835566ffa1338731a0a736a0462b OK 2026/10/08 02:39:41 INFO : sub/deep/index.json: Copied (new) 2026/10/08 02:39:41 DEBUG : sub/index.json: size = 255 OK 2026/10/08 02:39:41 DEBUG : sub/index.json: sha256 = 4a2cfbcde0129d5638f06fb4f0dffaccaf1b6bb5fb899cba9d7b2cf45c4ab3b2 OK 2026/10/08 02:39:41 INFO : sub/index.json: Copied (new) 2026/10/08 02:39:45 DEBUG : sub/deep/index.json: sha256 = 1495af764ce57300e75e7e2e0a8b1f07685d835566ffa1338731a0a736a0462b OK 2026/10/08 02:39:45 DEBUG : sub/deep/index.json: Unchanged skipping 2026/10/08 02:39:47 DEBUG : sub/index.json: size = 235 OK 2026/10/08 02:39:47 DEBUG : sub/index.json: sha256 = 82547b67776c6a4c49c949b5b8077d30d2bb4002ad0f2b2f48cfbae3cb647463 OK 2026/10/08 02:39:47 INFO : sub/index.json: Copied (replaced existing) 2026/10/08 02:39:48 DEBUG : index.json: size = 233 OK 2026/10/08 02:39:48 DEBUG : index.json: sha256 = 3477e35c00f4f8a18c98792901d55f6af4eddca7af6b4ce35060c842777e4cde OK 2026/10/08 02:39:48 INFO : index.json: Copied (replaced existing) 2026/10/08 02:39:54 DEBUG : sub/deep/index.json: size = 119 OK 2026/10/08 02:39:54 DEBUG : sub/deep/index.json: sha256 = d84a31e48b510d081192617ac638adfa55c2b344b799384c3a67913018fd5551 OK 2026/10/08 02:39:54 INFO : sub/deep/index.json: Copied (replaced existing) 2026/10/08 02:39:54 DEBUG : index.json: size = 213 OK 2026/10/08 02:39:54 DEBUG : index.json: sha256 = 3ae0df74c47f5d5502fff5a24c7ccd6ee4efaa0a44c749e6690964e93b466ef3 OK 2026/10/08 02:39:54 INFO : index.json: Copied (replaced existing) 2026/10/08 02:39:54 DEBUG : sub/index.json: size = 215 OK 2026/10/08 02:39:54 DEBUG : sub/index.json: sha256 = 7c502193aea1582eccb55bae5e547012761204f92c7a2af4d4df5d5204f2ca27 OK 2026/10/08 02:39:54 INFO : sub/index.json: Copied (replaced existing) --- PASS: TestIndexDirTime (39.54s) === RUN TestIndexTemplate run.go:198: Remote "dosya.dev root 'rclone-test-guqunuq0rise'", Local "Local file system at /tmp/rclone554740044", Modify Window "1s" 2026/10/08 02:40:20 DEBUG : list.txt: size = 59 OK 2026/10/08 02:40:20 DEBUG : list.txt: sha256 = da4c98923434c8f9441b2843e106cdc9f64c4320cce9981a3fda1fdf8ec61779 OK 2026/10/08 02:40:20 INFO : list.txt: Copied (new) 2026/10/08 02:40:20 DEBUG : sub/deep/list.txt: size = 47 OK 2026/10/08 02:40:20 DEBUG : sub/deep/list.txt: sha256 = b5cc19d00d1a83e6acfeac54d971aff44bf8179abb504802d71763ee531fbf7c OK 2026/10/08 02:40:20 INFO : sub/deep/list.txt: Copied (new) 2026/10/08 02:40:20 DEBUG : sub/list.txt: size = 64 OK 2026/10/08 02:40:20 DEBUG : sub/list.txt: sha256 = 711ae34b6d75f1f2d5cb69c8c3b6bb3e9740333babdf11607a797674d97d6bfc OK 2026/10/08 02:40:20 INFO : sub/list.txt: Copied (new) --- PASS: TestIndexTemplate (26.72s) === RUN TestIndexTemplateBuiltin --- PASS: TestIndexTemplateBuiltin (0.00s) === RUN TestRcIndex rc_test.go:31: Skipping test on non local remote --- SKIP: TestRcIndex (0.00s) === RUN TestIndexNoHash index_test.go:385: Skipping test on non local remote --- SKIP: TestIndexNoHash (0.00s) === RUN TestIndexChanged run.go:198: Remote "dosya.dev root 'rclone-test-guqunuq0rise'", Local "Local file system at /tmp/rclone554740044", Modify Window "1s" 2026/10/08 02:40:51 DEBUG : sub/index.html: size = 12306 OK 2026/10/08 02:40:51 DEBUG : sub/index.html: sha256 = 952a0b142ce7f5724ffb644b1135b5b38e5ca9834ae4f3688cddb8067dfa81d0 OK 2026/10/08 02:40:51 INFO : sub/index.html: Copied (new) 2026/10/08 02:40:51 DEBUG : other/index.html: size = 12058 OK 2026/10/08 02:40:51 DEBUG : other/index.html: sha256 = 33357cc8b5cd1587eb77ec41787d10dfb497ab3c930f25e88be9dd4b6bb5cefc OK 2026/10/08 02:40:51 INFO : other/index.html: Copied (new) 2026/10/08 02:40:51 DEBUG : sub/deep/index.html: size = 12087 OK 2026/10/08 02:40:51 DEBUG : sub/deep/index.html: sha256 = d075ac57eedcce5bc43d0b4d45bc9ec64c95d830633cc1a4280b023d19c89419 OK 2026/10/08 02:40:51 INFO : sub/deep/index.html: Copied (new) 2026/10/08 02:40:51 DEBUG : index.html: size = 12399 OK 2026/10/08 02:40:51 DEBUG : index.html: sha256 = 32b41286f2fe2dcc8a7925db857fdd7237e790d0be6c3cd7d167b00832019f70 OK 2026/10/08 02:40:51 INFO : index.html: Copied (new) 2026/10/08 02:40:57 INFO : dosya.dev root 'rclone-test-guqunuq0rise': Partial index: listing 3 directories and walking 0 changed directories 2026/10/08 02:40:58 DEBUG : index.html: sha256 = 32b41286f2fe2dcc8a7925db857fdd7237e790d0be6c3cd7d167b00832019f70 OK 2026/10/08 02:40:58 DEBUG : index.html: Unchanged skipping 2026/10/08 02:40:58 DEBUG : sub/index.html: sha256 = 952a0b142ce7f5724ffb644b1135b5b38e5ca9834ae4f3688cddb8067dfa81d0 OK 2026/10/08 02:40:58 DEBUG : sub/index.html: Unchanged skipping 2026/10/08 02:41:01 DEBUG : sub/deep/index.html: size = 12346 OK 2026/10/08 02:41:01 DEBUG : sub/deep/index.html: sha256 = 4a8e41162bdbfa70b38a8cb976b665a6a14a0a8e18ee173536fca64d235ffe64 OK 2026/10/08 02:41:01 INFO : sub/deep/index.html: Copied (replaced existing) 2026/10/08 02:41:09 INFO : dosya.dev root 'rclone-test-guqunuq0rise': Partial index: listing 3 directories and walking 0 changed directories 2026/10/08 02:41:10 DEBUG : index.html: sha256 = 32b41286f2fe2dcc8a7925db857fdd7237e790d0be6c3cd7d167b00832019f70 OK 2026/10/08 02:41:10 DEBUG : index.html: Unchanged skipping 2026/10/08 02:41:12 DEBUG : sub/new/index.html: size = 12085 OK 2026/10/08 02:41:12 DEBUG : sub/new/index.html: sha256 = 59d869a7275630d37b9f4e009f0b756eedd2b52add5e78c799d158523d9b33a9 OK 2026/10/08 02:41:12 INFO : sub/new/index.html: Copied (new) 2026/10/08 02:41:13 DEBUG : sub/index.html: size = 12554 OK 2026/10/08 02:41:13 DEBUG : sub/index.html: sha256 = e7a24c78542e9cef96a811de2d4933bce63af115a3a765ad1163819336027c85 OK 2026/10/08 02:41:13 INFO : sub/index.html: Copied (replaced existing) 2026/10/08 02:41:19 INFO : dosya.dev root 'rclone-test-guqunuq0rise': Partial index: listing 1 directories and walking 1 changed directories 2026/10/08 02:41:20 DEBUG : index.html: sha256 = 32b41286f2fe2dcc8a7925db857fdd7237e790d0be6c3cd7d167b00832019f70 OK 2026/10/08 02:41:20 DEBUG : index.html: Unchanged skipping 2026/10/08 02:41:23 DEBUG : other/index.html: size = 12597 OK 2026/10/08 02:41:23 DEBUG : other/index.html: sha256 = 316f93b5642b045fde11cbe31f1eb6fde8fd41c8580121b8b8b57c62f01db4ca OK 2026/10/08 02:41:23 INFO : other/index.html: Copied (replaced existing) 2026/10/08 02:41:28 INFO : dosya.dev root 'rclone-test-guqunuq0rise': Partial index: listing 1 directories and walking 0 changed directories 2026/10/08 02:41:29 DEBUG : index.html: sha256 = 32b41286f2fe2dcc8a7925db857fdd7237e790d0be6c3cd7d167b00832019f70 OK 2026/10/08 02:41:29 DEBUG : index.html: Unchanged skipping 2026/10/08 02:41:31 DEBUG : other/index.html: size = 12867 OK 2026/10/08 02:41:31 DEBUG : other/index.html: sha256 = acc811fa0d905d42302cc375401000ca5840c36886a2fd8a62dec4d78b59d473 OK 2026/10/08 02:41:31 INFO : other/index.html: Copied (replaced existing) 2026/10/08 02:41:37 INFO : dosya.dev root 'rclone-test-guqunuq0rise': Nothing changed so nothing to index 2026/10/08 02:41:38 INFO : dosya.dev root 'rclone-test-guqunuq0rise': Root changed so doing a full index 2026/10/08 02:41:40 DEBUG : index.html: sha256 = 32b41286f2fe2dcc8a7925db857fdd7237e790d0be6c3cd7d167b00832019f70 OK 2026/10/08 02:41:40 DEBUG : index.html: Unchanged skipping 2026/10/08 02:41:40 DEBUG : sub/new/index.html: sha256 = 59d869a7275630d37b9f4e009f0b756eedd2b52add5e78c799d158523d9b33a9 OK 2026/10/08 02:41:40 DEBUG : sub/new/index.html: Unchanged skipping 2026/10/08 02:41:40 DEBUG : sub/deep/index.html: sha256 = 4a8e41162bdbfa70b38a8cb976b665a6a14a0a8e18ee173536fca64d235ffe64 OK 2026/10/08 02:41:40 DEBUG : sub/deep/index.html: Unchanged skipping 2026/10/08 02:41:40 DEBUG : other/index.html: sha256 = acc811fa0d905d42302cc375401000ca5840c36886a2fd8a62dec4d78b59d473 OK 2026/10/08 02:41:40 DEBUG : other/index.html: Unchanged skipping 2026/10/08 02:41:43 DEBUG : sub/index.html: size = 12813 OK 2026/10/08 02:41:43 DEBUG : sub/index.html: sha256 = 49bac59527dc84127be3ee216017981785936decaecccac68d9e9ea3b6aeba12 OK 2026/10/08 02:41:43 INFO : sub/index.html: Copied (replaced existing) 2026/10/08 02:41:47 INFO : dosya.dev root 'rclone-test-guqunuq0rise': Partial index would list 2 directories, more than 1, so doing a full index 2026/10/08 02:41:49 DEBUG : index.html: sha256 = 32b41286f2fe2dcc8a7925db857fdd7237e790d0be6c3cd7d167b00832019f70 OK 2026/10/08 02:41:49 DEBUG : index.html: Unchanged skipping 2026/10/08 02:41:49 DEBUG : sub/new/index.html: sha256 = 59d869a7275630d37b9f4e009f0b756eedd2b52add5e78c799d158523d9b33a9 OK 2026/10/08 02:41:49 DEBUG : sub/new/index.html: Unchanged skipping 2026/10/08 02:41:49 DEBUG : sub/deep/index.html: sha256 = 4a8e41162bdbfa70b38a8cb976b665a6a14a0a8e18ee173536fca64d235ffe64 OK 2026/10/08 02:41:49 DEBUG : sub/deep/index.html: Unchanged skipping 2026/10/08 02:41:49 DEBUG : other/index.html: sha256 = acc811fa0d905d42302cc375401000ca5840c36886a2fd8a62dec4d78b59d473 OK 2026/10/08 02:41:49 DEBUG : other/index.html: Unchanged skipping 2026/10/08 02:41:52 DEBUG : sub/index.html: size = 13071 OK 2026/10/08 02:41:52 DEBUG : sub/index.html: sha256 = 79a3078fc4c4596040cd2044c40da4bcee938019ef441b4281629f5783e408c4 OK 2026/10/08 02:41:52 INFO : sub/index.html: Copied (replaced existing) 2026/10/08 02:41:56 INFO : dosya.dev root 'rclone-test-guqunuq0rise': Partial index: listing 1 directories and walking 1 changed directories 2026/10/08 02:41:58 DEBUG : index.html: sha256 = 32b41286f2fe2dcc8a7925db857fdd7237e790d0be6c3cd7d167b00832019f70 OK 2026/10/08 02:41:58 DEBUG : index.html: Unchanged skipping 2026/10/08 02:41:58 DEBUG : sub/new/index.html: sha256 = 59d869a7275630d37b9f4e009f0b756eedd2b52add5e78c799d158523d9b33a9 OK 2026/10/08 02:41:58 DEBUG : sub/new/index.html: Unchanged skipping 2026/10/08 02:41:58 DEBUG : sub/index.html: sha256 = 79a3078fc4c4596040cd2044c40da4bcee938019ef441b4281629f5783e408c4 OK 2026/10/08 02:41:58 DEBUG : sub/index.html: Unchanged skipping 2026/10/08 02:42:00 DEBUG : sub/deep/index.html: size = 12604 OK 2026/10/08 02:42:00 DEBUG : sub/deep/index.html: sha256 = df88bf63da3c878024945d9aefa897607f1f26e2fcd7cbc7b9c1c553958d2af8 OK 2026/10/08 02:42:00 INFO : sub/deep/index.html: Copied (replaced existing) 2026/10/08 02:42:08 INFO : dosya.dev root 'rclone-test-guqunuq0rise': Partial index: listing 2 directories and walking 0 changed directories 2026/10/08 02:42:09 DEBUG : index.html: sha256 = 32b41286f2fe2dcc8a7925db857fdd7237e790d0be6c3cd7d167b00832019f70 OK 2026/10/08 02:42:09 DEBUG : index.html: Unchanged skipping 2026/10/08 02:42:11 DEBUG : sub/index.html: size = 13331 OK 2026/10/08 02:42:11 DEBUG : sub/index.html: sha256 = a8ce84a8b07aef0636b75e88d9e41b03deddaa53e4ed4d149a95ad46ff3a576f OK 2026/10/08 02:42:11 INFO : sub/index.html: Copied (replaced existing) --- PASS: TestIndexChanged (128.49s) === RUN TestIndexChangedDelete run.go:198: Remote "dosya.dev root 'rclone-test-guqunuq0rise'", Local "Local file system at /tmp/rclone554740044", Modify Window "1s" 2026/10/08 02:42:56 DEBUG : sub/deep/index.html: size = 12087 OK 2026/10/08 02:42:56 DEBUG : sub/deep/index.html: sha256 = d075ac57eedcce5bc43d0b4d45bc9ec64c95d830633cc1a4280b023d19c89419 OK 2026/10/08 02:42:56 INFO : sub/deep/index.html: Copied (new) 2026/10/08 02:42:56 DEBUG : sub/index.html: size = 12306 OK 2026/10/08 02:42:56 DEBUG : sub/index.html: sha256 = 952a0b142ce7f5724ffb644b1135b5b38e5ca9834ae4f3688cddb8067dfa81d0 OK 2026/10/08 02:42:56 INFO : sub/index.html: Copied (new) 2026/10/08 02:42:56 DEBUG : index.html: size = 12147 OK 2026/10/08 02:42:56 DEBUG : index.html: sha256 = 6e737c30c6c8500cb95410b8e395291ffa3cd851bcc716e582cb76fce95daa3a OK 2026/10/08 02:42:56 INFO : index.html: Copied (new) 2026/10/08 02:42:57 INFO : dosya.dev root 'rclone-test-guqunuq0rise': Partial index: listing 3 directories and walking 0 changed directories 2026/10/08 02:42:58 DEBUG : index.html: sha256 = 6e737c30c6c8500cb95410b8e395291ffa3cd851bcc716e582cb76fce95daa3a OK 2026/10/08 02:42:58 DEBUG : index.html: Unchanged skipping 2026/10/08 02:42:58 DEBUG : sub/index.html: sha256 = 952a0b142ce7f5724ffb644b1135b5b38e5ca9834ae4f3688cddb8067dfa81d0 OK 2026/10/08 02:42:58 DEBUG : sub/index.html: Unchanged skipping 2026/10/08 02:43:01 DEBUG : sub/deep/index.html: size = 11829 OK 2026/10/08 02:43:01 DEBUG : sub/deep/index.html: sha256 = 75e7ec8fcd1eee87a86b4807e4097a246ed4424df133b5837b6a826adcf3b420 OK 2026/10/08 02:43:01 INFO : sub/deep/index.html: Copied (replaced existing) --- PASS: TestIndexChangedDelete (31.31s) === RUN TestIndexChangedFiles run.go:198: Remote "dosya.dev root 'rclone-test-guqunuq0rise'", Local "Local file system at /tmp/rclone554740044", Modify Window "1s" 2026/10/08 02:43:31 DEBUG : sub/deep/index.html: size = 12087 OK 2026/10/08 02:43:31 DEBUG : sub/deep/index.html: sha256 = d075ac57eedcce5bc43d0b4d45bc9ec64c95d830633cc1a4280b023d19c89419 OK 2026/10/08 02:43:31 INFO : sub/deep/index.html: Copied (new) 2026/10/08 02:43:31 DEBUG : index.html: size = 12401 OK 2026/10/08 02:43:31 DEBUG : index.html: sha256 = 04b6c2a793db0f7f76a6e2039282bd13b68485ecb20212c45d388590217cafd6 OK 2026/10/08 02:43:31 INFO : index.html: Copied (new) 2026/10/08 02:43:31 DEBUG : - odd/index.html: size = 12058 OK 2026/10/08 02:43:31 DEBUG : - odd/index.html: sha256 = c64ad8961bf8ce1bceae8f251f27b5301c944a824c7d41d50615872ede4f90ec OK 2026/10/08 02:43:31 INFO : - odd/index.html: Copied (new) 2026/10/08 02:43:31 DEBUG : sub/index.html: size = 12306 OK 2026/10/08 02:43:31 DEBUG : sub/index.html: sha256 = 952a0b142ce7f5724ffb644b1135b5b38e5ca9834ae4f3688cddb8067dfa81d0 OK 2026/10/08 02:43:31 INFO : sub/index.html: Copied (new) 2026/10/08 02:43:38 INFO : dosya.dev root 'rclone-test-guqunuq0rise': Partial index: listing 2 directories and walking 0 changed directories 2026/10/08 02:43:39 DEBUG : index.html: sha256 = 04b6c2a793db0f7f76a6e2039282bd13b68485ecb20212c45d388590217cafd6 OK 2026/10/08 02:43:39 DEBUG : index.html: Unchanged skipping 2026/10/08 02:43:41 DEBUG : - odd/index.html: size = 12316 OK 2026/10/08 02:43:41 DEBUG : - odd/index.html: sha256 = 0e98f3d333f328e214f0482013bfaf6d4452e22b251907588a26e16470a9a3e6 OK 2026/10/08 02:43:41 INFO : - odd/index.html: Copied (replaced existing) 2026/10/08 02:43:45 INFO : dosya.dev root 'rclone-test-guqunuq0rise': Partial index: listing 4 directories and walking 0 changed directories 2026/10/08 02:43:47 DEBUG : index.html: sha256 = 04b6c2a793db0f7f76a6e2039282bd13b68485ecb20212c45d388590217cafd6 OK 2026/10/08 02:43:47 DEBUG : index.html: Unchanged skipping 2026/10/08 02:43:47 DEBUG : sub/deep/index.html: sha256 = d075ac57eedcce5bc43d0b4d45bc9ec64c95d830633cc1a4280b023d19c89419 OK 2026/10/08 02:43:47 DEBUG : sub/deep/index.html: Unchanged skipping 2026/10/08 02:43:47 DEBUG : - odd/index.html: sha256 = 0e98f3d333f328e214f0482013bfaf6d4452e22b251907588a26e16470a9a3e6 OK 2026/10/08 02:43:47 DEBUG : - odd/index.html: Unchanged skipping 2026/10/08 02:43:50 DEBUG : sub/index.html: size = 12565 OK 2026/10/08 02:43:50 DEBUG : sub/index.html: sha256 = b9300e5f1f462eeac6921887217d500796a3ee9292e45e3c966de195d3d1baed OK 2026/10/08 02:43:50 INFO : sub/index.html: Copied (replaced existing) --- PASS: TestIndexChangedFiles (54.61s) === RUN TestIndexChangedDirTime run.go:198: Remote "dosya.dev root 'rclone-test-guqunuq0rise'", Local "Local file system at /tmp/rclone554740044", Modify Window "1s" 2026/10/08 02:44:25 DEBUG : index.json: size = 371 OK 2026/10/08 02:44:25 DEBUG : index.json: sha256 = cdd6c6870a99cb26a585d092d832f54253f0489e60c4c73178f5a7520bc9833a OK 2026/10/08 02:44:25 INFO : index.json: Copied (new) 2026/10/08 02:44:25 DEBUG : sub/index.json: size = 255 OK 2026/10/08 02:44:25 DEBUG : sub/index.json: sha256 = 4a2cfbcde0129d5638f06fb4f0dffaccaf1b6bb5fb899cba9d7b2cf45c4ab3b2 OK 2026/10/08 02:44:25 INFO : sub/index.json: Copied (new) 2026/10/08 02:44:25 DEBUG : other/index.json: size = 140 OK 2026/10/08 02:44:25 DEBUG : other/index.json: sha256 = 4052a474a2243fea405a7945370471ca0ab856abd0ddcd521773c320c03fcca8 OK 2026/10/08 02:44:25 INFO : other/index.json: Copied (new) 2026/10/08 02:44:25 DEBUG : sub/deep/index.json: size = 139 OK 2026/10/08 02:44:25 DEBUG : sub/deep/index.json: sha256 = 1495af764ce57300e75e7e2e0a8b1f07685d835566ffa1338731a0a736a0462b OK 2026/10/08 02:44:25 INFO : sub/deep/index.json: Copied (new) 2026/10/08 02:44:28 INFO : dosya.dev root 'rclone-test-guqunuq0rise': Partial index: listing 3 directories and walking 0 changed directories 2026/10/08 02:44:29 DEBUG : sub/index.json: sha256 = ae9c0d78d4d5e0672022af8ef47a4abe5f9c861fd84b98c4a5ec9d90c0a4b82a (memory) 2026/10/08 02:44:29 DEBUG : sub/index.json: sha256 = 4a2cfbcde0129d5638f06fb4f0dffaccaf1b6bb5fb899cba9d7b2cf45c4ab3b2 (dosya.dev root 'rclone-test-guqunuq0rise') 2026/10/08 02:44:29 DEBUG : index.json: sha256 = abda7ae37a2cffd2daaa8b17a2493f4652c5ee2806852892cf9d4a92ed68f735 (memory) 2026/10/08 02:44:29 DEBUG : index.json: sha256 = cdd6c6870a99cb26a585d092d832f54253f0489e60c4c73178f5a7520bc9833a (dosya.dev root 'rclone-test-guqunuq0rise') 2026/10/08 02:44:32 DEBUG : sub/deep/index.json: size = 275 OK 2026/10/08 02:44:32 DEBUG : sub/deep/index.json: sha256 = d18248e8abd36f22ad95785eb7630fee252b33061d33b372beb321def8b15601 OK 2026/10/08 02:44:32 INFO : sub/deep/index.json: Copied (replaced existing) 2026/10/08 02:44:32 DEBUG : sub/index.json: size = 255 OK 2026/10/08 02:44:32 DEBUG : sub/index.json: sha256 = ae9c0d78d4d5e0672022af8ef47a4abe5f9c861fd84b98c4a5ec9d90c0a4b82a OK 2026/10/08 02:44:32 INFO : sub/index.json: Copied (replaced existing) 2026/10/08 02:44:33 DEBUG : index.json: size = 371 OK 2026/10/08 02:44:33 DEBUG : index.json: sha256 = abda7ae37a2cffd2daaa8b17a2493f4652c5ee2806852892cf9d4a92ed68f735 OK 2026/10/08 02:44:33 INFO : index.json: Copied (replaced existing) fstest.go:128: Error Trace: /home/rclone/go/src/github.com/rclone/rclone/fstest/fstest.go:128 /home/rclone/go/src/github.com/rclone/rclone/fs/operations/index_test.go:560 Error: Should be true Test: TestIndexChangedDirTime Messages: sub: Modification time difference too big |28341h15m34s| > 1s (want 2030-01-01 00:00:00 +0000 UTC vs got 2026-10-08 02:44:26 +0000 UTC) (precision 1s) --- FAIL: TestIndexChangedDirTime (42.01s) === RUN TestListDirSorted run.go:198: Remote "dosya.dev root 'rclone-test-guqunuq0rise'", Local "Local file system at /tmp/rclone554740044", Modify Window "1s" 2026/10/08 02:45:15 DEBUG : a.txt: Excluded (Size Filter) 2026/10/08 02:45:15 DEBUG : a.txt: Excluded 2026/10/08 02:45:16 DEBUG : sub dir/hello world: Excluded (Size Filter) 2026/10/08 02:45:16 DEBUG : sub dir/hello world: Excluded 2026/10/08 02:45:16 DEBUG : sub dir/hello world2: Excluded (Size Filter) 2026/10/08 02:45:16 DEBUG : sub dir/hello world2: Excluded 2026/10/08 02:45:16 DEBUG : sub dir/ignore dir: Excluded 2026/10/08 02:45:17 DEBUG : sub dir/hello world: Excluded (Size Filter) 2026/10/08 02:45:17 DEBUG : sub dir/hello world: Excluded 2026/10/08 02:45:17 DEBUG : sub dir/hello world2: Excluded (Size Filter) 2026/10/08 02:45:17 DEBUG : sub dir/hello world2: Excluded 2026/10/08 02:45:17 DEBUG : sub dir/ignore dir: Excluded --- PASS: TestListDirSorted (41.60s) === RUN TestListDirSortedFn run.go:198: Remote "dosya.dev root 'rclone-test-guqunuq0rise'", Local "Local file system at /tmp/rclone554740044", Modify Window "1s" 2026/10/08 02:45:56 DEBUG : a.txt: Excluded (Size Filter) 2026/10/08 02:45:56 DEBUG : a.txt: Excluded 2026/10/08 02:45:56 DEBUG : sub dir/hello world: Excluded (Size Filter) 2026/10/08 02:45:56 DEBUG : sub dir/hello world: Excluded 2026/10/08 02:45:56 DEBUG : sub dir/hello world2: Excluded (Size Filter) 2026/10/08 02:45:56 DEBUG : sub dir/hello world2: Excluded 2026/10/08 02:45:57 DEBUG : sub dir/ignore dir: Excluded 2026/10/08 02:45:58 DEBUG : sub dir/hello world: Excluded (Size Filter) 2026/10/08 02:45:58 DEBUG : sub dir/hello world: Excluded 2026/10/08 02:45:58 DEBUG : sub dir/hello world2: Excluded (Size Filter) 2026/10/08 02:45:58 DEBUG : sub dir/hello world2: Excluded 2026/10/08 02:45:58 DEBUG : sub dir/ignore dir: Excluded --- PASS: TestListDirSortedFn (40.82s) === RUN TestListJSON run.go:198: Remote "dosya.dev root 'rclone-test-guqunuq0rise'", Local "Local file system at /tmp/rclone554740044", Modify Window "1s" === RUN TestListJSON/Default === RUN TestListJSON/FilesOnly === RUN TestListJSON/DirsOnly === RUN TestListJSON/Recurse === RUN TestListJSON/SubDir === RUN TestListJSON/NoModTime === RUN TestListJSON/NoMimeType === RUN TestListJSON/ShowHash === RUN TestListJSON/HashTypes 2026/10/08 02:46:22 ERROR : file1: Failed to read hash: hash type not supported === RUN TestListJSON/Metadata --- PASS: TestListJSON (16.29s) --- PASS: TestListJSON/Default (0.39s) --- PASS: TestListJSON/FilesOnly (0.40s) --- PASS: TestListJSON/DirsOnly (0.39s) --- PASS: TestListJSON/Recurse (0.77s) --- PASS: TestListJSON/SubDir (0.40s) --- PASS: TestListJSON/NoModTime (0.40s) --- PASS: TestListJSON/NoMimeType (0.39s) --- PASS: TestListJSON/ShowHash (0.38s) --- PASS: TestListJSON/HashTypes (0.39s) --- PASS: TestListJSON/Metadata (0.40s) === RUN TestStatJSON run.go:198: Remote "dosya.dev root 'rclone-test-guqunuq0rise'", Local "Local file system at /tmp/rclone554740044", Modify Window "1s" === RUN TestStatJSON/Root === RUN TestStatJSON/RootFilesOnly === RUN TestStatJSON/RootDirsOnly === RUN TestStatJSON/Dir === RUN TestStatJSON/DirWithTrailingSlash === RUN TestStatJSON/File === RUN TestStatJSON/NotFound === RUN TestStatJSON/DirFilesOnly === RUN TestStatJSON/FileFilesOnly === RUN TestStatJSON/NotFoundFilesOnly === RUN TestStatJSON/DirDirsOnly === RUN TestStatJSON/FileDirsOnly === RUN TestStatJSON/NotFoundDirsOnly === RUN TestStatJSON/RootNotFound 2026/10/08 02:46:40 DEBUG : Creating backend with remote "TestDosya:rclone-test-guqunuq0rise/notfound" 2026/10/08 02:46:40 DEBUG : Config file has changed externally - reloading --- PASS: TestStatJSON (19.72s) --- PASS: TestStatJSON/Root (0.39s) --- PASS: TestStatJSON/RootFilesOnly (0.00s) --- PASS: TestStatJSON/RootDirsOnly (0.37s) --- PASS: TestStatJSON/Dir (0.77s) --- PASS: TestStatJSON/DirWithTrailingSlash (0.40s) --- PASS: TestStatJSON/File (0.39s) --- PASS: TestStatJSON/NotFound (1.10s) --- PASS: TestStatJSON/DirFilesOnly (0.38s) --- PASS: TestStatJSON/FileFilesOnly (0.38s) --- PASS: TestStatJSON/NotFoundFilesOnly (0.39s) --- PASS: TestStatJSON/DirDirsOnly (0.37s) --- PASS: TestStatJSON/FileDirsOnly (0.37s) --- PASS: TestStatJSON/NotFoundDirsOnly (0.40s) --- PASS: TestStatJSON/RootNotFound (2.07s) === RUN TestStatJSONMemory 2026/10/08 02:46:47 DEBUG : Creating backend with remote ":memory:" 2026/10/08 02:46:47 DEBUG : Memory root '': File to upload is small (5 bytes), uploading instead of streaming 2026/10/08 02:46:47 DEBUG : sub/file1: size = 5 OK 2026/10/08 02:46:47 DEBUG : sub/file1: md5 = 5d41402abc4b2a76b9719d911017c592 OK 2026/10/08 02:46:47 DEBUG : sub/file1: Size and md5 of src and dst objects identical === RUN TestStatJSONMemory/Dir === RUN TestStatJSONMemory/DirWithTrailingSlash === RUN TestStatJSONMemory/File === RUN TestStatJSONMemory/NotFound --- PASS: TestStatJSONMemory (0.00s) --- PASS: TestStatJSONMemory/Dir (0.00s) --- PASS: TestStatJSONMemory/DirWithTrailingSlash (0.00s) --- PASS: TestStatJSONMemory/File (0.00s) --- PASS: TestStatJSONMemory/NotFound (0.00s) === RUN TestStatJSONConfinement --- PASS: TestStatJSONConfinement (0.00s) === RUN TestMkdir run.go:198: Remote "dosya.dev root 'rclone-test-guqunuq0rise'", Local "Local file system at /tmp/rclone554740044", Modify Window "1s" 2026/10/08 02:46:47 INFO : dosya.dev root 'rclone-test-guqunuq0rise': Making directory 2026/10/08 02:46:47 INFO : dosya.dev root 'rclone-test-guqunuq0rise': Making directory --- PASS: TestMkdir (1.18s) === RUN TestLsd run.go:198: Remote "dosya.dev root 'rclone-test-guqunuq0rise'", Local "Local file system at /tmp/rclone554740044", Modify Window "1s" --- PASS: TestLsd (8.45s) === RUN TestLs run.go:198: Remote "dosya.dev root 'rclone-test-guqunuq0rise'", Local "Local file system at /tmp/rclone554740044", Modify Window "1s" --- PASS: TestLs (9.05s) === RUN TestLsWithFilesFrom run.go:198: Remote "dosya.dev root 'rclone-test-guqunuq0rise'", Local "Local file system at /tmp/rclone554740044", Modify Window "1s" 2026/10/08 02:47:12 DEBUG : empty space: Excluded (FilesFrom Filter) 2026/10/08 02:47:12 DEBUG : empty space: Excluded --- PASS: TestLsWithFilesFrom (10.02s) === RUN TestLsLong run.go:198: Remote "dosya.dev root 'rclone-test-guqunuq0rise'", Local "Local file system at /tmp/rclone554740044", Modify Window "1s" --- PASS: TestLsLong (9.51s) === RUN TestHashSums run.go:198: Remote "dosya.dev root 'rclone-test-guqunuq0rise'", Local "Local file system at /tmp/rclone554740044", Modify Window "1s" --- PASS: TestHashSums (9.77s) === RUN TestHashSumsWithErrors 2026/10/08 02:47:35 DEBUG : Creating backend with remote ":memory:" 2026/10/08 02:47:35 ERROR : sub/file1: hash unsupported: hash type not supported 2026/10/08 02:47:35 ERROR : file1: hash unsupported: hash type not supported 2026/10/08 02:47:35 ERROR : file1: hash unsupported: hash type not supported --- PASS: TestHashSumsWithErrors (0.00s) === RUN TestHashStream 2026/10/08 02:47:35 DEBUG : Creating md5 hash of 0 bytes read from input stream 2026/10/08 02:47:35 DEBUG : Creating md5 hash of 0 bytes read from input stream 2026/10/08 02:47:35 DEBUG : Creating sha1 hash of 0 bytes read from input stream 2026/10/08 02:47:35 DEBUG : Creating sha1 hash of 0 bytes read from input stream 2026/10/08 02:47:35 DEBUG : Creating md5 hash of 12 bytes read from input stream 2026/10/08 02:47:35 DEBUG : Creating md5 hash of 12 bytes read from input stream 2026/10/08 02:47:35 DEBUG : Creating sha1 hash of 12 bytes read from input stream 2026/10/08 02:47:35 DEBUG : Creating sha1 hash of 12 bytes read from input stream --- PASS: TestHashStream (0.00s) === RUN TestSuffixName --- PASS: TestSuffixName (0.00s) === RUN TestCount run.go:198: Remote "dosya.dev root 'rclone-test-guqunuq0rise'", Local "Local file system at /tmp/rclone554740044", Modify Window "1s" --- PASS: TestCount (15.65s) === RUN TestDelete run.go:198: Remote "dosya.dev root 'rclone-test-guqunuq0rise'", Local "Local file system at /tmp/rclone554740044", Modify Window "1s" 2026/10/08 02:47:59 DEBUG : Waiting for deletions to finish 2026/10/08 02:48:00 DEBUG : large: Excluded (Size Filter) 2026/10/08 02:48:00 DEBUG : large: Excluded 2026/10/08 02:48:01 INFO : medium: Deleted 2026/10/08 02:48:01 INFO : small: Deleted --- PASS: TestDelete (12.19s) === RUN TestDeleteFatalError run.go:198: Remote "dosya.dev root 'rclone-test-guqunuq0rise'", Local "Local file system at /tmp/rclone554740044", Modify Window "1s" 2026/10/08 02:49:01 DEBUG : Waiting for deletions to finish 2026/10/08 02:49:01 ERROR : file1: Got fatal error on delete: --max-delete threshold reached 2026/10/08 02:49:01 ERROR : file10: Got fatal error on delete: --max-delete threshold reached 2026/10/08 02:49:01 ERROR : file0: Got fatal error on delete: --max-delete threshold reached 2026/10/08 02:49:01 ERROR : file12: Got fatal error on delete: --max-delete threshold reached 2026/10/08 02:49:01 ERROR : file11: Got fatal error on delete: --max-delete threshold reached 2026/10/08 02:49:01 ERROR : file14: Got fatal error on delete: --max-delete threshold reached 2026/10/08 02:49:01 ERROR : file13: Got fatal error on delete: --max-delete threshold reached 2026/10/08 02:49:01 ERROR : file16: Got fatal error on delete: --max-delete threshold reached 2026/10/08 02:49:01 ERROR : file17: Got fatal error on delete: --max-delete threshold reached 2026/10/08 02:49:01 ERROR : file18: Got fatal error on delete: --max-delete threshold reached 2026/10/08 02:49:01 ERROR : file19: Got fatal error on delete: --max-delete threshold reached 2026/10/08 02:49:01 ERROR : file2: Got fatal error on delete: --max-delete threshold reached 2026/10/08 02:49:01 ERROR : file3: Got fatal error on delete: --max-delete threshold reached 2026/10/08 02:49:01 ERROR : file4: Got fatal error on delete: --max-delete threshold reached 2026/10/08 02:49:01 ERROR : file5: Got fatal error on delete: --max-delete threshold reached 2026/10/08 02:49:01 ERROR : file15: Got fatal error on delete: --max-delete threshold reached 2026/10/08 02:49:01 ERROR : file7: Got fatal error on delete: --max-delete threshold reached 2026/10/08 02:49:01 ERROR : file8: Got fatal error on delete: --max-delete threshold reached 2026/10/08 02:49:01 ERROR : file9: Got fatal error on delete: --max-delete threshold reached 2026/10/08 02:49:01 ERROR : file6: Got fatal error on delete: --max-delete threshold reached --- PASS: TestDeleteFatalError (76.94s) === RUN TestMaxDelete run.go:198: Remote "dosya.dev root 'rclone-test-guqunuq0rise'", Local "Local file system at /tmp/rclone554740044", Modify Window "1s" 2026/10/08 02:49:29 DEBUG : Waiting for deletions to finish 2026/10/08 02:49:30 ERROR : small: Got fatal error on delete: --max-delete threshold reached 2026/10/08 02:49:30 INFO : large: Deleted 2026/10/08 02:49:31 INFO : medium: Deleted --- PASS: TestMaxDelete (13.60s) === RUN TestMaxDeleteSizeLargeFile run.go:198: Remote "dosya.dev root 'rclone-test-guqunuq0rise'", Local "Local file system at /tmp/rclone554740044", Modify Window "1s" 2026/10/08 02:49:43 DEBUG : Waiting for deletions to finish 2026/10/08 02:49:43 ERROR : large: Got fatal error on delete: --max-delete-size threshold reached 2026/10/08 02:49:44 INFO : small: Deleted 2026/10/08 02:49:44 INFO : medium: Deleted --- PASS: TestMaxDeleteSizeLargeFile (13.81s) === RUN TestMaxDeleteSize run.go:198: Remote "dosya.dev root 'rclone-test-guqunuq0rise'", Local "Local file system at /tmp/rclone554740044", Modify Window "1s" 2026/10/08 02:49:56 DEBUG : Waiting for deletions to finish 2026/10/08 02:49:56 ERROR : medium: Got fatal error on delete: --max-delete-size threshold reached 2026/10/08 02:49:57 INFO : large: Deleted 2026/10/08 02:49:57 INFO : small: Deleted --- PASS: TestMaxDeleteSize (12.83s) === RUN TestReadFile run.go:198: Remote "dosya.dev root 'rclone-test-guqunuq0rise'", Local "Local file system at /tmp/rclone554740044", Modify Window "1s" --- PASS: TestReadFile (7.59s) === RUN TestRetry 2026/10/08 02:50:07 DEBUG : Received error: Wrapped EOF is retriable: EOF - low level retry 1/5 2026/10/08 02:50:07 DEBUG : Received error: Wrapped EOF is retriable: EOF - low level retry 2/5 2026/10/08 02:50:07 DEBUG : Sleeping for 10ms (as indicated by the server) to obey Retry-After error: BANG: trying again in 10ms 2026/10/08 02:50:07 DEBUG : Sleeping for 10ms (as indicated by the server) to obey Retry-After error: BANG: trying again in 10ms 2026/10/08 02:50:07 DEBUG : Sleeping for 10ms (as indicated by the server) to obey Retry-After error: BANG: trying again in 10ms 2026/10/08 02:50:07 DEBUG : Sleeping for 10ms (as indicated by the server) to obey Retry-After error: BANG: trying again in 10ms --- PASS: TestRetry (0.04s) === RUN TestRetryAfterContextCancel 2026/10/08 02:50:08 DEBUG : Sleeping for 1h0m0s (as indicated by the server) to obey Retry-After error: BANG: trying again in 1h0m0s --- PASS: TestRetryAfterContextCancel (0.00s) === RUN TestRetryAfterLastTry --- PASS: TestRetryAfterLastTry (0.00s) === RUN TestCat run.go:198: Remote "dosya.dev root 'rclone-test-guqunuq0rise'", Local "Local file system at /tmp/rclone554740044", Modify Window "1s" --- PASS: TestCat (26.08s) === RUN TestPurge 2026/10/08 02:50:34 DEBUG : Creating backend with remote "TestDosya:rclone-test-wuheqob1yolu" 2026/10/08 02:50:34 DEBUG : Using config file from "/home/rclone/.rclone.conf" 2026/10/08 02:50:35 DEBUG : Creating backend with remote "/tmp/rclone3687255470" run.go:198: Remote "dosya.dev root 'rclone-test-wuheqob1yolu'", Local "Local file system at /tmp/rclone3687255470", Modify Window "1s" 2026/10/08 02:50:41 INFO : A2: Making directory 2026/10/08 02:50:42 INFO : A1/B2: Making directory 2026/10/08 02:50:43 INFO : A1/B2/C2: Making directory 2026/10/08 02:50:43 INFO : A1/B1/C3: Making directory 2026/10/08 02:50:44 INFO : A3: Making directory 2026/10/08 02:50:45 INFO : A3/B3: Making directory 2026/10/08 02:50:46 INFO : A3/B3/C4: Making directory 2026/10/08 02:50:59 ERROR : error listing: directory not found 2026/10/08 02:50:59 DEBUG : dosya.dev root 'rclone-test-wuheqob1yolu': Purge remote 2026/10/08 02:50:59 NOTICE: purge failed: directory not found --- PASS: TestPurge (25.70s) === RUN TestRmdirsNoLeaveRoot run.go:198: Remote "dosya.dev root 'rclone-test-guqunuq0rise'", Local "Local file system at /tmp/rclone554740044", Modify Window "1s" 2026/10/08 02:51:04 INFO : A2: Making directory 2026/10/08 02:51:05 INFO : A1/B2: Making directory 2026/10/08 02:51:06 INFO : A1/B2/C2: Making directory 2026/10/08 02:51:07 INFO : A1/B1/C3: Making directory 2026/10/08 02:51:08 INFO : A3: Making directory 2026/10/08 02:51:09 INFO : A3/B3: Making directory 2026/10/08 02:51:09 INFO : A3/B3/C4: Making directory 2026/10/08 02:51:15 DEBUG : removing 1 level 3 directories 2026/10/08 02:51:15 INFO : A3/B3/C4: Removing directory 2026/10/08 02:51:20 DEBUG : removing 2 level 3 directories 2026/10/08 02:51:20 INFO : A1/B2/C2: Removing directory 2026/10/08 02:51:20 INFO : A1/B1/C3: Removing directory 2026/10/08 02:51:22 DEBUG : removing 2 level 2 directories 2026/10/08 02:51:22 INFO : A3/B3: Removing directory 2026/10/08 02:51:22 INFO : A1/B2: Removing directory 2026/10/08 02:51:23 DEBUG : removing 2 level 1 directories 2026/10/08 02:51:23 INFO : A3: Removing directory 2026/10/08 02:51:23 INFO : A2: Removing directory 2026/10/08 02:51:30 DEBUG : removing 1 level 3 directories 2026/10/08 02:51:30 INFO : A1/B1/C1: Removing directory 2026/10/08 02:51:31 DEBUG : removing 1 level 2 directories 2026/10/08 02:51:31 INFO : A1/B1: Removing directory 2026/10/08 02:51:33 DEBUG : removing 1 level 1 directories 2026/10/08 02:51:33 INFO : A1: Removing directory 2026/10/08 02:51:34 DEBUG : removing 1 level 0 directories 2026/10/08 02:51:34 INFO : dosya.dev root 'rclone-test-guqunuq0rise': Removing directory 2026/10/08 02:51:37 ERROR : error listing: directory not found 2026/10/08 02:51:37 ERROR : error listing: directory not found --- PASS: TestRmdirsNoLeaveRoot (37.73s) === RUN TestRmdirsLeaveRoot run.go:198: Remote "dosya.dev root 'rclone-test-guqunuq0rise'", Local "Local file system at /tmp/rclone554740044", Modify Window "1s" 2026/10/08 02:51:38 INFO : A1: Making directory 2026/10/08 02:51:39 INFO : A1/B1: Making directory 2026/10/08 02:51:39 INFO : A1/B1/C1: Making directory 2026/10/08 02:51:43 DEBUG : removing 1 level 3 directories 2026/10/08 02:51:43 INFO : A1/B1/C1: Removing directory 2026/10/08 02:51:44 DEBUG : removing 1 level 2 directories 2026/10/08 02:51:44 INFO : A1/B1: Removing directory --- PASS: TestRmdirsLeaveRoot (12.21s) === RUN TestRmdirsWithFilter run.go:198: Remote "dosya.dev root 'rclone-test-guqunuq0rise'", Local "Local file system at /tmp/rclone554740044", Modify Window "1s" 2026/10/08 02:51:49 INFO : A1: Making directory 2026/10/08 02:51:50 INFO : A1/B1: Making directory 2026/10/08 02:51:51 INFO : A1/B1/C1: Making directory 2026/10/08 02:51:55 DEBUG : removing 1 level 3 directories 2026/10/08 02:51:55 INFO : A1/B1/C1: Removing directory 2026/10/08 02:51:56 DEBUG : removing 1 level 2 directories 2026/10/08 02:51:56 INFO : A1/B1: Removing directory --- PASS: TestRmdirsWithFilter (11.60s) === RUN TestCopyURL run.go:198: Remote "dosya.dev root 'rclone-test-guqunuq0rise'", Local "Local file system at /tmp/rclone554740044", Modify Window "1s" 2026/10/08 02:52:04 DEBUG : file1: size = 14 OK 2026/10/08 02:52:04 DEBUG : file1: sha256 = 3bf6b30277bde416a4de3058ad97f1d794f00cdc834ad15cb62e8018a45c1f91 OK 2026/10/08 02:52:05 DEBUG : filename.txt: File name found in url 2026/10/08 02:52:08 DEBUG : filename.txt: size = 14 OK 2026/10/08 02:52:08 DEBUG : filename.txt: sha256 = 3bf6b30277bde416a4de3058ad97f1d794f00cdc834ad15cb62e8018a45c1f91 OK 2026/10/08 02:52:08 DEBUG : headerfilename.txt: filename found in Content-Disposition header. 2026/10/08 02:52:10 DEBUG : headerfilename.txt: size = 14 OK 2026/10/08 02:52:10 DEBUG : headerfilename.txt: sha256 = 3bf6b30277bde416a4de3058ad97f1d794f00cdc834ad15cb62e8018a45c1f91 OK 2026/10/08 02:52:13 DEBUG : file2: size = 14 OK 2026/10/08 02:52:13 DEBUG : file2: sha256 = 3bf6b30277bde416a4de3058ad97f1d794f00cdc834ad15cb62e8018a45c1f91 OK --- PASS: TestCopyURL (17.37s) === RUN TestCopyURLDownloadHeaders run.go:198: Remote "dosya.dev root 'rclone-test-guqunuq0rise'", Local "Local file system at /tmp/rclone554740044", Modify Window "1s" 2026/10/08 02:52:21 DEBUG : file1: size = 14 OK 2026/10/08 02:52:21 DEBUG : file1: sha256 = 3bf6b30277bde416a4de3058ad97f1d794f00cdc834ad15cb62e8018a45c1f91 OK --- PASS: TestCopyURLDownloadHeaders (4.62s) === RUN TestCopyURLToWriter --- PASS: TestCopyURLToWriter (0.00s) === RUN TestMoveFile run.go:198: Remote "dosya.dev root 'rclone-test-guqunuq0rise'", Local "Local file system at /tmp/rclone554740044", Modify Window "1s" 2026/10/08 02:52:23 DEBUG : file1: Need to transfer - File not found at Destination 2026/10/08 02:52:27 DEBUG : sub/file2: size = 14 OK 2026/10/08 02:52:27 DEBUG : file1: sha256 = 226e7cfa701fb8ba542d42e0f8bd3090cbbcc9f54d834f361c0ab8c3f4846b72 OK 2026/10/08 02:52:27 INFO : file1: Copied (new) to: sub/file2 2026/10/08 02:52:27 INFO : file1: Deleted 2026/10/08 02:52:28 DEBUG : sub/file2: size = 14 OK 2026/10/08 02:52:28 DEBUG : file1: Size and modification time the same (differ by -499.999999ms, within tolerance 1s) 2026/10/08 02:52:28 DEBUG : file1: Unchanged skipping 2026/10/08 02:52:28 INFO : file1: Deleted 2026/10/08 02:52:29 DEBUG : dosya.dev root 'rclone-test-guqunuq0rise': don't need to copy/move sub/file2, it is already at target location --- PASS: TestMoveFile (10.21s) === RUN TestMoveFileWithIgnoreExisting run.go:198: Remote "dosya.dev root 'rclone-test-guqunuq0rise'", Local "Local file system at /tmp/rclone554740044", Modify Window "1s" 2026/10/08 02:52:33 DEBUG : file1: Need to transfer - File not found at Destination 2026/10/08 02:52:36 DEBUG : file1: size = 14 OK 2026/10/08 02:52:36 DEBUG : file1: sha256 = 226e7cfa701fb8ba542d42e0f8bd3090cbbcc9f54d834f361c0ab8c3f4846b72 OK 2026/10/08 02:52:36 INFO : file1: Copied (new) 2026/10/08 02:52:36 INFO : file1: Deleted 2026/10/08 02:52:37 DEBUG : file1: Destination exists, skipping 2026/10/08 02:52:37 DEBUG : file1: Not removing source file as destination file exists and --ignore-existing is set --- PASS: TestMoveFileWithIgnoreExisting (6.24s) === RUN TestMoveFileImmutable run.go:198: Remote "dosya.dev root 'rclone-test-guqunuq0rise'", Local "Local file system at /tmp/rclone554740044", Modify Window "1s" 2026/10/08 02:52:43 DEBUG : existing: size = 8 (Local file system at /tmp/rclone554740044) 2026/10/08 02:52:43 DEBUG : existing: size = 6 (dosya.dev root 'rclone-test-guqunuq0rise') 2026/10/08 02:52:43 DEBUG : existing: Sizes differ 2026/10/08 02:52:43 ERROR : existing: Source and destination exist but do not match: immutable file modified --- PASS: TestMoveFileImmutable (5.87s) === RUN TestCaseInsensitiveMoveFile run.go:198: Remote "dosya.dev root 'rclone-test-guqunuq0rise'", Local "Local file system at /tmp/rclone554740044", Modify Window "1s" --- PASS: TestCaseInsensitiveMoveFile (1.09s) === RUN TestCaseInsensitiveMoveFileDryRun run.go:198: Remote "dosya.dev root 'rclone-test-guqunuq0rise'", Local "Local file system at /tmp/rclone554740044", Modify Window "1s" --- PASS: TestCaseInsensitiveMoveFileDryRun (0.75s) === RUN TestMoveFileBackupDir run.go:198: Remote "dosya.dev root 'rclone-test-guqunuq0rise'", Local "Local file system at /tmp/rclone554740044", Modify Window "1s" 2026/10/08 02:52:52 DEBUG : Creating backend with remote "TestDosya:rclone-test-guqunuq0rise/backup" 2026/10/08 02:52:52 DEBUG : Config file has changed externally - reloading 2026/10/08 02:52:53 DEBUG : dst/file1: size = 14 (Local file system at /tmp/rclone554740044) 2026/10/08 02:52:53 DEBUG : dst/file1: size = 18 (dosya.dev root 'rclone-test-guqunuq0rise') 2026/10/08 02:52:53 DEBUG : dst/file1: Sizes differ 2026/10/08 02:52:56 INFO : dst/file1: Moved (server-side) 2026/10/08 02:52:59 DEBUG : dst/file1: size = 14 OK 2026/10/08 02:52:59 DEBUG : dst/file1: sha256 = 226e7cfa701fb8ba542d42e0f8bd3090cbbcc9f54d834f361c0ab8c3f4846b72 OK 2026/10/08 02:52:59 INFO : dst/file1: Copied (new) 2026/10/08 02:52:59 INFO : dst/file1: Deleted --- PASS: TestMoveFileBackupDir (20.06s) === RUN TestSameConfig --- PASS: TestSameConfig (0.00s) === RUN TestSame --- PASS: TestSame (0.00s) === RUN TestOverlappingFilterCheckWithoutFilter --- PASS: TestOverlappingFilterCheckWithoutFilter (0.00s) === RUN TestOverlappingFilterCheckWithFilter --- PASS: TestOverlappingFilterCheckWithFilter (0.00s) === RUN TestListFormat --- PASS: TestListFormat (0.00s) === RUN TestDirMoveMoveError run.go:198: Remote "dosya.dev root 'rclone-test-guqunuq0rise'", Local "Local file system at /tmp/rclone554740044", Modify Window "1s" operations_test.go:1490: Skipping test on non local remote --- SKIP: TestDirMoveMoveError (79.27s) === RUN TestDirMoveContext run.go:198: Remote "dosya.dev root 'rclone-test-guqunuq0rise'", Local "Local file system at /tmp/rclone554740044", Modify Window "1s" operations_test.go:1490: Skipping test on non local remote --- SKIP: TestDirMoveContext (10.97s) === RUN TestDirMove run.go:198: Remote "dosya.dev root 'rclone-test-guqunuq0rise'", Local "Local file system at /tmp/rclone554740044", Modify Window "1s" 2026/10/08 02:54:56 INFO : A1/B2: Making directory 2026/10/08 02:54:56 INFO : A1/B1/C3: Making directory 2026/10/08 02:55:09 INFO : A2/B1/C1/four: Moved (server-side) to: A3/B1/C1/four 2026/10/08 02:55:10 INFO : A2/B1/C2/five: Moved (server-side) to: A3/B1/C2/five 2026/10/08 02:55:10 INFO : A2/one: Moved (server-side) to: A3/one 2026/10/08 02:55:10 INFO : A2/B1/three: Moved (server-side) to: A3/B1/three 2026/10/08 02:55:10 INFO : A2/two: Moved (server-side) to: A3/two 2026/10/08 02:55:20 INFO : dosya.dev root 'rclone-test-guqunuq0rise': Can't DirMove - falling back to file moves: can't move directory - incompatible remotes 2026/10/08 02:55:27 INFO : A3/one: Moved (server-side) to: A4/one 2026/10/08 02:55:27 INFO : A3/B1/three: Moved (server-side) to: A4/B1/three 2026/10/08 02:55:27 INFO : A3/B1/C1/four: Moved (server-side) to: A4/B1/C1/four 2026/10/08 02:55:27 INFO : A3/two: Moved (server-side) to: A4/two 2026/10/08 02:55:27 INFO : A3/B1/C2/five: Moved (server-side) to: A4/B1/C2/five --- PASS: TestDirMove (74.73s) === RUN TestGetFsInfo run.go:198: Remote "dosya.dev root 'rclone-test-guqunuq0rise'", Local "Local file system at /tmp/rclone554740044", Modify Window "1s" 2026/10/08 02:55:52 DEBUG : Config file has changed externally - reloading --- PASS: TestGetFsInfo (0.74s) === RUN TestRcat === RUN TestRcat/withChecksum=false,ignoreChecksum=false run.go:198: Remote "dosya.dev root 'rclone-test-guqunuq0rise'", Local "Local file system at /tmp/rclone554740044", Modify Window "1s" 2026/10/08 02:55:53 DEBUG : dosya.dev root 'rclone-test-guqunuq0rise': File to upload is small (34 bytes), uploading instead of streaming 2026/10/08 02:55:56 DEBUG : no_checksum_small_file_from_pipe: size = 34 OK 2026/10/08 02:55:56 DEBUG : no_checksum_small_file_from_pipe: sha256 = 2f0590123fec5da63eace7f3d08ee9e61b4b1043d1aee9fcfeb32f66e48fa89e OK 2026/10/08 02:55:56 DEBUG : no_checksum_small_file_from_pipe: Size and sha256 of src and dst objects identical 2026/10/08 02:55:56 DEBUG : dosya.dev root 'rclone-test-guqunuq0rise': Target remote doesn't support streaming uploads, creating temporary local FS to spool file 2026/10/08 02:55:59 DEBUG : no_checksum_big_file_from_pipe: size = 102401 OK 2026/10/08 02:55:59 DEBUG : no_checksum_big_file_from_pipe: sha256 = 884c9311d7b21518d39a523cd9dfa9790b82a5c6ad7f3f8497a4393bfd50cfb7 OK 2026/10/08 02:55:59 DEBUG : no_checksum_big_file_from_pipe: Size and sha256 of src and dst objects identical === RUN TestRcat/withChecksum=true,ignoreChecksum=false run.go:198: Remote "dosya.dev root 'rclone-test-guqunuq0rise'", Local "Local file system at /tmp/rclone554740044", Modify Window "1s" 2026/10/08 02:56:02 DEBUG : dosya.dev root 'rclone-test-guqunuq0rise': File to upload is small (34 bytes), uploading instead of streaming 2026/10/08 02:56:05 DEBUG : with_checksum_small_file_from_pipe: size = 34 OK 2026/10/08 02:56:05 DEBUG : with_checksum_small_file_from_pipe: sha256 = 2f0590123fec5da63eace7f3d08ee9e61b4b1043d1aee9fcfeb32f66e48fa89e OK 2026/10/08 02:56:05 DEBUG : with_checksum_small_file_from_pipe: Size and sha256 of src and dst objects identical 2026/10/08 02:56:05 DEBUG : dosya.dev root 'rclone-test-guqunuq0rise': Target remote doesn't support streaming uploads, creating temporary local FS to spool file 2026/10/08 02:56:08 DEBUG : with_checksum_big_file_from_pipe: size = 102401 OK 2026/10/08 02:56:08 DEBUG : with_checksum_big_file_from_pipe: sha256 = 884c9311d7b21518d39a523cd9dfa9790b82a5c6ad7f3f8497a4393bfd50cfb7 OK 2026/10/08 02:56:08 DEBUG : with_checksum_big_file_from_pipe: Size and sha256 of src and dst objects identical === RUN TestRcat/withChecksum=false,ignoreChecksum=true run.go:198: Remote "dosya.dev root 'rclone-test-guqunuq0rise'", Local "Local file system at /tmp/rclone554740044", Modify Window "1s" 2026/10/08 02:56:11 DEBUG : dosya.dev root 'rclone-test-guqunuq0rise': File to upload is small (34 bytes), uploading instead of streaming 2026/10/08 02:56:14 DEBUG : ignore_checksum_small_file_from_pipe: size = 34 OK 2026/10/08 02:56:14 DEBUG : ignore_checksum_small_file_from_pipe: Size and modification time the same (differ by -499.999999ms, within tolerance 1s) 2026/10/08 02:56:14 DEBUG : dosya.dev root 'rclone-test-guqunuq0rise': Target remote doesn't support streaming uploads, creating temporary local FS to spool file 2026/10/08 02:56:17 DEBUG : ignore_checksum_big_file_from_pipe: size = 102401 OK 2026/10/08 02:56:17 DEBUG : ignore_checksum_big_file_from_pipe: Size and modification time the same (differ by -123.456789ms, within tolerance 1s) === RUN TestRcat/withChecksum=true,ignoreChecksum=true run.go:198: Remote "dosya.dev root 'rclone-test-guqunuq0rise'", Local "Local file system at /tmp/rclone554740044", Modify Window "1s" 2026/10/08 02:56:20 DEBUG : dosya.dev root 'rclone-test-guqunuq0rise': File to upload is small (34 bytes), uploading instead of streaming 2026/10/08 02:56:23 DEBUG : ignore_checksum_small_file_from_pipe: size = 34 OK 2026/10/08 02:56:23 DEBUG : ignore_checksum_small_file_from_pipe: Src hash empty - aborting Dst hash check 2026/10/08 02:56:23 DEBUG : ignore_checksum_small_file_from_pipe: Size of src and dst objects identical 2026/10/08 02:56:23 DEBUG : dosya.dev root 'rclone-test-guqunuq0rise': Target remote doesn't support streaming uploads, creating temporary local FS to spool file 2026/10/08 02:56:26 DEBUG : ignore_checksum_big_file_from_pipe: size = 102401 OK 2026/10/08 02:56:26 DEBUG : ignore_checksum_big_file_from_pipe: Src hash empty - aborting Dst hash check 2026/10/08 02:56:26 DEBUG : ignore_checksum_big_file_from_pipe: Size of src and dst objects identical --- PASS: TestRcat (36.15s) --- PASS: TestRcat/withChecksum=false,ignoreChecksum=false (9.09s) --- PASS: TestRcat/withChecksum=true,ignoreChecksum=false (9.09s) --- PASS: TestRcat/withChecksum=false,ignoreChecksum=true (9.06s) --- PASS: TestRcat/withChecksum=true,ignoreChecksum=true (8.92s) === RUN TestRcatMetadata run.go:198: Remote "dosya.dev root 'rclone-test-guqunuq0rise'", Local "Local file system at /tmp/rclone554740044", Modify Window "1s" operations_test.go:1745: Skipping as destination doesn't support user metadata --- SKIP: TestRcatMetadata (0.73s) === RUN TestRcatSize run.go:198: Remote "dosya.dev root 'rclone-test-guqunuq0rise'", Local "Local file system at /tmp/rclone554740044", Modify Window "1s" 2026/10/08 02:56:32 DEBUG : potato1: size = 60 OK 2026/10/08 02:56:32 DEBUG : potato1: sha256 = d398f81cd00b370b116d049d2f3b73a3a7ed35446486effb789791a7e0b98e9c OK 2026/10/08 02:56:32 DEBUG : dosya.dev root 'rclone-test-guqunuq0rise': File to upload is small (60 bytes), uploading instead of streaming 2026/10/08 02:56:35 DEBUG : potato2: size = 60 OK 2026/10/08 02:56:35 DEBUG : potato2: sha256 = d398f81cd00b370b116d049d2f3b73a3a7ed35446486effb789791a7e0b98e9c OK 2026/10/08 02:56:35 DEBUG : potato2: Size and sha256 of src and dst objects identical --- PASS: TestRcatSize (8.50s) === RUN TestRcatSizeShortEOF run.go:198: Remote "dosya.dev root 'rclone-test-guqunuq0rise'", Local "Local file system at /tmp/rclone554740044", Modify Window "1s" 2026/10/08 02:56:40 ERROR : potato1: Post request put error: couldn't upload file: HTTP error 400 (400 Bad Request): 400 Bad Request

400 Bad Request


cloudflare
--- PASS: TestRcatSizeShortEOF (2.75s) === RUN TestRcatSizeMetadata run.go:198: Remote "dosya.dev root 'rclone-test-guqunuq0rise'", Local "Local file system at /tmp/rclone554740044", Modify Window "1s" operations_test.go:1838: Skipping as destination doesn't support user metadata --- SKIP: TestRcatSizeMetadata (0.76s) === RUN TestRcatSizeUploadHeaders run.go:198: Remote "dosya.dev root 'rclone-test-guqunuq0rise'", Local "Local file system at /tmp/rclone554740044", Modify Window "1s" 2026/10/08 02:56:46 DEBUG : potato1: size = 60 OK 2026/10/08 02:56:46 DEBUG : potato1: sha256 = d398f81cd00b370b116d049d2f3b73a3a7ed35446486effb789791a7e0b98e9c OK --- PASS: TestRcatSizeUploadHeaders (5.78s) === RUN TestRcatSizeChecksum === RUN TestRcatSizeChecksum/Corrupted run.go:198: Remote "dosya.dev root 'rclone-test-guqunuq0rise'", Local "Local file system at /tmp/rclone554740044", Modify Window "1s" 2026/10/08 02:56:50 DEBUG : potato1: size = 60 OK 2026/10/08 02:56:50 DEBUG : potato1: sha256 = d398f81cd00b370b116d049d2f3b73a3a7ed35446486effb789791a7e0b98e9c (dosya.dev root 'rclone-test-guqunuq0rise') 2026/10/08 02:56:50 DEBUG : potato1: sha256 = 4aa30ef0902653a07d3ef9b4c6b44d8094ab4091b49a21c95dc942bc102b4d5a (dosya.dev root 'rclone-test-guqunuq0rise') 2026/10/08 02:56:50 ERROR : potato1: corrupted on transfer: sha256 hashes differ src "d398f81cd00b370b116d049d2f3b73a3a7ed35446486effb789791a7e0b98e9c" vs dst(dosya.dev root 'rclone-test-guqunuq0rise') "4aa30ef0902653a07d3ef9b4c6b44d8094ab4091b49a21c95dc942bc102b4d5a" 2026/10/08 02:56:50 INFO : potato1: Removing failed copy === RUN TestRcatSizeChecksum/SizeDiffers run.go:198: Remote "dosya.dev root 'rclone-test-guqunuq0rise'", Local "Local file system at /tmp/rclone554740044", Modify Window "1s" 2026/10/08 02:56:55 DEBUG : potato4: size = 60 (dosya.dev root 'rclone-test-guqunuq0rise') 2026/10/08 02:56:55 DEBUG : potato4: size = 59 (dosya.dev root 'rclone-test-guqunuq0rise') 2026/10/08 02:56:55 ERROR : potato4: corrupted on transfer: sizes differ src 60 vs dst(dosya.dev root 'rclone-test-guqunuq0rise') 59 2026/10/08 02:56:55 INFO : potato4: Removing failed copy === RUN TestRcatSizeChecksum/IgnoreChecksum run.go:198: Remote "dosya.dev root 'rclone-test-guqunuq0rise'", Local "Local file system at /tmp/rclone554740044", Modify Window "1s" 2026/10/08 02:57:00 DEBUG : potato2: size = 60 OK === RUN TestRcatSizeChecksum/NoHashes run.go:198: Remote "dosya.dev root 'rclone-test-guqunuq0rise'", Local "Local file system at /tmp/rclone554740044", Modify Window "1s" 2026/10/08 02:57:05 DEBUG : potato3: size = 60 OK --- PASS: TestRcatSizeChecksum (19.18s) --- PASS: TestRcatSizeChecksum/Corrupted (5.29s) --- PASS: TestRcatSizeChecksum/SizeDiffers (4.83s) --- PASS: TestRcatSizeChecksum/IgnoreChecksum (4.61s) --- PASS: TestRcatSizeChecksum/NoHashes (4.44s) === RUN TestTouchDir run.go:198: Remote "dosya.dev root 'rclone-test-guqunuq0rise'", Local "Local file system at /tmp/rclone554740044", Modify Window "1s" 2026/10/08 02:57:17 DEBUG : dosya.dev root 'rclone-test-guqunuq0rise': Touching "empty space" 2026/10/08 02:57:17 DEBUG : dosya.dev root 'rclone-test-guqunuq0rise': Touching "potato2" 2026/10/08 02:57:17 ERROR : empty space: failed to touch: can't set modified time 2026/10/08 02:57:17 ERROR : potato2: failed to touch: can't set modified time 2026/10/08 02:57:17 DEBUG : dosya.dev root 'rclone-test-guqunuq0rise': Touching "sub dir/potato3" 2026/10/08 02:57:17 ERROR : sub dir/potato3: failed to touch: can't set modified time --- PASS: TestTouchDir (16.44s) === RUN TestMkdirMetadata run.go:198: Remote "dosya.dev root 'rclone-test-guqunuq0rise'", Local "Local file system at /tmp/rclone554740044", Modify Window "1s" operations_test.go:2058: Skipping test as remote does not support MkdirMetadata --- SKIP: TestMkdirMetadata (0.79s) === RUN TestMkdirModTime run.go:198: Remote "dosya.dev root 'rclone-test-guqunuq0rise'", Local "Local file system at /tmp/rclone554740044", Modify Window "1s" operations_test.go:2079: Skipping test as remote does not support DirSetModTime or MkdirMetadata --- SKIP: TestMkdirModTime (0.73s) === RUN TestCopyDirMetadata run.go:198: Remote "dosya.dev root 'rclone-test-guqunuq0rise'", Local "Local file system at /tmp/rclone554740044", Modify Window "1s" operations_test.go:2123: Skipping test as remote does not support WriteDirMetadata or MkdirMetadata --- SKIP: TestCopyDirMetadata (0.77s) === RUN TestSetDirModTime run.go:198: Remote "dosya.dev root 'rclone-test-guqunuq0rise'", Local "Local file system at /tmp/rclone554740044", Modify Window "1s" operations_test.go:2161: Skipping test as remote does not support DirSetModTime or WriteDirSetModTime --- SKIP: TestSetDirModTime (0.79s) === RUN TestDirsEqual run.go:198: Remote "dosya.dev root 'rclone-test-guqunuq0rise'", Local "Local file system at /tmp/rclone554740044", Modify Window "1s" operations_test.go:2212: Skipping test as remote does not support WriteDirMetadata or MkdirMetadata --- SKIP: TestDirsEqual (0.74s) === RUN TestRemoveExisting run.go:198: Remote "dosya.dev root 'rclone-test-guqunuq0rise'", Local "Local file system at /tmp/rclone554740044", Modify Window "1s" 2026/10/08 02:57:37 DEBUG : sub dir/test remove existing: TEST: renaming existing object to "sub dir/test remove existing.zakucoy3" before starting 2026/10/08 02:57:38 DEBUG : sub dir/test remove existing.zakucoy3: TEST: removing renamed existing file after operation 2026/10/08 02:57:40 DEBUG : sub dir/test remove existing with long name 123456789012345678901234567890123456789012345678901234567890123456789: TEST: renaming existing object to "sub dir/test remove existing with long name 123456789012345678901234567890123456789012345678901234567890.radehor3" before starting 2026/10/08 02:57:42 DEBUG : sub dir/test remove existing with long name 123456789012345678901234567890123456789012345678901234567890.radehor3: TEST: renaming existing back after failed operation 2026/10/08 02:57:43 DEBUG : sub dir/test remove existing with long name 123456789012345678901234567890123456789012345678901234567890123456789: TEST: renaming existing object to "sub dir/test remove existing with long name 123456789012345678901234567890123456789012345678901234567890.ziquyey9" before starting 2026/10/08 02:57:44 DEBUG : sub dir/test remove existing with long name 123456789012345678901234567890123456789012345678901234567890.ziquyey9: TEST: removing renamed existing file after operation --- PASS: TestRemoveExisting (21.93s) === RUN TestRcatInputFailurePreservesDestination 2026/10/08 02:57:49 DEBUG : Creating backend with remote "/tmp/TestRcatInputFailurePreservesDestination2465426518/001" --- PASS: TestRcatInputFailurePreservesDestination (0.01s) === RUN TestRcAbout rc_test.go:31: Skipping test on non local remote --- SKIP: TestRcAbout (0.00s) === RUN TestRcCleanup rc_test.go:31: Skipping test on non local remote --- SKIP: TestRcCleanup (0.00s) === RUN TestRcCopyfile rc_test.go:31: Skipping test on non local remote --- SKIP: TestRcCopyfile (0.00s) === RUN TestRcCopyurl rc_test.go:31: Skipping test on non local remote --- SKIP: TestRcCopyurl (0.00s) === RUN TestRcDelete rc_test.go:31: Skipping test on non local remote --- SKIP: TestRcDelete (0.00s) === RUN TestRcDeletefile rc_test.go:31: Skipping test on non local remote --- SKIP: TestRcDeletefile (0.00s) === RUN TestRcList rc_test.go:31: Skipping test on non local remote --- SKIP: TestRcList (0.00s) === RUN TestRcStat rc_test.go:31: Skipping test on non local remote --- SKIP: TestRcStat (0.00s) === RUN TestRcSetTier rc_test.go:31: Skipping test on non local remote --- SKIP: TestRcSetTier (0.00s) === RUN TestRcSetTierFile rc_test.go:31: Skipping test on non local remote --- SKIP: TestRcSetTierFile (0.00s) === RUN TestRcMkdir rc_test.go:31: Skipping test on non local remote --- SKIP: TestRcMkdir (0.00s) === RUN TestRcMovefile rc_test.go:31: Skipping test on non local remote --- SKIP: TestRcMovefile (0.00s) === RUN TestRcPurge rc_test.go:31: Skipping test on non local remote --- SKIP: TestRcPurge (0.00s) === RUN TestRcRmdir rc_test.go:31: Skipping test on non local remote --- SKIP: TestRcRmdir (0.00s) === RUN TestRcRmdirs rc_test.go:31: Skipping test on non local remote --- SKIP: TestRcRmdirs (0.00s) === RUN TestRcSize rc_test.go:31: Skipping test on non local remote --- SKIP: TestRcSize (0.00s) === RUN TestRcPublicLink rc_test.go:31: Skipping test on non local remote --- SKIP: TestRcPublicLink (0.00s) === RUN TestRcFsInfo rc_test.go:31: Skipping test on non local remote --- SKIP: TestRcFsInfo (0.00s) === RUN TestUploadFile rc_test.go:31: Skipping test on non local remote --- SKIP: TestUploadFile (0.00s) === RUN TestRcCommand rc_test.go:31: Skipping test on non local remote --- SKIP: TestRcCommand (0.00s) === RUN TestRcDu rc_test.go:31: Skipping test on non local remote --- SKIP: TestRcDu (0.00s) === RUN TestRcCheck rc_test.go:31: Skipping test on non local remote --- SKIP: TestRcCheck (0.00s) === RUN TestRcHashsum rc_test.go:31: Skipping test on non local remote --- SKIP: TestRcHashsum (0.00s) === RUN TestRcHashsumSingleFile rc_test.go:31: Skipping test on non local remote --- SKIP: TestRcHashsumSingleFile (0.00s) === RUN TestRcHashsumFile rc_test.go:31: Skipping test on non local remote --- SKIP: TestRcHashsumFile (0.00s) === RUN TestRcGetFile rc_test.go:31: Skipping test on non local remote --- SKIP: TestRcGetFile (0.00s) FAIL 2026/10/08 02:57:49 DEBUG : dosya.dev root 'rclone-test-guqunuq0rise': Purge remote "./operations.test -test.v -test.timeout 3h0m0s -remote TestDosya: -verbose" - Finished ERROR in 30m37.736814315s (try 1/5): exit status 1: Failed [TestIndexChangedDirTime]