"./operations.test -test.v -test.timeout 1h0m0s -remote TestPcloud: -verbose" - Starting (try 1/5) 2026/10/07 01:04:55 DEBUG : Creating backend with remote "TestPcloud:rclone-test-kiziruq4votu" 2026/10/07 01:04:55 DEBUG : Using config file from "/home/rclone/.rclone.conf" 2026/10/07 01:05:01 DEBUG : Creating backend with remote "/tmp/rclone148111752" === RUN TestDoMultiThreadCopy --- PASS: TestDoMultiThreadCopy (0.00s) === RUN TestMultithreadCalculateNumChunks === RUN TestMultithreadCalculateNumChunks/{size:1_chunkSize:65536_wantNumChunks:1} === RUN TestMultithreadCalculateNumChunks/{size:1048576_chunkSize:1_wantNumChunks:1048576} === RUN TestMultithreadCalculateNumChunks/{size:1048576_chunkSize:2_wantNumChunks:524288} === RUN TestMultithreadCalculateNumChunks/{size:1048577_chunkSize:2_wantNumChunks:524289} === RUN TestMultithreadCalculateNumChunks/{size:1048575_chunkSize:2_wantNumChunks:524288} --- PASS: TestMultithreadCalculateNumChunks (0.00s) --- PASS: TestMultithreadCalculateNumChunks/{size:1_chunkSize:65536_wantNumChunks:1} (0.00s) --- PASS: TestMultithreadCalculateNumChunks/{size:1048576_chunkSize:1_wantNumChunks:1048576} (0.00s) --- PASS: TestMultithreadCalculateNumChunks/{size:1048576_chunkSize:2_wantNumChunks:524288} (0.00s) --- PASS: TestMultithreadCalculateNumChunks/{size:1048577_chunkSize:2_wantNumChunks:524289} (0.00s) --- PASS: TestMultithreadCalculateNumChunks/{size:1048575_chunkSize:2_wantNumChunks:524288} (0.00s) === RUN TestMultithreadCopy run.go:198: Remote "pcloud root 'rclone-test-kiziruq4votu'", Local "Local file system at /tmp/rclone148111752", Modify Window "1s" multithread_test.go:120: multithread writing not supported --- SKIP: TestMultithreadCopy (0.71s) === RUN TestMultithreadCopyAbort run.go:198: Remote "pcloud root 'rclone-test-kiziruq4votu'", Local "Local file system at /tmp/rclone148111752", Modify Window "1s" multithread_test.go:120: multithread writing not supported --- SKIP: TestMultithreadCopyAbort (0.82s) === RUN TestMultithreadCopyWriterAtErrors === RUN TestMultithreadCopyWriterAtErrors/open/fatal=false 2026/10/07 01:05:03 DEBUG : file.txt: multi-thread copy: disabling buffering because destination uses OpenWriterAt === RUN TestMultithreadCopyWriterAtErrors/open/fatal=true 2026/10/07 01:05:03 DEBUG : file.txt: multi-thread copy: disabling buffering because destination uses OpenWriterAt === RUN TestMultithreadCopyWriterAtErrors/write/fatal=false 2026/10/07 01:05:03 DEBUG : file.txt: multi-thread copy: disabling buffering because destination uses OpenWriterAt 2026/10/07 01:05:03 DEBUG : file.txt: Starting multi-thread copy with 4 chunks of size 4 with 2 parallel streams 2026/10/07 01:05:03 DEBUG : file.txt: multi-thread copy: chunk 2/4 (4-8) size 4 starting 2026/10/07 01:05:03 DEBUG : file.txt: writing chunk 1 2026/10/07 01:05:03 DEBUG : file.txt: multi-thread copy: chunk 1/4 (0-4) size 4 starting 2026/10/07 01:05:03 DEBUG : file.txt: multi-thread copy: chunk 2/4 failed: multi-thread copy: failed to write chunk: disk full 2026/10/07 01:05:03 DEBUG : file.txt: writing chunk 0 2026/10/07 01:05:03 DEBUG : file.txt: multi-thread copy: chunk 3/4 (8-12) size 4 starting 2026/10/07 01:05:03 DEBUG : file.txt: writing chunk 2 2026/10/07 01:05:03 DEBUG : file.txt: multi-thread copy: chunk 1/4 failed: multi-thread copy: failed to write chunk: disk full 2026/10/07 01:05:03 DEBUG : file.txt: multi-thread copy: chunk 3/4 failed: multi-thread copy: failed to write chunk: disk full 2026/10/07 01:05:03 DEBUG : file.txt: multi-thread copy: cancelling transfer on exit 2026/10/07 01:05:03 DEBUG : file.txt: multi-thread copy: abort failed: multi-thread copy: failed to find temp file when aborting chunk writer: object not found === RUN TestMultithreadCopyWriterAtErrors/write/fatal=true 2026/10/07 01:05:03 DEBUG : file.txt: multi-thread copy: disabling buffering because destination uses OpenWriterAt 2026/10/07 01:05:03 DEBUG : file.txt: Starting multi-thread copy with 4 chunks of size 4 with 2 parallel streams 2026/10/07 01:05:03 DEBUG : file.txt: multi-thread copy: chunk 2/4 (4-8) size 4 starting 2026/10/07 01:05:03 DEBUG : file.txt: writing chunk 1 2026/10/07 01:05:03 DEBUG : file.txt: multi-thread copy: chunk 1/4 (0-4) size 4 starting 2026/10/07 01:05:03 DEBUG : file.txt: writing chunk 0 2026/10/07 01:05:03 DEBUG : file.txt: multi-thread copy: chunk 2/4 failed: multi-thread copy: failed to write chunk: disk full 2026/10/07 01:05:03 DEBUG : file.txt: multi-thread copy: chunk 1/4 failed: multi-thread copy: failed to write chunk: disk full 2026/10/07 01:05:03 DEBUG : file.txt: multi-thread copy: chunk 3/4 (8-12) size 4 starting 2026/10/07 01:05:03 DEBUG : file.txt: writing chunk 2 2026/10/07 01:05:03 DEBUG : file.txt: multi-thread copy: chunk 3/4 failed: multi-thread copy: failed to write chunk: disk full 2026/10/07 01:05:03 DEBUG : file.txt: multi-thread copy: cancelling transfer on exit 2026/10/07 01:05:03 DEBUG : file.txt: multi-thread copy: abort failed: multi-thread copy: failed to find temp file when aborting chunk writer: object not found === RUN TestMultithreadCopyWriterAtErrors/close/fatal=false 2026/10/07 01:05:03 DEBUG : file.txt: multi-thread copy: disabling buffering because destination uses OpenWriterAt 2026/10/07 01:05:03 DEBUG : file.txt: Starting multi-thread copy with 4 chunks of size 4 with 2 parallel streams 2026/10/07 01:05:03 DEBUG : file.txt: multi-thread copy: chunk 1/4 (0-4) size 4 starting 2026/10/07 01:05:03 DEBUG : file.txt: writing chunk 0 2026/10/07 01:05:03 DEBUG : file.txt: multi-thread copy: chunk 1/4 (0-4) size 4 finished 2026/10/07 01:05:03 DEBUG : file.txt: multi-thread copy: chunk 3/4 (8-12) size 4 starting 2026/10/07 01:05:03 DEBUG : file.txt: writing chunk 2 2026/10/07 01:05:03 DEBUG : file.txt: multi-thread copy: chunk 3/4 (8-12) size 4 finished 2026/10/07 01:05:03 DEBUG : file.txt: multi-thread copy: chunk 4/4 (12-16) size 4 starting 2026/10/07 01:05:03 DEBUG : file.txt: writing chunk 3 2026/10/07 01:05:03 DEBUG : file.txt: multi-thread copy: chunk 4/4 (12-16) size 4 finished 2026/10/07 01:05:03 DEBUG : file.txt: multi-thread copy: chunk 2/4 (4-8) size 4 starting 2026/10/07 01:05:03 DEBUG : file.txt: writing chunk 1 2026/10/07 01:05:03 DEBUG : file.txt: multi-thread copy: chunk 2/4 (4-8) size 4 finished 2026/10/07 01:05:03 DEBUG : file.txt: multi-thread copy: cancelling transfer on exit 2026/10/07 01:05:03 DEBUG : file.txt: multi-thread copy: abort failed: multi-thread copy: failed to find temp file when aborting chunk writer: object not found === RUN TestMultithreadCopyWriterAtErrors/close/fatal=true 2026/10/07 01:05:03 DEBUG : file.txt: multi-thread copy: disabling buffering because destination uses OpenWriterAt 2026/10/07 01:05:03 DEBUG : file.txt: Starting multi-thread copy with 4 chunks of size 4 with 2 parallel streams 2026/10/07 01:05:03 DEBUG : file.txt: multi-thread copy: chunk 2/4 (4-8) size 4 starting 2026/10/07 01:05:03 DEBUG : file.txt: writing chunk 1 2026/10/07 01:05:03 DEBUG : file.txt: multi-thread copy: chunk 2/4 (4-8) size 4 finished 2026/10/07 01:05:03 DEBUG : file.txt: multi-thread copy: chunk 3/4 (8-12) size 4 starting 2026/10/07 01:05:03 DEBUG : file.txt: writing chunk 2 2026/10/07 01:05:03 DEBUG : file.txt: multi-thread copy: chunk 3/4 (8-12) size 4 finished 2026/10/07 01:05:03 DEBUG : file.txt: multi-thread copy: chunk 4/4 (12-16) size 4 starting 2026/10/07 01:05:03 DEBUG : file.txt: writing chunk 3 2026/10/07 01:05:03 DEBUG : file.txt: multi-thread copy: chunk 4/4 (12-16) size 4 finished 2026/10/07 01:05:03 DEBUG : file.txt: multi-thread copy: chunk 1/4 (0-4) size 4 starting 2026/10/07 01:05:03 DEBUG : file.txt: writing chunk 0 2026/10/07 01:05:03 DEBUG : file.txt: multi-thread copy: chunk 1/4 (0-4) size 4 finished 2026/10/07 01:05:03 DEBUG : file.txt: multi-thread copy: cancelling transfer on exit 2026/10/07 01:05:03 DEBUG : file.txt: multi-thread copy: abort failed: multi-thread copy: failed to find temp file when aborting chunk writer: object not found --- PASS: TestMultithreadCopyWriterAtErrors (0.00s) --- PASS: TestMultithreadCopyWriterAtErrors/open/fatal=false (0.00s) --- PASS: TestMultithreadCopyWriterAtErrors/open/fatal=true (0.00s) --- PASS: TestMultithreadCopyWriterAtErrors/write/fatal=false (0.00s) --- PASS: TestMultithreadCopyWriterAtErrors/write/fatal=true (0.00s) --- PASS: TestMultithreadCopyWriterAtErrors/close/fatal=false (0.00s) --- PASS: TestMultithreadCopyWriterAtErrors/close/fatal=true (0.00s) === RUN TestSizeDiffers 2026/10/07 01:05:03 DEBUG : a: size = 0 OK 2026/10/07 01:05:03 DEBUG : a: size = 1 (memory) 2026/10/07 01:05:03 DEBUG : a: size = 2 (memory) --- PASS: TestSizeDiffers (0.00s) === RUN TestDirTransferEntry --- PASS: TestDirTransferEntry (0.00s) === RUN TestReOpen === RUN TestReOpen/Normal === RUN TestReOpen/Normal/Basics 2026/10/07 01:05:03 DEBUG : potato: Seek from 10 to 0 === RUN TestReOpen/Normal/ErrorAtStart === RUN TestReOpen/Normal/WithErrors 2026/10/07 01:05:03 DEBUG : potato: Reopening on read failure after offset 2 bytes: retry 1/10: test error 2026/10/07 01:05:03 DEBUG : potato: Reopening on read failure after offset 3 bytes: retry 2/10: test error 2026/10/07 01:05:03 DEBUG : potato: Reopening on read failure after offset 6 bytes: retry 3/10: test error === RUN TestReOpen/Normal/TooManyErrors 2026/10/07 01:05:03 DEBUG : potato: Reopening on read failure after offset 2 bytes: retry 1/3: test error 2026/10/07 01:05:03 DEBUG : potato: Reopening on read failure after offset 3 bytes: retry 2/3: test error 2026/10/07 01:05:03 DEBUG : potato: Reopening on read failure after offset 6 bytes: retry 3/3: test error 2026/10/07 01:05:03 DEBUG : potato: Reopen failed after offset 6 bytes read: failed to reopen: too many retries === RUN TestReOpen/Normal/ReadAt 2026/10/07 01:05:03 DEBUG : potato: Reopening on read failure after offset 2 bytes: retry 0/10: test error 2026/10/07 01:05:03 DEBUG : potato: Reopening on read failure after offset 3 bytes: retry 1/10: test error 2026/10/07 01:05:03 DEBUG : potato: Seek from 5 to 1 === RUN TestReOpen/Normal/Seek 2026/10/07 01:05:03 DEBUG : potato: Reopening on read failure after offset 2 bytes: retry 0/10: test error 2026/10/07 01:05:03 DEBUG : potato: Reopening on read failure after offset 3 bytes: retry 1/10: test error 2026/10/07 01:05:03 DEBUG : potato: Seek from 5 to 2 === RUN TestReOpen/Normal/AccountRead === RUN TestReOpen/Normal/AccountReadDelay 2026/10/07 01:05:03 DEBUG : potato: Seek from 10 to 0 2026/10/07 01:05:03 DEBUG : potato: Seek from 10 to 0 2026/10/07 01:05:03 DEBUG : potato: Seek from 10 to 0 === RUN TestReOpen/Normal/AccountReadError === RUN TestReOpen/WithRangeOption === RUN TestReOpen/WithRangeOption/Basics 2026/10/07 01:05:03 DEBUG : potato: Seek from 7 to 0 === RUN TestReOpen/WithRangeOption/ErrorAtStart === RUN TestReOpen/WithRangeOption/WithErrors 2026/10/07 01:05:03 DEBUG : potato: Reopening on read failure after offset 2 bytes: retry 1/10: test error 2026/10/07 01:05:03 DEBUG : potato: Reopening on read failure after offset 3 bytes: retry 2/10: test error 2026/10/07 01:05:03 DEBUG : potato: Reopening on read failure after offset 6 bytes: retry 3/10: test error === RUN TestReOpen/WithRangeOption/TooManyErrors 2026/10/07 01:05:03 DEBUG : potato: Reopening on read failure after offset 2 bytes: retry 1/3: test error 2026/10/07 01:05:03 DEBUG : potato: Reopening on read failure after offset 3 bytes: retry 2/3: test error 2026/10/07 01:05:03 DEBUG : potato: Reopening on read failure after offset 6 bytes: retry 3/3: test error 2026/10/07 01:05:03 DEBUG : potato: Reopen failed after offset 6 bytes read: failed to reopen: too many retries === RUN TestReOpen/WithRangeOption/ReadAt 2026/10/07 01:05:03 DEBUG : potato: Reopening on read failure after offset 2 bytes: retry 0/10: test error 2026/10/07 01:05:03 DEBUG : potato: Reopening on read failure after offset 3 bytes: retry 1/10: test error 2026/10/07 01:05:03 DEBUG : potato: Seek from 5 to 1 === RUN TestReOpen/WithRangeOption/Seek 2026/10/07 01:05:03 DEBUG : potato: Reopening on read failure after offset 2 bytes: retry 0/10: test error 2026/10/07 01:05:03 DEBUG : potato: Reopening on read failure after offset 3 bytes: retry 1/10: test error 2026/10/07 01:05:03 DEBUG : potato: Seek from 5 to 2 2026/10/07 01:05:03 DEBUG : potato: Seek from 7 to 4 === RUN TestReOpen/WithRangeOption/AccountRead === RUN TestReOpen/WithRangeOption/AccountReadDelay 2026/10/07 01:05:03 DEBUG : potato: Seek from 7 to 0 2026/10/07 01:05:03 DEBUG : potato: Seek from 7 to 0 2026/10/07 01:05:03 DEBUG : potato: Seek from 7 to 0 === RUN TestReOpen/WithRangeOption/AccountReadError === RUN TestReOpen/WithSeekOption === RUN TestReOpen/WithSeekOption/Basics 2026/10/07 01:05:03 DEBUG : potato: Seek from 8 to 0 === RUN TestReOpen/WithSeekOption/ErrorAtStart === RUN TestReOpen/WithSeekOption/WithErrors 2026/10/07 01:05:03 DEBUG : potato: Reopening on read failure after offset 2 bytes: retry 1/10: test error 2026/10/07 01:05:03 DEBUG : potato: Reopening on read failure after offset 3 bytes: retry 2/10: test error 2026/10/07 01:05:03 DEBUG : potato: Reopening on read failure after offset 6 bytes: retry 3/10: test error === RUN TestReOpen/WithSeekOption/TooManyErrors 2026/10/07 01:05:03 DEBUG : potato: Reopening on read failure after offset 2 bytes: retry 1/3: test error 2026/10/07 01:05:03 DEBUG : potato: Reopening on read failure after offset 3 bytes: retry 2/3: test error 2026/10/07 01:05:03 DEBUG : potato: Reopening on read failure after offset 6 bytes: retry 3/3: test error 2026/10/07 01:05:03 DEBUG : potato: Reopen failed after offset 6 bytes read: failed to reopen: too many retries === RUN TestReOpen/WithSeekOption/ReadAt 2026/10/07 01:05:03 DEBUG : potato: Reopening on read failure after offset 2 bytes: retry 0/10: test error 2026/10/07 01:05:03 DEBUG : potato: Reopening on read failure after offset 3 bytes: retry 1/10: test error 2026/10/07 01:05:03 DEBUG : potato: Seek from 5 to 1 === RUN TestReOpen/WithSeekOption/Seek 2026/10/07 01:05:03 DEBUG : potato: Reopening on read failure after offset 2 bytes: retry 0/10: test error 2026/10/07 01:05:03 DEBUG : potato: Reopening on read failure after offset 3 bytes: retry 1/10: test error 2026/10/07 01:05:03 DEBUG : potato: Seek from 5 to 2 2026/10/07 01:05:03 DEBUG : potato: Seek from 7 to 5 === RUN TestReOpen/WithSeekOption/AccountRead === RUN TestReOpen/WithSeekOption/AccountReadDelay 2026/10/07 01:05:03 DEBUG : potato: Seek from 8 to 0 2026/10/07 01:05:03 DEBUG : potato: Seek from 8 to 0 2026/10/07 01:05:03 DEBUG : potato: Seek from 8 to 0 === RUN TestReOpen/WithSeekOption/AccountReadError === RUN TestReOpen/UnknownSize === RUN TestReOpen/UnknownSize/Basics 2026/10/07 01:05:03 DEBUG : potato: Seek from 9 to 0 === RUN TestReOpen/UnknownSize/ErrorAtStart === RUN TestReOpen/UnknownSize/WithErrors 2026/10/07 01:05:03 DEBUG : potato: Reopening on read failure after offset 2 bytes: retry 1/10: test error 2026/10/07 01:05:03 DEBUG : potato: Reopening on read failure after offset 3 bytes: retry 2/10: test error 2026/10/07 01:05:03 DEBUG : potato: Reopening on read failure after offset 6 bytes: retry 3/10: test error === RUN TestReOpen/UnknownSize/TooManyErrors 2026/10/07 01:05:03 DEBUG : potato: Reopening on read failure after offset 2 bytes: retry 1/3: test error 2026/10/07 01:05:03 DEBUG : potato: Reopening on read failure after offset 3 bytes: retry 2/3: test error 2026/10/07 01:05:03 DEBUG : potato: Reopening on read failure after offset 6 bytes: retry 3/3: test error 2026/10/07 01:05:03 DEBUG : potato: Reopen failed after offset 6 bytes read: failed to reopen: too many retries === RUN TestReOpen/UnknownSize/ReadAt 2026/10/07 01:05:03 DEBUG : potato: Reopening on read failure after offset 2 bytes: retry 0/10: test error 2026/10/07 01:05:03 DEBUG : potato: Reopening on read failure after offset 3 bytes: retry 1/10: test error 2026/10/07 01:05:03 DEBUG : potato: Seek from 5 to 1 === RUN TestReOpen/UnknownSize/Seek 2026/10/07 01:05:03 DEBUG : potato: Reopening on read failure after offset 2 bytes: retry 0/10: test error 2026/10/07 01:05:03 DEBUG : potato: Reopening on read failure after offset 3 bytes: retry 1/10: test error 2026/10/07 01:05:03 DEBUG : potato: Seek from 5 to 2 2026/10/07 01:05:03 DEBUG : potato: Seek from 7 to 6 === RUN TestReOpen/UnknownSize/AccountRead === RUN TestReOpen/UnknownSize/AccountReadDelay 2026/10/07 01:05:03 DEBUG : potato: Seek from 9 to 0 2026/10/07 01:05:03 DEBUG : potato: Seek from 9 to 0 2026/10/07 01:05:03 DEBUG : potato: Seek from 9 to 0 === RUN TestReOpen/UnknownSize/AccountReadError --- PASS: TestReOpen (0.00s) --- PASS: TestReOpen/Normal (0.00s) --- PASS: TestReOpen/Normal/Basics (0.00s) --- PASS: TestReOpen/Normal/ErrorAtStart (0.00s) --- PASS: TestReOpen/Normal/WithErrors (0.00s) --- PASS: TestReOpen/Normal/TooManyErrors (0.00s) --- PASS: TestReOpen/Normal/ReadAt (0.00s) --- PASS: TestReOpen/Normal/Seek (0.00s) --- PASS: TestReOpen/Normal/AccountRead (0.00s) --- PASS: TestReOpen/Normal/AccountReadDelay (0.00s) --- PASS: TestReOpen/Normal/AccountReadError (0.00s) --- PASS: TestReOpen/WithRangeOption (0.00s) --- PASS: TestReOpen/WithRangeOption/Basics (0.00s) --- PASS: TestReOpen/WithRangeOption/ErrorAtStart (0.00s) --- PASS: TestReOpen/WithRangeOption/WithErrors (0.00s) --- PASS: TestReOpen/WithRangeOption/TooManyErrors (0.00s) --- PASS: TestReOpen/WithRangeOption/ReadAt (0.00s) --- PASS: TestReOpen/WithRangeOption/Seek (0.00s) --- PASS: TestReOpen/WithRangeOption/AccountRead (0.00s) --- PASS: TestReOpen/WithRangeOption/AccountReadDelay (0.00s) --- PASS: TestReOpen/WithRangeOption/AccountReadError (0.00s) --- PASS: TestReOpen/WithSeekOption (0.00s) --- PASS: TestReOpen/WithSeekOption/Basics (0.00s) --- PASS: TestReOpen/WithSeekOption/ErrorAtStart (0.00s) --- PASS: TestReOpen/WithSeekOption/WithErrors (0.00s) --- PASS: TestReOpen/WithSeekOption/TooManyErrors (0.00s) --- PASS: TestReOpen/WithSeekOption/ReadAt (0.00s) --- PASS: TestReOpen/WithSeekOption/Seek (0.00s) --- PASS: TestReOpen/WithSeekOption/AccountRead (0.00s) --- PASS: TestReOpen/WithSeekOption/AccountReadDelay (0.00s) --- PASS: TestReOpen/WithSeekOption/AccountReadError (0.00s) --- PASS: TestReOpen/UnknownSize (0.00s) --- PASS: TestReOpen/UnknownSize/Basics (0.00s) --- PASS: TestReOpen/UnknownSize/ErrorAtStart (0.00s) --- PASS: TestReOpen/UnknownSize/WithErrors (0.00s) --- PASS: TestReOpen/UnknownSize/TooManyErrors (0.00s) --- PASS: TestReOpen/UnknownSize/ReadAt (0.00s) --- PASS: TestReOpen/UnknownSize/Seek (0.00s) --- PASS: TestReOpen/UnknownSize/AccountRead (0.00s) --- PASS: TestReOpen/UnknownSize/AccountReadDelay (0.00s) --- PASS: TestReOpen/UnknownSize/AccountReadError (0.00s) === RUN TestCheck run.go:198: Remote "pcloud root 'rclone-test-kiziruq4votu'", Local "Local file system at /tmp/rclone148111752", Modify Window "1s" === RUN TestCheck/1 === RUN TestCheck/2 === RUN TestCheck/3 === RUN TestCheck/4 === RUN TestCheck/5 === RUN TestCheck/6 === RUN TestCheck/7 --- PASS: TestCheck (4.64s) --- PASS: TestCheck/1 (0.19s) --- PASS: TestCheck/2 (0.19s) --- PASS: TestCheck/3 (0.19s) --- PASS: TestCheck/4 (0.21s) --- PASS: TestCheck/5 (0.20s) --- PASS: TestCheck/6 (0.20s) --- PASS: TestCheck/7 (0.20s) === RUN TestCheckFsError 2026/10/07 01:05:07 DEBUG : Creating backend with remote "nonexistent" 2026/10/07 01:05:07 DEBUG : Creating backend with remote "nonexistent" 2026/10/07 01:05:07 DEBUG : Local file system at nonexistent: Waiting for checks to finish 2026/10/07 01:05:07 ERROR : Local file system at nonexistent: error reading source root directory: directory not found 2026/10/07 01:05:07 NOTICE: Local file system at nonexistent: 0 differences found 2026/10/07 01:05:07 NOTICE: Local file system at nonexistent: 2 errors while checking --- PASS: TestCheckFsError (0.00s) === RUN TestCheckDownload run.go:198: Remote "pcloud root 'rclone-test-kiziruq4votu'", Local "Local file system at /tmp/rclone148111752", Modify Window "1s" === RUN TestCheckDownload/1 === RUN TestCheckDownload/2 === RUN TestCheckDownload/3 === RUN TestCheckDownload/4 === RUN TestCheckDownload/5 === RUN TestCheckDownload/6 === RUN TestCheckDownload/7 --- PASS: TestCheckDownload (7.18s) --- PASS: TestCheckDownload/1 (0.27s) --- PASS: TestCheckDownload/2 (0.20s) --- PASS: TestCheckDownload/3 (0.39s) --- PASS: TestCheckDownload/4 (0.24s) --- PASS: TestCheckDownload/5 (0.21s) --- PASS: TestCheckDownload/6 (0.22s) --- PASS: TestCheckDownload/7 (0.22s) === RUN TestCheckSizeOnly run.go:198: Remote "pcloud root 'rclone-test-kiziruq4votu'", Local "Local file system at /tmp/rclone148111752", Modify Window "1s" === RUN TestCheckSizeOnly/1 === RUN TestCheckSizeOnly/2 === RUN TestCheckSizeOnly/3 === RUN TestCheckSizeOnly/4 === RUN TestCheckSizeOnly/5 === NAME TestCheckSizeOnly fstest.go:299: Sleeping for 1s for list eventual consistency: 1/3 fstest.go:302: Flushing the directory cache fstest.go:293: Sleeping for 6s just to make sure === RUN TestCheckSizeOnly/6 === RUN TestCheckSizeOnly/7 --- PASS: TestCheckSizeOnly (20.28s) --- PASS: TestCheckSizeOnly/1 (0.09s) --- PASS: TestCheckSizeOnly/2 (0.09s) --- PASS: TestCheckSizeOnly/3 (0.09s) --- PASS: TestCheckSizeOnly/4 (0.09s) --- PASS: TestCheckSizeOnly/5 (0.10s) --- PASS: TestCheckSizeOnly/6 (0.10s) --- PASS: TestCheckSizeOnly/7 (0.09s) === RUN TestCheckEqualReaders --- PASS: TestCheckEqualReaders (0.00s) === RUN TestParseSumFile run.go:198: Remote "pcloud root 'rclone-test-kiziruq4votu'", Local "Local file system at /tmp/rclone148111752", Modify Window "1s" 2026/10/07 01:05:35 DEBUG : Couldn't parse Date: from server ecph1.pcloud.com: "Wed, 07 Oct 2026 01:05:35 +0000": parsing time "Wed, 07 Oct 2026 01:05:35 +0000" as "Mon Jan _2 15:04:05 2006": cannot parse ", 07 Oct 2026 01:05:35 +0000" as " " 2026/10/07 01:05:35 NOTICE: test.sum: improperly formatted checksum line 4 2026/10/07 01:05:35 NOTICE: test.sum: improperly formatted checksum line 5 2026/10/07 01:05:35 NOTICE: test.sum: improperly formatted checksum line 6 2026/10/07 01:05:35 NOTICE: test.sum: 2 warning(s) suppressed... 2026/10/07 01:05:35 DEBUG : Couldn't parse Date: from server ecph1.pcloud.com: "Wed, 07 Oct 2026 01:05:35 +0000": parsing time "Wed, 07 Oct 2026 01:05:35 +0000" as "Mon Jan _2 15:04:05 2006": cannot parse ", 07 Oct 2026 01:05:35 +0000" as " " 2026/10/07 01:05:35 NOTICE: test.sum: improperly formatted checksum line 4 2026/10/07 01:05:35 NOTICE: test.sum: improperly formatted checksum line 5 2026/10/07 01:05:35 NOTICE: test.sum: improperly formatted checksum line 6 2026/10/07 01:05:35 NOTICE: test.sum: 2 warning(s) suppressed... --- PASS: TestParseSumFile (0.91s) === RUN TestCheckSum run.go:198: Remote "pcloud root 'rclone-test-kiziruq4votu'", Local "Local file system at /tmp/rclone148111752", Modify Window "1s" 2026/10/07 01:05:36 DEBUG : Creating backend with remote "TestPcloud:rclone-test-kiziruq4votu/data" 2026/10/07 01:05:36 DEBUG : Config file has changed externally - reloading check_test.go:354: pcloud root 'rclone-test-kiziruq4votu/data' lacks md5, skipping --- SKIP: TestCheckSum (3.84s) === RUN TestCheckSumDownload run.go:198: Remote "pcloud root 'rclone-test-kiziruq4votu'", Local "Local file system at /tmp/rclone148111752", Modify Window "1s" 2026/10/07 01:05:39 DEBUG : Creating backend with remote "TestPcloud:rclone-test-kiziruq4votu/data" === RUN TestCheckSumDownload/subtest1 === RUN TestCheckSumDownload/subtest2 === RUN TestCheckSumDownload/subtest3 === RUN TestCheckSumDownload/subtest4 === NAME TestCheckSumDownload fstest.go:299: Sleeping for 1s for list eventual consistency: 1/3 fstest.go:302: Flushing the directory cache fstest.go:293: Sleeping for 6s just to make sure === RUN TestCheckSumDownload/subtest5 === RUN TestCheckSumDownload/subtest6 === NAME TestCheckSumDownload fstest.go:299: Sleeping for 1s for list eventual consistency: 1/3 fstest.go:302: Flushing the directory cache fstest.go:293: Sleeping for 6s just to make sure === RUN TestCheckSumDownload/subtest7 --- PASS: TestCheckSumDownload (35.01s) --- PASS: TestCheckSumDownload/subtest1 (0.54s) --- PASS: TestCheckSumDownload/subtest2 (0.42s) --- PASS: TestCheckSumDownload/subtest3 (0.43s) --- PASS: TestCheckSumDownload/subtest4 (0.49s) --- PASS: TestCheckSumDownload/subtest5 (0.42s) --- PASS: TestCheckSumDownload/subtest6 (0.42s) --- PASS: TestCheckSumDownload/subtest7 (0.42s) === RUN TestCheckSumConcurrency 2026/10/07 01:06:15 DEBUG : file0: md5 = 022eb0c0085c731f335df970fafa7446 OK 2026/10/07 01:06:15 DEBUG : file2: md5 = a58f09ae3db8ae4b943fdbaace096072 OK 2026/10/07 01:06:15 DEBUG : file3: md5 = e0639b17e0744aca9a3ba29c049e59ee OK 2026/10/07 01:06:15 DEBUG : file1: md5 = 17fbabbccbdea0e6be9eb64c8c6fea41 OK 2026/10/07 01:06:15 NOTICE: Mock file system at checkSum: 0 differences found 2026/10/07 01:06:15 NOTICE: Mock file system at checkSum: 4 matching files --- PASS: TestCheckSumConcurrency (0.00s) === RUN TestCheckSumDownloadConcurrency 2026/10/07 01:06:15 DEBUG : file0: md5 = 022eb0c0085c731f335df970fafa7446 OK 2026/10/07 01:06:15 DEBUG : file1: md5 = 17fbabbccbdea0e6be9eb64c8c6fea41 OK 2026/10/07 01:06:15 DEBUG : file2: md5 = a58f09ae3db8ae4b943fdbaace096072 OK 2026/10/07 01:06:15 DEBUG : file3: md5 = e0639b17e0744aca9a3ba29c049e59ee OK 2026/10/07 01:06:15 NOTICE: Mock file system at checkSum: 0 differences found 2026/10/07 01:06:15 NOTICE: Mock file system at checkSum: 4 matching files --- PASS: TestCheckSumDownloadConcurrency (0.00s) === RUN TestApplyTransforms 2026/10/07 01:06:15 DEBUG : Creating backend with remote "TestPcloud:rclone-test-bavafuq4buju" 2026/10/07 01:06:15 DEBUG : Using config file from "/home/rclone/.rclone.conf" 2026/10/07 01:06:16 DEBUG : Creating backend with remote "/tmp/rclone1718513870" run.go:198: Remote "pcloud root 'rclone-test-bavafuq4buju'", Local "Local file system at /tmp/rclone1718513870", Modify Window "1s" upper checkfile vs. lower remote (without normalization) 2026/10/07 01:06:17 ERROR : HELLO, WORLD!: file not in pcloud root 'rclone-test-bavafuq4buju' 2026/10/07 01:06:17 NOTICE: pcloud root 'rclone-test-bavafuq4buju': 1 files missing 2026/10/07 01:06:17 NOTICE: pcloud root 'rclone-test-bavafuq4buju': 0 differences found 2026/10/07 01:06:17 NOTICE: pcloud root 'rclone-test-bavafuq4buju': 1 errors while checking upper checkfile vs. lower remote (with normalization) 2026/10/07 01:06:18 ERROR : hello, world!: file not in pcloud root 'rclone-test-bavafuq4buju' 2026/10/07 01:06:18 NOTICE: pcloud root 'rclone-test-bavafuq4buju': 1 files missing 2026/10/07 01:06:18 NOTICE: pcloud root 'rclone-test-bavafuq4buju': 0 differences found 2026/10/07 01:06:18 NOTICE: pcloud root 'rclone-test-bavafuq4buju': 1 errors while checking check_test.go:709: Error Trace: /home/rclone/go/src/github.com/rclone/rclone/fs/operations/check_test.go:709 /home/rclone/go/src/github.com/rclone/rclone/fs/operations/check_test.go:712 Error: Received unexpected error: file not in pcloud root 'rclone-test-bavafuq4buju' Test: TestApplyTransforms Messages: unexpected error for upper checkfile vs. lower remote (with normalization) HELLO, WORLD! hello, world! 2026/10/07 01:06:18 DEBUG : Creating backend with remote "TestPcloud:rclone-test-mufeqiq6kaji" 2026/10/07 01:06:18 DEBUG : Using config file from "/home/rclone/.rclone.conf" 2026/10/07 01:06:20 DEBUG : Creating backend with remote "/tmp/rclone1388056189" run.go:198: Remote "pcloud root 'rclone-test-mufeqiq6kaji'", Local "Local file system at /tmp/rclone1388056189", Modify Window "1s" lower checkfile vs. upper remote (without normalization) 2026/10/07 01:06:21 ERROR : HELLO, WORLD!: sum not found 2026/10/07 01:06:21 ERROR : hello, world!: file not in pcloud root 'rclone-test-mufeqiq6kaji' 2026/10/07 01:06:21 NOTICE: pcloud root 'rclone-test-mufeqiq6kaji': 1 files missing 2026/10/07 01:06:21 NOTICE: 1 hashes missing 2026/10/07 01:06:21 NOTICE: pcloud root 'rclone-test-mufeqiq6kaji': 1 differences found 2026/10/07 01:06:21 NOTICE: pcloud root 'rclone-test-mufeqiq6kaji': 2 errors while checking lower checkfile vs. upper remote (with normalization) 2026/10/07 01:06:22 DEBUG : Couldn't parse Date: from server ecph1.pcloud.com: "Wed, 07 Oct 2026 01:06:22 +0000": parsing time "Wed, 07 Oct 2026 01:06:22 +0000" as "Mon Jan _2 15:04:05 2006": cannot parse ", 07 Oct 2026 01:06:22 +0000" as " " 2026/10/07 01:06:22 DEBUG : HELLO, WORLD!: md5 = 65a8e27d8879283831b664bd8b7f0ad4 OK 2026/10/07 01:06:22 NOTICE: pcloud root 'rclone-test-mufeqiq6kaji': 0 differences found 2026/10/07 01:06:22 NOTICE: pcloud root 'rclone-test-mufeqiq6kaji': 1 matching files 2026/10/07 01:06:22 DEBUG : Creating backend with remote "TestPcloud:rclone-test-cebefap2quqa" 2026/10/07 01:06:22 DEBUG : Using config file from "/home/rclone/.rclone.conf" 2026/10/07 01:06:23 DEBUG : Creating backend with remote "/tmp/rclone58720095" run.go:198: Remote "pcloud root 'rclone-test-cebefap2quqa'", Local "Local file system at /tmp/rclone58720095", Modify Window "1s" lower checkfile vs. upperlowermixed remote (without normalization) 2026/10/07 01:06:24 ERROR : HeLlO, wOrLd!: sum not found 2026/10/07 01:06:24 ERROR : hello, world!: file not in pcloud root 'rclone-test-cebefap2quqa' 2026/10/07 01:06:24 NOTICE: pcloud root 'rclone-test-cebefap2quqa': 1 files missing 2026/10/07 01:06:24 NOTICE: 1 hashes missing 2026/10/07 01:06:24 NOTICE: pcloud root 'rclone-test-cebefap2quqa': 1 differences found 2026/10/07 01:06:24 NOTICE: pcloud root 'rclone-test-cebefap2quqa': 2 errors while checking lower checkfile vs. upperlowermixed remote (with normalization) 2026/10/07 01:06:24 DEBUG : Couldn't parse Date: from server ecph1.pcloud.com: "Wed, 07 Oct 2026 01:06:24 +0000": parsing time "Wed, 07 Oct 2026 01:06:24 +0000" as "Mon Jan _2 15:04:05 2006": cannot parse ", 07 Oct 2026 01:06:24 +0000" as " " 2026/10/07 01:06:24 DEBUG : HeLlO, wOrLd!: md5 = 65a8e27d8879283831b664bd8b7f0ad4 OK 2026/10/07 01:06:24 NOTICE: pcloud root 'rclone-test-cebefap2quqa': 0 differences found 2026/10/07 01:06:24 NOTICE: pcloud root 'rclone-test-cebefap2quqa': 1 matching files 2026/10/07 01:06:24 DEBUG : Creating backend with remote "TestPcloud:rclone-test-wajizaf4soye" 2026/10/07 01:06:24 DEBUG : Using config file from "/home/rclone/.rclone.conf" 2026/10/07 01:06:27 DEBUG : Creating backend with remote "/tmp/rclone1149923480" run.go:198: Remote "pcloud root 'rclone-test-wajizaf4soye'", Local "Local file system at /tmp/rclone1149923480", Modify Window "1s" upperlowermixed checkfile vs. upper remote (without normalization) 2026/10/07 01:06:28 ERROR : HELLO, WORLD!: sum not found 2026/10/07 01:06:28 ERROR : HeLlO, wOrLd!: file not in pcloud root 'rclone-test-wajizaf4soye' 2026/10/07 01:06:28 NOTICE: pcloud root 'rclone-test-wajizaf4soye': 1 files missing 2026/10/07 01:06:28 NOTICE: 1 hashes missing 2026/10/07 01:06:28 NOTICE: pcloud root 'rclone-test-wajizaf4soye': 1 differences found 2026/10/07 01:06:28 NOTICE: pcloud root 'rclone-test-wajizaf4soye': 2 errors while checking upperlowermixed checkfile vs. upper remote (with normalization) 2026/10/07 01:06:28 DEBUG : Couldn't parse Date: from server ecph1.pcloud.com: "Wed, 07 Oct 2026 01:06:28 +0000": parsing time "Wed, 07 Oct 2026 01:06:28 +0000" as "Mon Jan _2 15:04:05 2006": cannot parse ", 07 Oct 2026 01:06:28 +0000" as " " 2026/10/07 01:06:28 DEBUG : HELLO, WORLD!: md5 = 65a8e27d8879283831b664bd8b7f0ad4 OK 2026/10/07 01:06:28 NOTICE: pcloud root 'rclone-test-wajizaf4soye': 0 differences found 2026/10/07 01:06:28 NOTICE: pcloud root 'rclone-test-wajizaf4soye': 1 matching files 2026/10/07 01:06:28 DEBUG : Creating backend with remote "TestPcloud:rclone-test-laxilot4coda" 2026/10/07 01:06:28 DEBUG : Using config file from "/home/rclone/.rclone.conf" 2026/10/07 01:06:29 DEBUG : Creating backend with remote "/tmp/rclone1180044452" run.go:198: Remote "pcloud root 'rclone-test-laxilot4coda'", Local "Local file system at /tmp/rclone1180044452", Modify Window "1s" NFD checkfile vs. NFC remote (without normalization) 2026/10/07 01:06:30 ERROR : 測試_Русский___ě_áñ: sum not found 2026/10/07 01:06:30 ERROR : 測試_Русский___ě_áñ: file not in pcloud root 'rclone-test-laxilot4coda' 2026/10/07 01:06:30 NOTICE: pcloud root 'rclone-test-laxilot4coda': 1 files missing 2026/10/07 01:06:30 NOTICE: 1 hashes missing 2026/10/07 01:06:30 NOTICE: pcloud root 'rclone-test-laxilot4coda': 1 differences found 2026/10/07 01:06:30 NOTICE: pcloud root 'rclone-test-laxilot4coda': 2 errors while checking NFD checkfile vs. NFC remote (with normalization) 2026/10/07 01:06:30 DEBUG : Couldn't parse Date: from server ecph1.pcloud.com: "Wed, 07 Oct 2026 01:06:30 +0000": parsing time "Wed, 07 Oct 2026 01:06:30 +0000" as "Mon Jan _2 15:04:05 2006": cannot parse ", 07 Oct 2026 01:06:30 +0000" as " " 2026/10/07 01:06:30 DEBUG : 測試_Русский___ě_áñ: md5 = 65a8e27d8879283831b664bd8b7f0ad4 OK 2026/10/07 01:06:30 NOTICE: pcloud root 'rclone-test-laxilot4coda': 0 differences found 2026/10/07 01:06:30 NOTICE: pcloud root 'rclone-test-laxilot4coda': 1 matching files 2026/10/07 01:06:30 DEBUG : Creating backend with remote "TestPcloud:rclone-test-safonec6rozi" 2026/10/07 01:06:30 DEBUG : Using config file from "/home/rclone/.rclone.conf" 2026/10/07 01:06:31 DEBUG : Creating backend with remote "/tmp/rclone2745210529" run.go:198: Remote "pcloud root 'rclone-test-safonec6rozi'", Local "Local file system at /tmp/rclone2745210529", Modify Window "1s" NFC checkfile vs. NFD remote (without normalization) 2026/10/07 01:06:32 ERROR : 測試_Русский___ě_áñ: sum not found 2026/10/07 01:06:32 ERROR : 測試_Русский___ě_áñ: file not in pcloud root 'rclone-test-safonec6rozi' 2026/10/07 01:06:32 NOTICE: pcloud root 'rclone-test-safonec6rozi': 1 files missing 2026/10/07 01:06:32 NOTICE: 1 hashes missing 2026/10/07 01:06:32 NOTICE: pcloud root 'rclone-test-safonec6rozi': 1 differences found 2026/10/07 01:06:32 NOTICE: pcloud root 'rclone-test-safonec6rozi': 2 errors while checking NFC checkfile vs. NFD remote (with normalization) 2026/10/07 01:06:32 DEBUG : Couldn't parse Date: from server ecph1.pcloud.com: "Wed, 07 Oct 2026 01:06:32 +0000": parsing time "Wed, 07 Oct 2026 01:06:32 +0000" as "Mon Jan _2 15:04:05 2006": cannot parse ", 07 Oct 2026 01:06:32 +0000" as " " 2026/10/07 01:06:32 DEBUG : 測試_Русский___ě_áñ: md5 = 65a8e27d8879283831b664bd8b7f0ad4 OK 2026/10/07 01:06:32 NOTICE: pcloud root 'rclone-test-safonec6rozi': 0 differences found 2026/10/07 01:06:32 NOTICE: pcloud root 'rclone-test-safonec6rozi': 1 matching files 2026/10/07 01:06:32 DEBUG : Creating backend with remote "TestPcloud:rclone-test-wekaqar0deki" 2026/10/07 01:06:32 DEBUG : Using config file from "/home/rclone/.rclone.conf" 2026/10/07 01:06:34 DEBUG : Creating backend with remote "/tmp/rclone282391240" run.go:198: Remote "pcloud root 'rclone-test-wekaqar0deki'", Local "Local file system at /tmp/rclone282391240", Modify Window "1s" NFDx2 checkfile vs. both remote (without normalization) 2026/10/07 01:06:35 ERROR : 測試_Русский___ě_áñ測試_Русский___ě_áñ: sum not found 2026/10/07 01:06:35 ERROR : 測試_Русский___ě_áñ測試_Русский___ě_áñ: file not in pcloud root 'rclone-test-wekaqar0deki' 2026/10/07 01:06:35 NOTICE: pcloud root 'rclone-test-wekaqar0deki': 1 files missing 2026/10/07 01:06:35 NOTICE: 1 hashes missing 2026/10/07 01:06:35 NOTICE: pcloud root 'rclone-test-wekaqar0deki': 1 differences found 2026/10/07 01:06:35 NOTICE: pcloud root 'rclone-test-wekaqar0deki': 2 errors while checking NFDx2 checkfile vs. both remote (with normalization) 2026/10/07 01:06:35 DEBUG : Couldn't parse Date: from server ecph1.pcloud.com: "Wed, 07 Oct 2026 01:06:35 +0000": parsing time "Wed, 07 Oct 2026 01:06:35 +0000" as "Mon Jan _2 15:04:05 2006": cannot parse ", 07 Oct 2026 01:06:35 +0000" as " " 2026/10/07 01:06:35 DEBUG : 測試_Русский___ě_áñ測試_Русский___ě_áñ: md5 = 65a8e27d8879283831b664bd8b7f0ad4 OK 2026/10/07 01:06:35 NOTICE: pcloud root 'rclone-test-wekaqar0deki': 0 differences found 2026/10/07 01:06:35 NOTICE: pcloud root 'rclone-test-wekaqar0deki': 1 matching files 2026/10/07 01:06:35 DEBUG : Creating backend with remote "TestPcloud:rclone-test-juvanar6zami" 2026/10/07 01:06:35 DEBUG : Using config file from "/home/rclone/.rclone.conf" 2026/10/07 01:06:36 DEBUG : Creating backend with remote "/tmp/rclone1170051868" run.go:198: Remote "pcloud root 'rclone-test-juvanar6zami'", Local "Local file system at /tmp/rclone1170051868", Modify Window "1s" NFCx2 checkfile vs. both remote (without normalization) 2026/10/07 01:06:38 ERROR : 測試_Русский___ě_áñ測試_Русский___ě_áñ: sum not found 2026/10/07 01:06:38 ERROR : 測試_Русский___ě_áñ測試_Русский___ě_áñ: file not in pcloud root 'rclone-test-juvanar6zami' 2026/10/07 01:06:38 NOTICE: pcloud root 'rclone-test-juvanar6zami': 1 files missing 2026/10/07 01:06:38 NOTICE: 1 hashes missing 2026/10/07 01:06:38 NOTICE: pcloud root 'rclone-test-juvanar6zami': 1 differences found 2026/10/07 01:06:38 NOTICE: pcloud root 'rclone-test-juvanar6zami': 2 errors while checking NFCx2 checkfile vs. both remote (with normalization) 2026/10/07 01:06:38 DEBUG : Couldn't parse Date: from server ecph1.pcloud.com: "Wed, 07 Oct 2026 01:06:38 +0000": parsing time "Wed, 07 Oct 2026 01:06:38 +0000" as "Mon Jan _2 15:04:05 2006": cannot parse ", 07 Oct 2026 01:06:38 +0000" as " " 2026/10/07 01:06:38 DEBUG : 測試_Русский___ě_áñ測試_Русский___ě_áñ: md5 = 65a8e27d8879283831b664bd8b7f0ad4 OK 2026/10/07 01:06:38 NOTICE: pcloud root 'rclone-test-juvanar6zami': 0 differences found 2026/10/07 01:06:38 NOTICE: pcloud root 'rclone-test-juvanar6zami': 1 matching files 2026/10/07 01:06:38 DEBUG : Creating backend with remote "TestPcloud:rclone-test-bicabiy6mape" 2026/10/07 01:06:38 DEBUG : Using config file from "/home/rclone/.rclone.conf" 2026/10/07 01:06:39 DEBUG : Creating backend with remote "/tmp/rclone693510523" run.go:198: Remote "pcloud root 'rclone-test-bicabiy6mape'", Local "Local file system at /tmp/rclone693510523", Modify Window "1s" both checkfile vs. NFDx2 remote (without normalization) 2026/10/07 01:06:40 ERROR : 測試_Русский___ě_áñ測試_Русский___ě_áñ: sum not found 2026/10/07 01:06:40 ERROR : 測試_Русский___ě_áñ測試_Русский___ě_áñ: file not in pcloud root 'rclone-test-bicabiy6mape' 2026/10/07 01:06:40 NOTICE: pcloud root 'rclone-test-bicabiy6mape': 1 files missing 2026/10/07 01:06:40 NOTICE: 1 hashes missing 2026/10/07 01:06:40 NOTICE: pcloud root 'rclone-test-bicabiy6mape': 1 differences found 2026/10/07 01:06:40 NOTICE: pcloud root 'rclone-test-bicabiy6mape': 2 errors while checking both checkfile vs. NFDx2 remote (with normalization) 2026/10/07 01:06:41 DEBUG : Couldn't parse Date: from server ecph1.pcloud.com: "Wed, 07 Oct 2026 01:06:41 +0000": parsing time "Wed, 07 Oct 2026 01:06:41 +0000" as "Mon Jan _2 15:04:05 2006": cannot parse ", 07 Oct 2026 01:06:41 +0000" as " " 2026/10/07 01:06:41 DEBUG : 測試_Русский___ě_áñ測試_Русский___ě_áñ: md5 = 65a8e27d8879283831b664bd8b7f0ad4 OK 2026/10/07 01:06:41 NOTICE: pcloud root 'rclone-test-bicabiy6mape': 0 differences found 2026/10/07 01:06:41 NOTICE: pcloud root 'rclone-test-bicabiy6mape': 1 matching files 2026/10/07 01:06:41 DEBUG : Creating backend with remote "TestPcloud:rclone-test-bipidib6yosu" 2026/10/07 01:06:41 DEBUG : Using config file from "/home/rclone/.rclone.conf" 2026/10/07 01:06:42 DEBUG : Creating backend with remote "/tmp/rclone336289546" run.go:198: Remote "pcloud root 'rclone-test-bipidib6yosu'", Local "Local file system at /tmp/rclone336289546", Modify Window "1s" both checkfile vs. NFCx2 remote (without normalization) 2026/10/07 01:06:42 ERROR : 測試_Русский___ě_áñ測試_Русский___ě_áñ: sum not found 2026/10/07 01:06:42 ERROR : 測試_Русский___ě_áñ測試_Русский___ě_áñ: file not in pcloud root 'rclone-test-bipidib6yosu' 2026/10/07 01:06:42 NOTICE: pcloud root 'rclone-test-bipidib6yosu': 1 files missing 2026/10/07 01:06:42 NOTICE: 1 hashes missing 2026/10/07 01:06:42 NOTICE: pcloud root 'rclone-test-bipidib6yosu': 1 differences found 2026/10/07 01:06:42 NOTICE: pcloud root 'rclone-test-bipidib6yosu': 2 errors while checking both checkfile vs. NFCx2 remote (with normalization) 2026/10/07 01:06:43 DEBUG : Couldn't parse Date: from server ecph1.pcloud.com: "Wed, 07 Oct 2026 01:06:43 +0000": parsing time "Wed, 07 Oct 2026 01:06:43 +0000" as "Mon Jan _2 15:04:05 2006": cannot parse ", 07 Oct 2026 01:06:43 +0000" as " " 2026/10/07 01:06:43 DEBUG : 測試_Русский___ě_áñ測試_Русский___ě_áñ: md5 = 65a8e27d8879283831b664bd8b7f0ad4 OK 2026/10/07 01:06:43 NOTICE: pcloud root 'rclone-test-bipidib6yosu': 0 differences found 2026/10/07 01:06:43 NOTICE: pcloud root 'rclone-test-bipidib6yosu': 1 matching files 2026/10/07 01:06:43 DEBUG : pcloud root 'rclone-test-bipidib6yosu': Purge remote 2026/10/07 01:06:43 DEBUG : pcloud root 'rclone-test-bicabiy6mape': Purge remote 2026/10/07 01:06:43 DEBUG : pcloud root 'rclone-test-juvanar6zami': Purge remote 2026/10/07 01:06:43 DEBUG : pcloud root 'rclone-test-wekaqar0deki': Purge remote 2026/10/07 01:06:43 DEBUG : pcloud root 'rclone-test-safonec6rozi': Purge remote 2026/10/07 01:06:43 DEBUG : pcloud root 'rclone-test-laxilot4coda': Purge remote 2026/10/07 01:06:44 DEBUG : pcloud root 'rclone-test-wajizaf4soye': Purge remote 2026/10/07 01:06:44 DEBUG : pcloud root 'rclone-test-cebefap2quqa': Purge remote 2026/10/07 01:06:44 DEBUG : pcloud root 'rclone-test-mufeqiq6kaji': Purge remote 2026/10/07 01:06:44 DEBUG : pcloud root 'rclone-test-bavafuq4buju': Purge remote --- FAIL: TestApplyTransforms (29.47s) === RUN TestTruncateString --- PASS: TestTruncateString (0.00s) === RUN TestCopyFile run.go:198: Remote "pcloud root 'rclone-test-kiziruq4votu'", Local "Local file system at /tmp/rclone148111752", Modify Window "1s" 2026/10/07 01:06:44 DEBUG : file1: Need to transfer - File not found at Destination 2026/10/07 01:06:44 DEBUG : sub/file2.3cb2966d.partial: size = 14 OK 2026/10/07 01:06:44 DEBUG : file1: sha1 = a379624177abc4679cafafa8eae1d73e1478aaa6 OK 2026/10/07 01:06:45 DEBUG : sub/file2.3cb2966d.partial: renamed to: sub/file2 2026/10/07 01:06:45 INFO : file1: Copied (new) to: sub/file2 2026/10/07 01:06:45 DEBUG : sub/file2: size = 14 OK 2026/10/07 01:06:45 DEBUG : file1: Size and modification time the same (differ by -499.999999ms, within tolerance 1s) 2026/10/07 01:06:45 DEBUG : file1: Unchanged skipping 2026/10/07 01:06:45 DEBUG : pcloud root 'rclone-test-kiziruq4votu': don't need to copy/move sub/file2, it is already at target location --- PASS: TestCopyFile (1.62s) === RUN TestCopyFileImmutable run.go:198: Remote "pcloud root 'rclone-test-kiziruq4votu'", Local "Local file system at /tmp/rclone148111752", Modify Window "1s" 2026/10/07 01:06:46 DEBUG : existing: Need to transfer - File not found at Destination 2026/10/07 01:06:46 DEBUG : existing.f29ecfde.partial: size = 6 OK 2026/10/07 01:06:46 DEBUG : existing: sha1 = 3e2e95f5ad970eadfa7e17eaf73da97024aa5359 OK 2026/10/07 01:06:46 DEBUG : existing.f29ecfde.partial: renamed to: existing 2026/10/07 01:06:46 INFO : existing: Copied (new) 2026/10/07 01:06:46 DEBUG : existing: size = 6 OK 2026/10/07 01:06:46 DEBUG : existing: Size and modification time the same (differ by -499.999999ms, within tolerance 1s) 2026/10/07 01:06:46 DEBUG : existing: Unchanged skipping 2026/10/07 01:06:46 DEBUG : existing: size = 8 (Local file system at /tmp/rclone148111752) 2026/10/07 01:06:46 DEBUG : existing: size = 6 (pcloud root 'rclone-test-kiziruq4votu') 2026/10/07 01:06:46 DEBUG : existing: Sizes differ 2026/10/07 01:06:46 ERROR : existing: Source and destination exist but do not match: immutable file modified --- PASS: TestCopyFileImmutable (1.58s) === RUN TestCopyLongFile run.go:198: Remote "pcloud root 'rclone-test-kiziruq4votu'", Local "Local file system at /tmp/rclone148111752", Modify Window "1s" copy_test.go:188: Test only runs on local --- SKIP: TestCopyLongFile (0.19s) === RUN TestCopyFileBackupDir run.go:198: Remote "pcloud root 'rclone-test-kiziruq4votu'", Local "Local file system at /tmp/rclone148111752", Modify Window "1s" 2026/10/07 01:06:48 DEBUG : Creating backend with remote "TestPcloud:rclone-test-kiziruq4votu/backup" 2026/10/07 01:06:49 DEBUG : dst/file1: size = 14 (Local file system at /tmp/rclone148111752) 2026/10/07 01:06:49 DEBUG : dst/file1: size = 18 (pcloud root 'rclone-test-kiziruq4votu') 2026/10/07 01:06:49 DEBUG : dst/file1: Sizes differ 2026/10/07 01:06:50 INFO : dst/file1: Moved (server-side) 2026/10/07 01:06:50 DEBUG : dst/file1.58903690.partial: size = 14 OK 2026/10/07 01:06:50 DEBUG : dst/file1: sha1 = a379624177abc4679cafafa8eae1d73e1478aaa6 OK 2026/10/07 01:06:50 DEBUG : dst/file1.58903690.partial: renamed to: dst/file1 2026/10/07 01:06:50 INFO : dst/file1: Copied (new) --- PASS: TestCopyFileBackupDir (3.54s) === RUN TestCopyFileCompareDest run.go:198: Remote "pcloud root 'rclone-test-kiziruq4votu'", Local "Local file system at /tmp/rclone148111752", Modify Window "1s" 2026/10/07 01:06:51 DEBUG : Creating backend with remote "TestPcloud:rclone-test-kiziruq4votu/dst" 2026/10/07 01:06:52 DEBUG : Creating backend with remote "TestPcloud:rclone-test-kiziruq4votu/CompareDest" 2026/10/07 01:06:53 DEBUG : one: Need to transfer - File not found at Destination 2026/10/07 01:06:54 DEBUG : one.b2cc3c6c.partial: size = 3 OK 2026/10/07 01:06:54 DEBUG : one: sha1 = fe05bcdcdc4928012781a5f1a2a77cbb5398e106 OK 2026/10/07 01:06:54 DEBUG : one.b2cc3c6c.partial: renamed to: one 2026/10/07 01:06:54 INFO : one: Copied (new) 2026/10/07 01:06:54 DEBUG : one: size = 5 (Local file system at /tmp/rclone148111752) 2026/10/07 01:06:54 DEBUG : one: size = 3 (pcloud root 'rclone-test-kiziruq4votu/dst') 2026/10/07 01:06:54 DEBUG : one: Sizes differ 2026/10/07 01:06:55 DEBUG : one.4a8516eb.partial: size = 5 OK 2026/10/07 01:06:55 DEBUG : one: sha1 = 7f376fd65843a1267de8f986d40e164e5a321c13 OK 2026/10/07 01:06:55 DEBUG : one.4a8516eb.partial: renamed to: one 2026/10/07 01:06:55 INFO : one: Copied (replaced existing) fstest.go:299: Sleeping for 1s for list eventual consistency: 1/3 fstest.go:302: Flushing the directory cache fstest.go:293: Sleeping for 6s just to make sure 2026/10/07 01:07:06 DEBUG : one: size = 5 (Local file system at /tmp/rclone148111752) 2026/10/07 01:07:06 DEBUG : one: size = 3 (pcloud root 'rclone-test-kiziruq4votu/dst') 2026/10/07 01:07:06 DEBUG : one: Sizes differ 2026/10/07 01:07:06 DEBUG : one: size = 5 OK 2026/10/07 01:07:06 DEBUG : one: Size and modification time the same (differ by -123.456789ms, within tolerance 1s) 2026/10/07 01:07:06 DEBUG : one: Destination found in --compare-dest, skipping 2026/10/07 01:07:07 DEBUG : two: Need to transfer - File not found at Destination 2026/10/07 01:07:07 DEBUG : two: size = 3 OK 2026/10/07 01:07:07 DEBUG : two: Size and modification time the same (differ by -123.456789ms, within tolerance 1s) 2026/10/07 01:07:07 DEBUG : two: Destination found in --compare-dest, skipping 2026/10/07 01:07:07 DEBUG : two: Need to transfer - File not found at Destination 2026/10/07 01:07:07 DEBUG : two: size = 3 OK 2026/10/07 01:07:07 DEBUG : two: Size and modification time the same (differ by -123.456789ms, within tolerance 1s) 2026/10/07 01:07:07 DEBUG : two: Destination found in --compare-dest, skipping 2026/10/07 01:07:08 DEBUG : two: Need to transfer - File not found at Destination 2026/10/07 01:07:08 DEBUG : two: size = 5 (Local file system at /tmp/rclone148111752) 2026/10/07 01:07:08 DEBUG : two: size = 3 (pcloud root 'rclone-test-kiziruq4votu/CompareDest') 2026/10/07 01:07:08 DEBUG : two: Sizes differ 2026/10/07 01:07:08 DEBUG : two.a319cd8b.partial: size = 5 OK 2026/10/07 01:07:08 DEBUG : two: sha1 = a4be8877ad88f3109a6411985a1f359e10e2d930 OK 2026/10/07 01:07:09 DEBUG : two.a319cd8b.partial: renamed to: two 2026/10/07 01:07:09 INFO : two: Copied (new) --- PASS: TestCopyFileCompareDest (19.08s) === RUN TestCopyFileCopyDestImmutable run.go:198: Remote "pcloud root 'rclone-test-kiziruq4votu'", Local "Local file system at /tmp/rclone148111752", Modify Window "1s" 2026/10/07 01:07:10 DEBUG : Creating backend with remote "TestPcloud:rclone-test-kiziruq4votu/dst" 2026/10/07 01:07:12 DEBUG : Creating backend with remote "TestPcloud:rclone-test-kiziruq4votu/CopyDest" 2026/10/07 01:07:13 DEBUG : one: size = 5 (Local file system at /tmp/rclone148111752) 2026/10/07 01:07:13 DEBUG : one: size = 3 (pcloud root 'rclone-test-kiziruq4votu/dst') 2026/10/07 01:07:13 DEBUG : one: Sizes differ 2026/10/07 01:07:13 DEBUG : one: size = 5 OK 2026/10/07 01:07:13 DEBUG : one: Size and modification time the same (differ by -123.456789ms, within tolerance 1s) 2026/10/07 01:07:13 DEBUG : one: size = 5 (Local file system at /tmp/rclone148111752) 2026/10/07 01:07:13 DEBUG : one: size = 3 (pcloud root 'rclone-test-kiziruq4votu/dst') 2026/10/07 01:07:13 DEBUG : one: Sizes differ 2026/10/07 01:07:13 ERROR : one: Source and destination exist but do not match: immutable file modified --- PASS: TestCopyFileCopyDestImmutable (3.96s) === RUN TestCopyFileCopyDest run.go:198: Remote "pcloud root 'rclone-test-kiziruq4votu'", Local "Local file system at /tmp/rclone148111752", Modify Window "1s" 2026/10/07 01:07:14 DEBUG : Creating backend with remote "TestPcloud:rclone-test-kiziruq4votu/dst" 2026/10/07 01:07:17 DEBUG : Creating backend with remote "TestPcloud:rclone-test-kiziruq4votu/CopyDest" 2026/10/07 01:07:18 DEBUG : one: Need to transfer - File not found at Destination 2026/10/07 01:07:19 DEBUG : one.b2cc3c6c.partial: size = 3 OK 2026/10/07 01:07:19 DEBUG : one: sha1 = fe05bcdcdc4928012781a5f1a2a77cbb5398e106 OK 2026/10/07 01:07:19 DEBUG : one.b2cc3c6c.partial: renamed to: one 2026/10/07 01:07:19 INFO : one: Copied (new) 2026/10/07 01:07:19 DEBUG : one: size = 5 (Local file system at /tmp/rclone148111752) 2026/10/07 01:07:19 DEBUG : one: size = 3 (pcloud root 'rclone-test-kiziruq4votu/dst') 2026/10/07 01:07:19 DEBUG : one: Sizes differ 2026/10/07 01:07:19 DEBUG : one.4a8516eb.partial: size = 5 OK 2026/10/07 01:07:19 DEBUG : one: sha1 = 7f376fd65843a1267de8f986d40e164e5a321c13 OK 2026/10/07 01:07:19 DEBUG : one.4a8516eb.partial: renamed to: one 2026/10/07 01:07:19 INFO : one: Copied (replaced existing) fstest.go:299: Sleeping for 1s for list eventual consistency: 1/3 fstest.go:302: Flushing the directory cache fstest.go:293: Sleeping for 6s just to make sure 2026/10/07 01:07:30 DEBUG : Creating backend with remote "TestPcloud:rclone-test-kiziruq4votu/BackupDir" 2026/10/07 01:07:31 DEBUG : one: size = 5 (Local file system at /tmp/rclone148111752) 2026/10/07 01:07:31 DEBUG : one: size = 3 (pcloud root 'rclone-test-kiziruq4votu/dst') 2026/10/07 01:07:31 DEBUG : one: Sizes differ 2026/10/07 01:07:32 DEBUG : one: size = 5 OK 2026/10/07 01:07:32 DEBUG : one: Size and modification time the same (differ by -123.456789ms, within tolerance 1s) 2026/10/07 01:07:32 DEBUG : one: size = 5 (Local file system at /tmp/rclone148111752) 2026/10/07 01:07:32 DEBUG : one: size = 3 (pcloud root 'rclone-test-kiziruq4votu/dst') 2026/10/07 01:07:32 DEBUG : one: Sizes differ 2026/10/07 01:07:32 INFO : one: Moved (server-side) 2026/10/07 01:07:32 DEBUG : one.a000e91c.partial: size = 5 OK 2026/10/07 01:07:32 DEBUG : one: sha1 = 7f376fd65843a1267de8f986d40e164e5a321c13 OK 2026/10/07 01:07:32 DEBUG : one.a000e91c.partial: renamed to: one 2026/10/07 01:07:32 INFO : one: Copied (server-side copy) 2026/10/07 01:07:32 DEBUG : one: Destination found in --copy-dest, using server-side copy fstest.go:299: Sleeping for 1s for list eventual consistency: 1/3 fstest.go:302: Flushing the directory cache fstest.go:293: Sleeping for 6s just to make sure 2026/10/07 01:07:42 DEBUG : two: Need to transfer - File not found at Destination 2026/10/07 01:07:42 DEBUG : two: size = 3 OK 2026/10/07 01:07:42 DEBUG : two: Size and modification time the same (differ by -123.456789ms, within tolerance 1s) 2026/10/07 01:07:42 DEBUG : two.0c2263ec.partial: size = 3 OK 2026/10/07 01:07:43 DEBUG : two: sha1 = ad782ecdac770fc6eb9a62e44f90873fb97fb26b OK 2026/10/07 01:07:43 DEBUG : two.0c2263ec.partial: renamed to: two 2026/10/07 01:07:43 INFO : two: Copied (server-side copy) 2026/10/07 01:07:43 DEBUG : two: Destination found in --copy-dest, using server-side copy 2026/10/07 01:07:43 DEBUG : two: size = 3 OK 2026/10/07 01:07:43 DEBUG : two: Size and modification time the same (differ by -123.456789ms, within tolerance 1s) 2026/10/07 01:07:43 DEBUG : two: Unchanged skipping 2026/10/07 01:07:45 DEBUG : three: Need to transfer - File not found at Destination 2026/10/07 01:07:45 DEBUG : three: size = 7 (Local file system at /tmp/rclone148111752) 2026/10/07 01:07:45 DEBUG : three: size = 5 (pcloud root 'rclone-test-kiziruq4votu/CopyDest') 2026/10/07 01:07:45 DEBUG : three: Sizes differ 2026/10/07 01:07:45 DEBUG : three: Destination not found in --copy-dest 2026/10/07 01:07:45 DEBUG : three.63cf7c49.partial: size = 7 OK 2026/10/07 01:07:45 DEBUG : three: sha1 = 370e613335f3cf2f19b2a2d35a86402f55c659f8 OK 2026/10/07 01:07:45 DEBUG : three.63cf7c49.partial: renamed to: three 2026/10/07 01:07:45 INFO : three: Copied (new) --- PASS: TestCopyFileCopyDest (33.02s) === RUN TestCopyInplace run.go:198: Remote "pcloud root 'rclone-test-kiziruq4votu'", Local "Local file system at /tmp/rclone148111752", Modify Window "1s" 2026/10/07 01:07:47 DEBUG : file1: Need to transfer - File not found at Destination 2026/10/07 01:07:47 DEBUG : sub/file2: size = 14 OK 2026/10/07 01:07:47 DEBUG : file1: sha1 = a379624177abc4679cafafa8eae1d73e1478aaa6 OK 2026/10/07 01:07:47 INFO : file1: Copied (new) to: sub/file2 2026/10/07 01:07:48 DEBUG : sub/file2: size = 14 OK 2026/10/07 01:07:48 DEBUG : file1: Size and modification time the same (differ by -499.999999ms, within tolerance 1s) 2026/10/07 01:07:48 DEBUG : file1: Unchanged skipping 2026/10/07 01:07:48 DEBUG : pcloud root 'rclone-test-kiziruq4votu': don't need to copy/move sub/file2, it is already at target location --- PASS: TestCopyInplace (1.45s) === RUN TestCopyLongFileName run.go:198: Remote "pcloud root 'rclone-test-kiziruq4votu'", Local "Local file system at /tmp/rclone148111752", Modify Window "1s" 2026/10/07 01:07:49 DEBUG : file1: Need to transfer - File not found at Destination 2026/10/07 01:07:49 DEBUG : sub/file2file2file2file2file2file2file2file2file2file2file2file2file2file2file2file2file2file2file2file2file2file2file2file2file2file2fil.00a5d7f6.partial: size = 14 OK 2026/10/07 01:07:49 DEBUG : file1: sha1 = a379624177abc4679cafafa8eae1d73e1478aaa6 OK 2026/10/07 01:07:49 DEBUG : sub/file2file2file2file2file2file2file2file2file2file2file2file2file2file2file2file2file2file2file2file2file2file2file2file2file2file2fil.00a5d7f6.partial: renamed to: sub/file2file2file2file2file2file2file2file2file2file2file2file2file2file2file2file2file2file2file2file2file2file2file2file2file2file2file2file2file2file2 2026/10/07 01:07:49 INFO : file1: Copied (new) to: sub/file2file2file2file2file2file2file2file2file2file2file2file2file2file2file2file2file2file2file2file2file2file2file2file2file2file2file2file2file2file2 2026/10/07 01:07:49 DEBUG : sub/file2file2file2file2file2file2file2file2file2file2file2file2file2file2file2file2file2file2file2file2file2file2file2file2file2file2file2file2file2file2: size = 14 OK 2026/10/07 01:07:49 DEBUG : file1: Size and modification time the same (differ by -499.999999ms, within tolerance 1s) 2026/10/07 01:07:49 DEBUG : file1: Unchanged skipping 2026/10/07 01:07:49 DEBUG : pcloud root 'rclone-test-kiziruq4votu': don't need to copy/move sub/file2file2file2file2file2file2file2file2file2file2file2file2file2file2file2file2file2file2file2file2file2file2file2file2file2file2file2file2file2file2, it is already at target location --- PASS: TestCopyLongFileName (1.56s) === RUN TestCopyLongFileNameCollision run.go:198: Remote "pcloud root 'rclone-test-kiziruq4votu'", Local "Local file system at /tmp/rclone148111752", Modify Window "1s" 2026/10/07 01:07:50 DEBUG : file1file1file1file1file1file1file1file1file1file1file1file1file1file1file1file1file1file1file1file1file1file1file1file1file1file1file1file1file1file100: Need to transfer - File not found at Destination 2026/10/07 01:07:50 DEBUG : file1file1file1file1file1file1file1file1file1file1file1file1file1file1file1file1file1file1file1file1file1file1file1file1file1file1file1file1file1file101: Need to transfer - File not found at Destination 2026/10/07 01:07:50 DEBUG : file1file1file1file1file1file1file1file1file1file1file1file1file1file1file1file1file1file1file1file1file1file1file1file1file1file1file1file1file1file102: Need to transfer - File not found at Destination 2026/10/07 01:07:50 DEBUG : file1file1file1file1file1file1file1file1file1file1file1file1file1file1file1file1file1file1file1file1file1file1file1file1file1file1file1file1file1file103: Need to transfer - File not found at Destination 2026/10/07 01:07:50 DEBUG : file1file1file1file1file1file1file1file1file1file1file1file1file1file1file1file1file1file1file1file1file1file1file1file1file1file1file1file1file1file104: Need to transfer - File not found at Destination 2026/10/07 01:07:50 DEBUG : file1file1file1file1file1file1file1file1file1file1file1file1file1file1file1file1file1file1file1file1file1file1file1file1file1file1file1file1file1file105: Need to transfer - File not found at Destination 2026/10/07 01:07:50 DEBUG : file1file1file1file1file1file1file1file1file1file1file1file1file1file1file1file1file1file1file1file1file1file1file1file1file1file1file1file1file1file106: Need to transfer - File not found at Destination 2026/10/07 01:07:50 DEBUG : file1file1file1file1file1file1file1file1file1file1file1file1file1file1file1file1file1file1file1file1file1file1file1file1file1file1file1file1file1file107: Need to transfer - File not found at Destination 2026/10/07 01:07:50 DEBUG : file1file1file1file1file1file1file1file1file1file1file1file1file1file1file1file1file1file1file1file1file1file1file1file1file1file1file1file1file1file108: Need to transfer - File not found at Destination 2026/10/07 01:07:50 DEBUG : file1file1file1file1file1file1file1file1file1file1file1file1file1file1file1file1file1file1file1file1file1file1file1file1file1file1file1file1file1file109: Need to transfer - File not found at Destination 2026/10/07 01:07:50 DEBUG : pcloud root 'rclone-test-kiziruq4votu': Waiting for checks to finish 2026/10/07 01:07:50 DEBUG : pcloud root 'rclone-test-kiziruq4votu': Waiting for transfers to finish 2026/10/07 01:07:50 DEBUG : file1file1file1file1file1file1file1file1file1file1file1file1file1file1file1file1file1file1file1file1file1file1file1file1file1file1file1.e717d392.partial: size = 14 OK 2026/10/07 01:07:50 DEBUG : file1file1file1file1file1file1file1file1file1file1file1file1file1file1file1file1file1file1file1file1file1file1file1file1file1file1file1file1file1file101: sha1 = a379624177abc4679cafafa8eae1d73e1478aaa6 OK 2026/10/07 01:07:50 DEBUG : file1file1file1file1file1file1file1file1file1file1file1file1file1file1file1file1file1file1file1file1file1file1file1file1file1file1file1.2e23c89f.partial: size = 14 OK 2026/10/07 01:07:50 DEBUG : file1file1file1file1file1file1file1file1file1file1file1file1file1file1file1file1file1file1file1file1file1file1file1file1file1file1file1file1file1file102: sha1 = a379624177abc4679cafafa8eae1d73e1478aaa6 OK 2026/10/07 01:07:50 DEBUG : file1file1file1file1file1file1file1file1file1file1file1file1file1file1file1file1file1file1file1file1file1file1file1file1file1file1file1.a0042569.partial: size = 14 OK 2026/10/07 01:07:50 DEBUG : file1file1file1file1file1file1file1file1file1file1file1file1file1file1file1file1file1file1file1file1file1file1file1file1file1file1file1file1file1file100: sha1 = a379624177abc4679cafafa8eae1d73e1478aaa6 OK 2026/10/07 01:07:50 DEBUG : file1file1file1file1file1file1file1file1file1file1file1file1file1file1file1file1file1file1file1file1file1file1file1file1file1file1file1.69303e64.partial: size = 14 OK 2026/10/07 01:07:50 DEBUG : file1file1file1file1file1file1file1file1file1file1file1file1file1file1file1file1file1file1file1file1file1file1file1file1file1file1file1file1file1file103: sha1 = a379624177abc4679cafafa8eae1d73e1478aaa6 OK 2026/10/07 01:07:50 DEBUG : file1file1file1file1file1file1file1file1file1file1file1file1file1file1file1file1file1file1file1file1file1file1file1file1file1file1file1.e717d392.partial: renamed to: file1file1file1file1file1file1file1file1file1file1file1file1file1file1file1file1file1file1file1file1file1file1file1file1file1file1file1file1file1file101 2026/10/07 01:07:50 INFO : file1file1file1file1file1file1file1file1file1file1file1file1file1file1file1file1file1file1file1file1file1file1file1file1file1file1file1file1file1file101: Copied (new) 2026/10/07 01:07:50 DEBUG : file1file1file1file1file1file1file1file1file1file1file1file1file1file1file1file1file1file1file1file1file1file1file1file1file1file1file1.2e23c89f.partial: renamed to: file1file1file1file1file1file1file1file1file1file1file1file1file1file1file1file1file1file1file1file1file1file1file1file1file1file1file1file1file1file102 2026/10/07 01:07:50 INFO : file1file1file1file1file1file1file1file1file1file1file1file1file1file1file1file1file1file1file1file1file1file1file1file1file1file1file1file1file1file102: Copied (new) 2026/10/07 01:07:50 DEBUG : file1file1file1file1file1file1file1file1file1file1file1file1file1file1file1file1file1file1file1file1file1file1file1file1file1file1file1.a0042569.partial: renamed to: file1file1file1file1file1file1file1file1file1file1file1file1file1file1file1file1file1file1file1file1file1file1file1file1file1file1file1file1file1file100 2026/10/07 01:07:50 INFO : file1file1file1file1file1file1file1file1file1file1file1file1file1file1file1file1file1file1file1file1file1file1file1file1file1file1file1file1file1file100: Copied (new) 2026/10/07 01:07:50 DEBUG : file1file1file1file1file1file1file1file1file1file1file1file1file1file1file1file1file1file1file1file1file1file1file1file1file1file1file1.69303e64.partial: renamed to: file1file1file1file1file1file1file1file1file1file1file1file1file1file1file1file1file1file1file1file1file1file1file1file1file1file1file1file1file1file103 2026/10/07 01:07:50 INFO : file1file1file1file1file1file1file1file1file1file1file1file1file1file1file1file1file1file1file1file1file1file1file1file1file1file1file1file1file1file103: Copied (new) 2026/10/07 01:07:50 DEBUG : file1file1file1file1file1file1file1file1file1file1file1file1file1file1file1file1file1file1file1file1file1file1file1file1file1file1file1.673af8c4.partial: size = 14 OK 2026/10/07 01:07:50 DEBUG : file1file1file1file1file1file1file1file1file1file1file1file1file1file1file1file1file1file1file1file1file1file1file1file1file1file1file1file1file1file104: sha1 = a379624177abc4679cafafa8eae1d73e1478aaa6 OK 2026/10/07 01:07:50 DEBUG : file1file1file1file1file1file1file1file1file1file1file1file1file1file1file1file1file1file1file1file1file1file1file1file1file1file1file1.e91d1532.partial: size = 14 OK 2026/10/07 01:07:50 DEBUG : file1file1file1file1file1file1file1file1file1file1file1file1file1file1file1file1file1file1file1file1file1file1file1file1file1file1file1file1file1file106: sha1 = a379624177abc4679cafafa8eae1d73e1478aaa6 OK 2026/10/07 01:07:50 DEBUG : file1file1file1file1file1file1file1file1file1file1file1file1file1file1file1file1file1file1file1file1file1file1file1file1file1file1file1.ae0ee3c9.partial: size = 14 OK 2026/10/07 01:07:50 DEBUG : file1file1file1file1file1file1file1file1file1file1file1file1file1file1file1file1file1file1file1file1file1file1file1file1file1file1file1file1file1file107: sha1 = a379624177abc4679cafafa8eae1d73e1478aaa6 OK 2026/10/07 01:07:51 DEBUG : file1file1file1file1file1file1file1file1file1file1file1file1file1file1file1file1file1file1file1file1file1file1file1file1file1file1file1.673af8c4.partial: renamed to: file1file1file1file1file1file1file1file1file1file1file1file1file1file1file1file1file1file1file1file1file1file1file1file1file1file1file1file1file1file104 2026/10/07 01:07:51 INFO : file1file1file1file1file1file1file1file1file1file1file1file1file1file1file1file1file1file1file1file1file1file1file1file1file1file1file1file1file1file104: Copied (new) 2026/10/07 01:07:51 DEBUG : file1file1file1file1file1file1file1file1file1file1file1file1file1file1file1file1file1file1file1file1file1file1file1file1file1file1file1.e91d1532.partial: renamed to: file1file1file1file1file1file1file1file1file1file1file1file1file1file1file1file1file1file1file1file1file1file1file1file1file1file1file1file1file1file106 2026/10/07 01:07:51 INFO : file1file1file1file1file1file1file1file1file1file1file1file1file1file1file1file1file1file1file1file1file1file1file1file1file1file1file1file1file1file106: Copied (new) 2026/10/07 01:07:51 DEBUG : file1file1file1file1file1file1file1file1file1file1file1file1file1file1file1file1file1file1file1file1file1file1file1file1file1file1file1.ae0ee3c9.partial: renamed to: file1file1file1file1file1file1file1file1file1file1file1file1file1file1file1file1file1file1file1file1file1file1file1file1file1file1file1file1file1file107 2026/10/07 01:07:51 INFO : file1file1file1file1file1file1file1file1file1file1file1file1file1file1file1file1file1file1file1file1file1file1file1file1file1file1file1file1file1file107: Copied (new) 2026/10/07 01:07:51 DEBUG : file1file1file1file1file1file1file1file1file1file1file1file1file1file1file1file1file1file1file1file1file1file1file1file1file1file1file1.20290e3f.partial: size = 14 OK 2026/10/07 01:07:51 DEBUG : file1file1file1file1file1file1file1file1file1file1file1file1file1file1file1file1file1file1file1file1file1file1file1file1file1file1file1file1file1file105: sha1 = a379624177abc4679cafafa8eae1d73e1478aaa6 OK 2026/10/07 01:07:51 DEBUG : file1file1file1file1file1file1file1file1file1file1file1file1file1file1file1file1file1file1file1file1file1file1file1file1file1file1file1.f5089872.partial: size = 14 OK 2026/10/07 01:07:51 DEBUG : file1file1file1file1file1file1file1file1file1file1file1file1file1file1file1file1file1file1file1file1file1file1file1file1file1file1file1file1file1file108: sha1 = a379624177abc4679cafafa8eae1d73e1478aaa6 OK 2026/10/07 01:07:51 DEBUG : file1file1file1file1file1file1file1file1file1file1file1file1file1file1file1file1file1file1file1file1file1file1file1file1file1file1file1.b21b6e89.partial: size = 14 OK 2026/10/07 01:07:51 DEBUG : file1file1file1file1file1file1file1file1file1file1file1file1file1file1file1file1file1file1file1file1file1file1file1file1file1file1file1file1file1file109: sha1 = a379624177abc4679cafafa8eae1d73e1478aaa6 OK 2026/10/07 01:07:51 DEBUG : file1file1file1file1file1file1file1file1file1file1file1file1file1file1file1file1file1file1file1file1file1file1file1file1file1file1file1.20290e3f.partial: renamed to: file1file1file1file1file1file1file1file1file1file1file1file1file1file1file1file1file1file1file1file1file1file1file1file1file1file1file1file1file1file105 2026/10/07 01:07:51 INFO : file1file1file1file1file1file1file1file1file1file1file1file1file1file1file1file1file1file1file1file1file1file1file1file1file1file1file1file1file1file105: Copied (new) 2026/10/07 01:07:51 DEBUG : file1file1file1file1file1file1file1file1file1file1file1file1file1file1file1file1file1file1file1file1file1file1file1file1file1file1file1.f5089872.partial: renamed to: file1file1file1file1file1file1file1file1file1file1file1file1file1file1file1file1file1file1file1file1file1file1file1file1file1file1file1file1file1file108 2026/10/07 01:07:51 INFO : file1file1file1file1file1file1file1file1file1file1file1file1file1file1file1file1file1file1file1file1file1file1file1file1file1file1file1file1file1file108: Copied (new) 2026/10/07 01:07:51 DEBUG : file1file1file1file1file1file1file1file1file1file1file1file1file1file1file1file1file1file1file1file1file1file1file1file1file1file1file1.b21b6e89.partial: renamed to: file1file1file1file1file1file1file1file1file1file1file1file1file1file1file1file1file1file1file1file1file1file1file1file1file1file1file1file1file1file109 2026/10/07 01:07:51 INFO : file1file1file1file1file1file1file1file1file1file1file1file1file1file1file1file1file1file1file1file1file1file1file1file1file1file1file1file1file1file109: Copied (new) fstest.go:299: Sleeping for 1s for list eventual consistency: 1/3 fstest.go:302: Flushing the directory cache fstest.go:293: Sleeping for 6s just to make sure --- PASS: TestCopyLongFileNameCollision (10.59s) === RUN TestCopyFileMaxTransfer run.go:198: Remote "pcloud root 'rclone-test-kiziruq4votu'", Local "Local file system at /tmp/rclone148111752", Modify Window "1s" 2026/10/07 01:08:01 DEBUG : TestCopyFileMaxTransfer/file1: Need to transfer - File not found at Destination 2026/10/07 01:08:01 DEBUG : TestCopyFileMaxTransfer/file1.c45f4b0b.partial: size = 14 OK 2026/10/07 01:08:01 DEBUG : TestCopyFileMaxTransfer/file1: sha1 = a379624177abc4679cafafa8eae1d73e1478aaa6 OK 2026/10/07 01:08:01 DEBUG : TestCopyFileMaxTransfer/file1.c45f4b0b.partial: renamed to: TestCopyFileMaxTransfer/file1 2026/10/07 01:08:01 INFO : TestCopyFileMaxTransfer/file1: Copied (new) 2026/10/07 01:08:01 DEBUG : TestCopyFileMaxTransfer/file2: Need to transfer - File not found at Destination 2026/10/07 01:08:03 ERROR : TestCopyFileMaxTransfer/file2: Failed to copy: Put "https://eapi.pcloud.com/uploadfile?filename=file2.945646ab.partial&folderid=26963804741&mtime=1324817999&nopartial=1": max transfer limit reached as set by --max-transfer 2026/10/07 01:08:03 DEBUG : TestCopyFileMaxTransfer/file3: Need to transfer - File not found at Destination 2026/10/07 01:08:03 DEBUG : TestCopyFileMaxTransfer/file4: Need to transfer - File not found at Destination 2026/10/07 01:08:04 DEBUG : TestCopyFileMaxTransfer/file4.ebc0bb81.partial: size = 2062 OK 2026/10/07 01:08:04 DEBUG : TestCopyFileMaxTransfer/file4: sha1 = 14e9a70fbf19c2ad7f4f632b145663bf10cf1812 OK 2026/10/07 01:08:04 DEBUG : TestCopyFileMaxTransfer/file4.ebc0bb81.partial: renamed to: TestCopyFileMaxTransfer/file4 2026/10/07 01:08:04 INFO : TestCopyFileMaxTransfer/file4: Copied (new) --- PASS: TestCopyFileMaxTransfer (4.00s) === RUN TestDeduplicateInteractive run.go:198: Remote "pcloud root 'rclone-test-kiziruq4votu'", Local "Local file system at /tmp/rclone148111752", Modify Window "1s" dedupe_test.go:25: Can't test deduplicate - no duplicate files possible --- SKIP: TestDeduplicateInteractive (0.19s) === RUN TestDeduplicateSkip run.go:198: Remote "pcloud root 'rclone-test-kiziruq4votu'", Local "Local file system at /tmp/rclone148111752", Modify Window "1s" dedupe_test.go:25: Can't test deduplicate - no duplicate files possible --- SKIP: TestDeduplicateSkip (0.20s) === RUN TestDeduplicateSizeOnly run.go:198: Remote "pcloud root 'rclone-test-kiziruq4votu'", Local "Local file system at /tmp/rclone148111752", Modify Window "1s" dedupe_test.go:25: Can't test deduplicate - no duplicate files possible --- SKIP: TestDeduplicateSizeOnly (0.19s) === RUN TestDeduplicateFirst run.go:198: Remote "pcloud root 'rclone-test-kiziruq4votu'", Local "Local file system at /tmp/rclone148111752", Modify Window "1s" dedupe_test.go:25: Can't test deduplicate - no duplicate files possible --- SKIP: TestDeduplicateFirst (0.19s) === RUN TestDeduplicateNewest run.go:198: Remote "pcloud root 'rclone-test-kiziruq4votu'", Local "Local file system at /tmp/rclone148111752", Modify Window "1s" dedupe_test.go:25: Can't test deduplicate - no duplicate files possible --- SKIP: TestDeduplicateNewest (0.21s) === RUN TestDeduplicateNewestByHash run.go:198: Remote "pcloud root 'rclone-test-kiziruq4votu'", Local "Local file system at /tmp/rclone148111752", Modify Window "1s" 2026/10/07 01:08:07 INFO : pcloud root 'rclone-test-kiziruq4votu': Looking for duplicate sha1 hashes using newest mode. 2026/10/07 01:08:08 NOTICE: 65b13fa1ae5f3498ed86a6f11d3b27345e07fa6c: Found 3 files with duplicate sha1 hashes 2026/10/07 01:08:08 INFO : one: Deleted 2026/10/07 01:08:08 INFO : also/one: Deleted 2026/10/07 01:08:08 NOTICE: 65b13fa1ae5f3498ed86a6f11d3b27345e07fa6c: Deleted 2 extra copies --- PASS: TestDeduplicateNewestByHash (3.29s) === RUN TestDeduplicateOldest run.go:198: Remote "pcloud root 'rclone-test-kiziruq4votu'", Local "Local file system at /tmp/rclone148111752", Modify Window "1s" dedupe_test.go:25: Can't test deduplicate - no duplicate files possible --- SKIP: TestDeduplicateOldest (0.19s) === RUN TestDeduplicateLargest run.go:198: Remote "pcloud root 'rclone-test-kiziruq4votu'", Local "Local file system at /tmp/rclone148111752", Modify Window "1s" dedupe_test.go:25: Can't test deduplicate - no duplicate files possible --- SKIP: TestDeduplicateLargest (0.19s) === RUN TestDeduplicateSmallest run.go:198: Remote "pcloud root 'rclone-test-kiziruq4votu'", Local "Local file system at /tmp/rclone148111752", Modify Window "1s" dedupe_test.go:25: Can't test deduplicate - no duplicate files possible --- SKIP: TestDeduplicateSmallest (0.19s) === RUN TestDeduplicateRename run.go:198: Remote "pcloud root 'rclone-test-kiziruq4votu'", Local "Local file system at /tmp/rclone148111752", Modify Window "1s" dedupe_test.go:25: Can't test deduplicate - no duplicate files possible --- SKIP: TestDeduplicateRename (0.22s) === RUN TestDeduplicateRenameManyExisting run.go:198: Remote "pcloud root 'rclone-test-kiziruq4votu'", Local "Local file system at /tmp/rclone148111752", Modify Window "1s" dedupe_test.go:25: Can't test deduplicate - no duplicate files possible --- SKIP: TestDeduplicateRenameManyExisting (0.19s) === RUN TestMergeDirs run.go:198: Remote "pcloud root 'rclone-test-kiziruq4votu'", Local "Local file system at /tmp/rclone148111752", Modify Window "1s" dedupe_test.go:294: Can't merge directories --- SKIP: TestMergeDirs (0.19s) === RUN TestIndex run.go:198: Remote "pcloud root 'rclone-test-kiziruq4votu'", Local "Local file system at /tmp/rclone148111752", Modify Window "1s" 2026/10/07 01:08:11 DEBUG : sub/deep/index.json.5ffa2561.partial: size = 119 OK 2026/10/07 01:08:11 DEBUG : sub/deep/index.json: sha1 = e3dfc52c4591e7201f0d0680f34bca98cc6555eb OK 2026/10/07 01:08:11 DEBUG : index.html.695cebd4.partial: size = 12147 OK 2026/10/07 01:08:11 DEBUG : index.html: sha1 = b9e0cb2d9a629490e16cd0b619b3163d1b649fb7 OK 2026/10/07 01:08:11 DEBUG : index.json.a361a204.partial: size = 213 OK 2026/10/07 01:08:11 DEBUG : index.json: sha1 = d9cc947acac4654612c985ff36907340f138a435 OK 2026/10/07 01:08:11 DEBUG : sub/deep/index.html.ecd6b83b.partial: size = 12087 OK 2026/10/07 01:08:11 DEBUG : sub/deep/index.html: sha1 = cb5eca4dce208e59c9a030ca0e93c482f8e2386c OK 2026/10/07 01:08:11 DEBUG : sub/deep/index.json.5ffa2561.partial: renamed to: sub/deep/index.json 2026/10/07 01:08:11 INFO : sub/deep/index.json: Copied (new) 2026/10/07 01:08:11 DEBUG : index.html.695cebd4.partial: renamed to: index.html 2026/10/07 01:08:11 INFO : index.html: Copied (new) 2026/10/07 01:08:11 DEBUG : index.json.a361a204.partial: renamed to: index.json 2026/10/07 01:08:11 INFO : index.json: Copied (new) 2026/10/07 01:08:11 DEBUG : sub/deep/index.html.ecd6b83b.partial: renamed to: sub/deep/index.html 2026/10/07 01:08:11 INFO : sub/deep/index.html: Copied (new) 2026/10/07 01:08:11 DEBUG : sub/deep/caddy.json.0da1ae14.partial: size = 131 OK 2026/10/07 01:08:11 DEBUG : sub/deep/caddy.json: sha1 = d5a16359793673fad1e77833e95fb7c78780ef4a OK 2026/10/07 01:08:11 DEBUG : caddy.json.c4415abc.partial: size = 259 OK 2026/10/07 01:08:11 DEBUG : caddy.json: sha1 = 603c7ebd57dfcf3482a1b5dcc3877bcd5c80da63 OK 2026/10/07 01:08:11 DEBUG : sub/index.json.0b0025dc.partial: size = 215 OK 2026/10/07 01:08:11 DEBUG : sub/index.json: sha1 = cbb54a3e32f00b47d40f5f16525254ffde95d22c OK 2026/10/07 01:08:12 DEBUG : sub/index.html.b4b58a32.partial: size = 12306 OK 2026/10/07 01:08:12 DEBUG : sub/index.html: sha1 = 7b8f50e9afa63c49c26d616c8b95dbd33f22a6ff OK 2026/10/07 01:08:12 DEBUG : sub/deep/caddy.json.0da1ae14.partial: renamed to: sub/deep/caddy.json 2026/10/07 01:08:12 INFO : sub/deep/caddy.json: Copied (new) 2026/10/07 01:08:12 DEBUG : caddy.json.c4415abc.partial: renamed to: caddy.json 2026/10/07 01:08:12 INFO : caddy.json: Copied (new) 2026/10/07 01:08:12 DEBUG : sub/index.json.0b0025dc.partial: renamed to: sub/index.json 2026/10/07 01:08:12 INFO : sub/index.json: Copied (new) 2026/10/07 01:08:12 DEBUG : sub/index.html.b4b58a32.partial: renamed to: sub/index.html 2026/10/07 01:08:12 INFO : sub/index.html: Copied (new) 2026/10/07 01:08:12 DEBUG : sub/caddy.json.d46fe8e4.partial: size = 261 OK 2026/10/07 01:08:12 DEBUG : sub/caddy.json: sha1 = 74862f14b170455b610d147c2da27c5021065d32 OK 2026/10/07 01:08:12 DEBUG : sub/caddy.json.d46fe8e4.partial: renamed to: sub/caddy.json 2026/10/07 01:08:12 INFO : sub/caddy.json: Copied (new) 2026/10/07 01:08:12 DEBUG : Couldn't parse Date: from server ecph1.pcloud.com: "Wed, 07 Oct 2026 01:08:12 +0000": parsing time "Wed, 07 Oct 2026 01:08:12 +0000" as "Mon Jan _2 15:04:05 2006": cannot parse ", 07 Oct 2026 01:08:12 +0000" as " " 2026/10/07 01:08:12 DEBUG : Couldn't parse Date: from server ecph1.pcloud.com: "Wed, 07 Oct 2026 01:08:12 +0000": parsing time "Wed, 07 Oct 2026 01:08:12 +0000" as "Mon Jan _2 15:04:05 2006": cannot parse ", 07 Oct 2026 01:08:12 +0000" as " " 2026/10/07 01:08:13 DEBUG : Couldn't parse Date: from server ecph1.pcloud.com: "Wed, 07 Oct 2026 01:08:13 +0000": parsing time "Wed, 07 Oct 2026 01:08:13 +0000" as "Mon Jan _2 15:04:05 2006": cannot parse ", 07 Oct 2026 01:08:13 +0000" as " " 2026/10/07 01:08:13 DEBUG : Couldn't parse Date: from server ecph1.pcloud.com: "Wed, 07 Oct 2026 01:08:13 +0000": parsing time "Wed, 07 Oct 2026 01:08:13 +0000" as "Mon Jan _2 15:04:05 2006": cannot parse ", 07 Oct 2026 01:08:13 +0000" as " " 2026/10/07 01:08:13 DEBUG : index.html: sha1 = b9e0cb2d9a629490e16cd0b619b3163d1b649fb7 OK 2026/10/07 01:08:13 DEBUG : index.html: Unchanged skipping 2026/10/07 01:08:13 DEBUG : sub/deep/index.html: sha1 = cb5eca4dce208e59c9a030ca0e93c482f8e2386c OK 2026/10/07 01:08:13 DEBUG : sub/deep/index.html: Unchanged skipping 2026/10/07 01:08:13 DEBUG : sub/index.html: sha1 = 7b8f50e9afa63c49c26d616c8b95dbd33f22a6ff OK 2026/10/07 01:08:13 DEBUG : sub/index.html: Unchanged skipping 2026/10/07 01:08:13 DEBUG : index.json: sha1 = d9cc947acac4654612c985ff36907340f138a435 OK 2026/10/07 01:08:13 DEBUG : index.json: Unchanged skipping 2026/10/07 01:08:13 DEBUG : sub/deep/index.json: sha1 = e3dfc52c4591e7201f0d0680f34bca98cc6555eb OK 2026/10/07 01:08:13 DEBUG : sub/deep/index.json: Unchanged skipping 2026/10/07 01:08:13 DEBUG : sub/index.json: sha1 = cbb54a3e32f00b47d40f5f16525254ffde95d22c OK 2026/10/07 01:08:13 DEBUG : sub/index.json: Unchanged skipping 2026/10/07 01:08:13 DEBUG : caddy.json: sha1 = 603c7ebd57dfcf3482a1b5dcc3877bcd5c80da63 OK 2026/10/07 01:08:13 DEBUG : caddy.json: Unchanged skipping 2026/10/07 01:08:13 DEBUG : sub/deep/caddy.json: sha1 = d5a16359793673fad1e77833e95fb7c78780ef4a OK 2026/10/07 01:08:13 DEBUG : sub/deep/caddy.json: Unchanged skipping 2026/10/07 01:08:13 DEBUG : sub/caddy.json: sha1 = 74862f14b170455b610d147c2da27c5021065d32 OK 2026/10/07 01:08:13 DEBUG : sub/caddy.json: Unchanged skipping 2026/10/07 01:08:14 DEBUG : sub/deep/index.json.26006172.partial: size = 119 OK 2026/10/07 01:08:14 DEBUG : sub/deep/index.json: sha1 = e3dfc52c4591e7201f0d0680f34bca98cc6555eb OK 2026/10/07 01:08:14 DEBUG : sub/deep/index.html.b0324b0a.partial: size = 12087 OK 2026/10/07 01:08:14 DEBUG : sub/deep/index.html: sha1 = cb5eca4dce208e59c9a030ca0e93c482f8e2386c OK 2026/10/07 01:08:14 DEBUG : index.html.6a7d9ca3.partial: size = 12147 OK 2026/10/07 01:08:14 DEBUG : index.html: sha1 = b9e0cb2d9a629490e16cd0b619b3163d1b649fb7 OK 2026/10/07 01:08:14 DEBUG : sub/deep/caddy.json.883778ff.partial: size = 131 OK 2026/10/07 01:08:14 DEBUG : sub/deep/caddy.json: sha1 = d5a16359793673fad1e77833e95fb7c78780ef4a OK 2026/10/07 01:08:14 DEBUG : sub/deep/index.json.26006172.partial: renamed to: sub/deep/index.json 2026/10/07 01:08:14 INFO : sub/deep/index.json: Copied (replaced existing) 2026/10/07 01:08:14 DEBUG : sub/deep/index.html.b0324b0a.partial: renamed to: sub/deep/index.html 2026/10/07 01:08:14 INFO : sub/deep/index.html: Copied (replaced existing) 2026/10/07 01:08:14 DEBUG : index.html.6a7d9ca3.partial: renamed to: index.html 2026/10/07 01:08:14 INFO : index.html: Copied (replaced existing) 2026/10/07 01:08:14 DEBUG : sub/deep/caddy.json.883778ff.partial: renamed to: sub/deep/caddy.json 2026/10/07 01:08:14 INFO : sub/deep/caddy.json: Copied (replaced existing) 2026/10/07 01:08:14 DEBUG : caddy.json.b0ef4c9e.partial: size = 259 OK 2026/10/07 01:08:14 DEBUG : caddy.json: sha1 = 603c7ebd57dfcf3482a1b5dcc3877bcd5c80da63 OK 2026/10/07 01:08:14 DEBUG : sub/index.html.f4e943ef.partial: size = 12306 OK 2026/10/07 01:08:14 DEBUG : sub/index.html: sha1 = 7b8f50e9afa63c49c26d616c8b95dbd33f22a6ff OK 2026/10/07 01:08:14 DEBUG : index.json.50c28ae0.partial: size = 213 OK 2026/10/07 01:08:14 DEBUG : index.json: sha1 = d9cc947acac4654612c985ff36907340f138a435 OK 2026/10/07 01:08:14 DEBUG : sub/index.json.246e6a25.partial: size = 215 OK 2026/10/07 01:08:14 DEBUG : sub/index.json: sha1 = cbb54a3e32f00b47d40f5f16525254ffde95d22c OK 2026/10/07 01:08:14 DEBUG : caddy.json.b0ef4c9e.partial: renamed to: caddy.json 2026/10/07 01:08:14 INFO : caddy.json: Copied (replaced existing) 2026/10/07 01:08:14 DEBUG : sub/index.html.f4e943ef.partial: renamed to: sub/index.html 2026/10/07 01:08:14 INFO : sub/index.html: Copied (replaced existing) 2026/10/07 01:08:14 DEBUG : index.json.50c28ae0.partial: renamed to: index.json 2026/10/07 01:08:14 INFO : index.json: Copied (replaced existing) 2026/10/07 01:08:14 DEBUG : sub/index.json.246e6a25.partial: renamed to: sub/index.json 2026/10/07 01:08:14 INFO : sub/index.json: Copied (replaced existing) 2026/10/07 01:08:14 DEBUG : sub/caddy.json.b62b97c7.partial: size = 261 OK 2026/10/07 01:08:14 DEBUG : sub/caddy.json: sha1 = 74862f14b170455b610d147c2da27c5021065d32 OK 2026/10/07 01:08:14 DEBUG : sub/caddy.json.b62b97c7.partial: renamed to: sub/caddy.json 2026/10/07 01:08:14 INFO : sub/caddy.json: Copied (replaced existing) 2026/10/07 01:08:15 DEBUG : index.html: sha1 = b9e0cb2d9a629490e16cd0b619b3163d1b649fb7 OK 2026/10/07 01:08:15 DEBUG : index.html: Unchanged skipping 2026/10/07 01:08:15 DEBUG : sub/deep/caddy.json.53e968f6.partial: size = 260 OK 2026/10/07 01:08:15 DEBUG : sub/deep/caddy.json: sha1 = 64025ee51d8063e50448a3c0b674dad4e69aa178 OK 2026/10/07 01:08:15 DEBUG : sub/index.html: sha1 = 7b8f50e9afa63c49c26d616c8b95dbd33f22a6ff OK 2026/10/07 01:08:15 DEBUG : sub/index.html: Unchanged skipping 2026/10/07 01:08:15 DEBUG : sub/deep/index.json.62fea309.partial: size = 235 OK 2026/10/07 01:08:15 DEBUG : sub/deep/index.json: sha1 = 4b8e28bfcfaf817eb9f39984fe4d0a976af6516e OK 2026/10/07 01:08:15 DEBUG : sub/deep/index.html.eb1e2fc6.partial: size = 12346 OK 2026/10/07 01:08:15 DEBUG : sub/deep/index.html: sha1 = 5841ec4641e748f2adb9d6ec1b7614b2bbfa85db OK 2026/10/07 01:08:15 DEBUG : index.json: sha1 = d9cc947acac4654612c985ff36907340f138a435 OK 2026/10/07 01:08:15 DEBUG : index.json: Unchanged skipping 2026/10/07 01:08:15 DEBUG : sub/deep/caddy.json.53e968f6.partial: renamed to: sub/deep/caddy.json 2026/10/07 01:08:15 INFO : sub/deep/caddy.json: Copied (replaced existing) 2026/10/07 01:08:15 DEBUG : sub/index.json: sha1 = cbb54a3e32f00b47d40f5f16525254ffde95d22c OK 2026/10/07 01:08:15 DEBUG : sub/index.json: Unchanged skipping 2026/10/07 01:08:15 DEBUG : sub/deep/index.json.62fea309.partial: renamed to: sub/deep/index.json 2026/10/07 01:08:15 INFO : sub/deep/index.json: Copied (replaced existing) 2026/10/07 01:08:15 DEBUG : sub/deep/index.html.eb1e2fc6.partial: renamed to: sub/deep/index.html 2026/10/07 01:08:15 INFO : sub/deep/index.html: Copied (replaced existing) 2026/10/07 01:08:15 DEBUG : caddy.json: sha1 = 603c7ebd57dfcf3482a1b5dcc3877bcd5c80da63 OK 2026/10/07 01:08:15 DEBUG : caddy.json: Unchanged skipping 2026/10/07 01:08:15 DEBUG : sub/caddy.json: sha1 = 74862f14b170455b610d147c2da27c5021065d32 OK 2026/10/07 01:08:15 DEBUG : sub/caddy.json: Unchanged skipping 2026/10/07 01:08:15 DEBUG : Couldn't parse Date: from server ecph1.pcloud.com: "Wed, 07 Oct 2026 01:08:15 +0000": parsing time "Wed, 07 Oct 2026 01:08:15 +0000" as "Mon Jan _2 15:04:05 2006": cannot parse ", 07 Oct 2026 01:08:15 +0000" as " " 2026/10/07 01:08:16 NOTICE: sub/deep/caddy.json: Skipped copy as --dry-run is set (size 389) 2026/10/07 01:08:16 NOTICE: sub/deep/index.html: Skipped copy as --dry-run is set (size 12.309Ki) 2026/10/07 01:08:16 NOTICE: sub/deep/index.json: Skipped copy as --dry-run is set (size 351) 2026/10/07 01:08:16 DEBUG : index.html: sha1 = b9e0cb2d9a629490e16cd0b619b3163d1b649fb7 OK 2026/10/07 01:08:16 DEBUG : index.html: Unchanged skipping 2026/10/07 01:08:16 DEBUG : sub/index.html: sha1 = 7b8f50e9afa63c49c26d616c8b95dbd33f22a6ff OK 2026/10/07 01:08:16 DEBUG : sub/index.html: Unchanged skipping 2026/10/07 01:08:16 DEBUG : index.json: sha1 = d9cc947acac4654612c985ff36907340f138a435 OK 2026/10/07 01:08:16 DEBUG : index.json: Unchanged skipping 2026/10/07 01:08:16 DEBUG : sub/index.json: sha1 = cbb54a3e32f00b47d40f5f16525254ffde95d22c OK 2026/10/07 01:08:16 DEBUG : sub/index.json: Unchanged skipping 2026/10/07 01:08:16 DEBUG : caddy.json: sha1 = 603c7ebd57dfcf3482a1b5dcc3877bcd5c80da63 OK 2026/10/07 01:08:16 DEBUG : caddy.json: Unchanged skipping 2026/10/07 01:08:16 DEBUG : sub/caddy.json: sha1 = 74862f14b170455b610d147c2da27c5021065d32 OK 2026/10/07 01:08:16 DEBUG : sub/caddy.json: Unchanged skipping 2026/10/07 01:08:16 DEBUG : Couldn't parse Date: from server ecph1.pcloud.com: "Wed, 07 Oct 2026 01:08:16 +0000": parsing time "Wed, 07 Oct 2026 01:08:16 +0000" as "Mon Jan _2 15:04:05 2006": cannot parse ", 07 Oct 2026 01:08:16 +0000" as " " --- PASS: TestIndex (8.34s) === RUN TestIndexDelete run.go:198: Remote "pcloud root 'rclone-test-kiziruq4votu'", Local "Local file system at /tmp/rclone148111752", Modify Window "1s" 2026/10/07 01:08:19 DEBUG : index.html.979fdb5d.partial: size = 12147 OK 2026/10/07 01:08:19 DEBUG : index.html: sha1 = b9e0cb2d9a629490e16cd0b619b3163d1b649fb7 OK 2026/10/07 01:08:20 DEBUG : sub/deep/index.html.4dd00cf4.partial: size = 12087 OK 2026/10/07 01:08:20 DEBUG : sub/deep/index.html: sha1 = cb5eca4dce208e59c9a030ca0e93c482f8e2386c OK 2026/10/07 01:08:20 DEBUG : sub/index.html.090b0411.partial: size = 12306 OK 2026/10/07 01:08:20 DEBUG : sub/index.html: sha1 = 7b8f50e9afa63c49c26d616c8b95dbd33f22a6ff OK 2026/10/07 01:08:20 DEBUG : index.html.979fdb5d.partial: renamed to: index.html 2026/10/07 01:08:20 INFO : index.html: Copied (new) 2026/10/07 01:08:20 DEBUG : sub/deep/index.html.4dd00cf4.partial: renamed to: sub/deep/index.html 2026/10/07 01:08:20 INFO : sub/deep/index.html: Copied (new) 2026/10/07 01:08:20 DEBUG : sub/index.html.090b0411.partial: renamed to: sub/index.html 2026/10/07 01:08:20 INFO : sub/index.html: Copied (new) 2026/10/07 01:08:20 DEBUG : index.html: sha1 = b9e0cb2d9a629490e16cd0b619b3163d1b649fb7 OK 2026/10/07 01:08:20 DEBUG : index.html: Unchanged skipping 2026/10/07 01:08:20 DEBUG : sub/index.html: sha1 = 7b8f50e9afa63c49c26d616c8b95dbd33f22a6ff OK 2026/10/07 01:08:20 DEBUG : sub/index.html: Unchanged skipping 2026/10/07 01:08:20 DEBUG : sub/deep/index.html.fa0f3839.partial: size = 11829 OK 2026/10/07 01:08:20 DEBUG : sub/deep/index.html: sha1 = fbbe4f8bb1d6c76a3b3553c67ffb6aba4b2b4f02 OK 2026/10/07 01:08:20 DEBUG : sub/deep/index.html.fa0f3839.partial: renamed to: sub/deep/index.html 2026/10/07 01:08:20 INFO : sub/deep/index.html: Copied (replaced existing) 2026/10/07 01:08:21 DEBUG : Couldn't parse Date: from server ecph1.pcloud.com: "Wed, 07 Oct 2026 01:08:21 +0000": parsing time "Wed, 07 Oct 2026 01:08:21 +0000" as "Mon Jan _2 15:04:05 2006": cannot parse ", 07 Oct 2026 01:08:21 +0000" as " " 2026/10/07 01:08:21 DEBUG : Couldn't parse Date: from server ecph1.pcloud.com: "Wed, 07 Oct 2026 01:08:21 +0000": parsing time "Wed, 07 Oct 2026 01:08:21 +0000" as "Mon Jan _2 15:04:05 2006": cannot parse ", 07 Oct 2026 01:08:21 +0000" as " " --- PASS: TestIndexDelete (3.47s) === RUN TestIndexFilter run.go:198: Remote "pcloud root 'rclone-test-kiziruq4votu'", Local "Local file system at /tmp/rclone148111752", Modify Window "1s" 2026/10/07 01:08:23 DEBUG : other/notes.md: Excluded (Path Filter) 2026/10/07 01:08:23 DEBUG : sub/index.html.86c2cb5c.partial: size = 12056 OK 2026/10/07 01:08:23 DEBUG : sub/index.html: sha1 = f43b1d12d38d70abb2f3e84adfc2e1aaeb33b012 OK 2026/10/07 01:08:23 DEBUG : index.html.26a4bc3a.partial: size = 12399 OK 2026/10/07 01:08:23 DEBUG : index.html: sha1 = 3d13f5c4fd3fc4eea805a1ac45050d0b367d403b OK 2026/10/07 01:08:23 DEBUG : other/index.html.4808505d.partial: size = 11802 OK 2026/10/07 01:08:23 DEBUG : other/index.html: sha1 = c26bc239018f1ab8b5ff8dd1651620d8a3823e58 OK 2026/10/07 01:08:23 DEBUG : sub/index.html.86c2cb5c.partial: renamed to: sub/index.html 2026/10/07 01:08:23 INFO : sub/index.html: Copied (new) 2026/10/07 01:08:23 DEBUG : index.html.26a4bc3a.partial: renamed to: index.html 2026/10/07 01:08:23 INFO : index.html: Copied (new) 2026/10/07 01:08:24 DEBUG : other/index.html.4808505d.partial: renamed to: other/index.html 2026/10/07 01:08:24 INFO : other/index.html: Copied (new) 2026/10/07 01:08:24 DEBUG : Couldn't parse Date: from server ecph1.pcloud.com: "Wed, 07 Oct 2026 01:08:24 +0000": parsing time "Wed, 07 Oct 2026 01:08:24 +0000" as "Mon Jan _2 15:04:05 2006": cannot parse ", 07 Oct 2026 01:08:24 +0000" as " " 2026/10/07 01:08:24 DEBUG : Couldn't parse Date: from server ecph1.pcloud.com: "Wed, 07 Oct 2026 01:08:24 +0000": parsing time "Wed, 07 Oct 2026 01:08:24 +0000" as "Mon Jan _2 15:04:05 2006": cannot parse ", 07 Oct 2026 01:08:24 +0000" as " " 2026/10/07 01:08:25 DEBUG : Couldn't parse Date: from server ecph1.pcloud.com: "Wed, 07 Oct 2026 01:08:24 +0000": parsing time "Wed, 07 Oct 2026 01:08:24 +0000" as "Mon Jan _2 15:04:05 2006": cannot parse ", 07 Oct 2026 01:08:24 +0000" as " " 2026/10/07 01:08:25 DEBUG : Couldn't parse Date: from server ecph1.pcloud.com: "Wed, 07 Oct 2026 01:08:25 +0000": parsing time "Wed, 07 Oct 2026 01:08:25 +0000" as "Mon Jan _2 15:04:05 2006": cannot parse ", 07 Oct 2026 01:08:25 +0000" as " " 2026/10/07 01:08:25 DEBUG : other/notes.md: Excluded (Path Filter) 2026/10/07 01:08:25 DEBUG : index.html: sha1 = 3d13f5c4fd3fc4eea805a1ac45050d0b367d403b OK 2026/10/07 01:08:25 DEBUG : index.html: Unchanged skipping 2026/10/07 01:08:25 DEBUG : other/index.html: sha1 = c26bc239018f1ab8b5ff8dd1651620d8a3823e58 OK 2026/10/07 01:08:25 DEBUG : other/index.html: Unchanged skipping 2026/10/07 01:08:25 DEBUG : sub/index.html: sha1 = f43b1d12d38d70abb2f3e84adfc2e1aaeb33b012 OK 2026/10/07 01:08:25 DEBUG : sub/index.html: Unchanged skipping --- PASS: TestIndexFilter (4.67s) === RUN TestIndexRules run.go:198: Remote "pcloud root 'rclone-test-kiziruq4votu'", Local "Local file system at /tmp/rclone148111752", Modify Window "1s" 2026/10/07 01:08:28 DEBUG : index.html.a4a43459.partial: size = 11899 OK 2026/10/07 01:08:28 DEBUG : index.html: sha1 = 0e1d04b3cf3108aaf8f645662cc1ab871427da98 OK 2026/10/07 01:08:28 DEBUG : index.html.a4a43459.partial: renamed to: index.html 2026/10/07 01:08:28 INFO : index.html: Copied (new) index_test.go:113: Error Trace: /home/rclone/go/src/github.com/rclone/rclone/fs/operations/index_test.go:113 /home/rclone/go/src/github.com/rclone/rclone/fs/operations/index_test.go:253 Error: Not equal: expected: []string{"file1.txt", "index.html", "sub/deep/file3.txt", "sub/deep/index.html", "sub/file2.txt", "sub/index.html"} actual : []string{"file1.txt"} Diff: --- Expected +++ Actual @@ -1,8 +1,3 @@ -([]string) (len=6) { - (string) (len=9) "file1.txt", - (string) (len=10) "index.html", - (string) (len=18) "sub/deep/file3.txt", - (string) (len=19) "sub/deep/index.html", - (string) (len=13) "sub/file2.txt", - (string) (len=14) "sub/index.html" +([]string) (len=1) { + (string) (len=9) "file1.txt" } Test: TestIndexRules index_test.go:74: Error Trace: /home/rclone/go/src/github.com/rclone/rclone/fs/operations/index_test.go:74 /home/rclone/go/src/github.com/rclone/rclone/fs/operations/index_test.go:254 Error: Received unexpected error: object not found Test: TestIndexRules Messages: sub/deep/index.html run.go:186: removing dir "sub" failed - try 1/3: sleeping 1s: rmdir failed: pcloud error: Folder is not empty. (2006) run.go:186: removing dir "sub" failed - try 2/3: sleeping 1.5s: rmdir failed: pcloud error: Folder is not empty. (2006) run.go:186: removing dir "sub" failed: rmdir failed: pcloud error: Folder is not empty. (2006) fstest.go:299: Sleeping for 1s for list eventual consistency: 1/3 fstest.go:302: Flushing the directory cache fstest.go:299: Sleeping for 2s for list eventual consistency: 2/3 fstest.go:302: Flushing the directory cache fstest.go:299: Sleeping for 4s for list eventual consistency: 3/3 fstest.go:302: Flushing the directory cache fstest.go:306: Error Trace: /home/rclone/go/src/github.com/rclone/rclone/fstest/fstest.go:306 /home/rclone/go/src/github.com/rclone/rclone/fstest/fstest.go:339 /home/rclone/go/src/github.com/rclone/rclone/fstest/run.go:191 /home/rclone/go/src/github.com/rclone/rclone/fstest/run.go:406 /usr/local/go/src/testing/testing.go:1460 /usr/local/go/src/testing/testing.go:1820 /usr/local/go/src/testing/testing.go:2187 /usr/local/go/src/runtime/panic.go:694 /usr/local/go/src/testing/testing.go:1106 /home/rclone/go/src/github.com/rclone/rclone/fs/operations/index_test.go:74 /home/rclone/go/src/github.com/rclone/rclone/fs/operations/index_test.go:254 Error: Should be true Test: TestIndexRules Messages: listing wrong, want got index.html (11899), sub/deep/file3.txt (6), sub/deep/index.html (12) fstest.go:192: Error Trace: /home/rclone/go/src/github.com/rclone/rclone/fstest/fstest.go:192 /home/rclone/go/src/github.com/rclone/rclone/fstest/fstest.go:309 /home/rclone/go/src/github.com/rclone/rclone/fstest/fstest.go:339 /home/rclone/go/src/github.com/rclone/rclone/fstest/run.go:191 /home/rclone/go/src/github.com/rclone/rclone/fstest/run.go:406 /usr/local/go/src/testing/testing.go:1460 /usr/local/go/src/testing/testing.go:1820 /usr/local/go/src/testing/testing.go:2187 /usr/local/go/src/runtime/panic.go:694 /usr/local/go/src/testing/testing.go:1106 /home/rclone/go/src/github.com/rclone/rclone/fs/operations/index_test.go:74 /home/rclone/go/src/github.com/rclone/rclone/fs/operations/index_test.go:254 Error: Should be true Test: TestIndexRules Messages: Unexpected file "sub/deep/file3.txt" fstest.go:192: Error Trace: /home/rclone/go/src/github.com/rclone/rclone/fstest/fstest.go:192 /home/rclone/go/src/github.com/rclone/rclone/fstest/fstest.go:309 /home/rclone/go/src/github.com/rclone/rclone/fstest/fstest.go:339 /home/rclone/go/src/github.com/rclone/rclone/fstest/run.go:191 /home/rclone/go/src/github.com/rclone/rclone/fstest/run.go:406 /usr/local/go/src/testing/testing.go:1460 /usr/local/go/src/testing/testing.go:1820 /usr/local/go/src/testing/testing.go:2187 /usr/local/go/src/runtime/panic.go:694 /usr/local/go/src/testing/testing.go:1106 /home/rclone/go/src/github.com/rclone/rclone/fs/operations/index_test.go:74 /home/rclone/go/src/github.com/rclone/rclone/fs/operations/index_test.go:254 Error: Should be true Test: TestIndexRules Messages: Unexpected file "sub/deep/index.html" fstest.go:192: Error Trace: /home/rclone/go/src/github.com/rclone/rclone/fstest/fstest.go:192 /home/rclone/go/src/github.com/rclone/rclone/fstest/fstest.go:309 /home/rclone/go/src/github.com/rclone/rclone/fstest/fstest.go:339 /home/rclone/go/src/github.com/rclone/rclone/fstest/run.go:191 /home/rclone/go/src/github.com/rclone/rclone/fstest/run.go:406 /usr/local/go/src/testing/testing.go:1460 /usr/local/go/src/testing/testing.go:1820 /usr/local/go/src/testing/testing.go:2187 /usr/local/go/src/runtime/panic.go:694 /usr/local/go/src/testing/testing.go:1106 /home/rclone/go/src/github.com/rclone/rclone/fs/operations/index_test.go:74 /home/rclone/go/src/github.com/rclone/rclone/fs/operations/index_test.go:254 Error: Should be true Test: TestIndexRules Messages: Unexpected file "index.html" fstest.go:328: Error Trace: /home/rclone/go/src/github.com/rclone/rclone/fstest/fstest.go:328 /home/rclone/go/src/github.com/rclone/rclone/fstest/fstest.go:339 /home/rclone/go/src/github.com/rclone/rclone/fstest/run.go:191 /home/rclone/go/src/github.com/rclone/rclone/fstest/run.go:406 /usr/local/go/src/testing/testing.go:1460 /usr/local/go/src/testing/testing.go:1820 /usr/local/go/src/testing/testing.go:2187 /usr/local/go/src/runtime/panic.go:694 /usr/local/go/src/testing/testing.go:1106 /home/rclone/go/src/github.com/rclone/rclone/fs/operations/index_test.go:74 /home/rclone/go/src/github.com/rclone/rclone/fs/operations/index_test.go:254 Error: Not equal: expected: []string{} actual : []string{"sub", "sub/deep"} Diff: --- Expected +++ Actual @@ -1,2 +1,4 @@ -([]string) { +([]string) (len=2) { + (string) (len=3) "sub", + (string) (len=8) "sub/deep" } Test: TestIndexRules Messages: directories --- FAIL: TestIndexRules (13.67s) === RUN TestIndexMaxDepth run.go:198: Remote "pcloud root 'rclone-test-kiziruq4votu'", Local "Local file system at /tmp/rclone148111752", Modify Window "1s" 2026/10/07 01:08:42 DEBUG : index.html.26a7cd65.partial: size = 12147 OK 2026/10/07 01:08:42 DEBUG : index.html: sha1 = b9e0cb2d9a629490e16cd0b619b3163d1b649fb7 OK 2026/10/07 01:08:42 DEBUG : index.html.26a7cd65.partial: renamed to: index.html 2026/10/07 01:08:42 INFO : index.html: Copied (replaced existing) index_test.go:113: Error Trace: /home/rclone/go/src/github.com/rclone/rclone/fs/operations/index_test.go:113 /home/rclone/go/src/github.com/rclone/rclone/fs/operations/index_test.go:272 Error: Not equal: expected: []string{"file1.txt", "index.html", "sub/deep/file3.txt", "sub/file2.txt"} actual : []string{"file1.txt", "index.html", "sub/deep/file3.txt", "sub/deep/index.html", "sub/file2.txt"} Diff: --- Expected +++ Actual @@ -1,2 +1,2 @@ -([]string) (len=4) { +([]string) (len=5) { (string) (len=9) "file1.txt", @@ -4,2 +4,3 @@ (string) (len=18) "sub/deep/file3.txt", + (string) (len=19) "sub/deep/index.html", (string) (len=13) "sub/file2.txt" Test: TestIndexMaxDepth 2026/10/07 01:08:42 DEBUG : Couldn't parse Date: from server ecph1.pcloud.com: "Wed, 07 Oct 2026 01:08:42 +0000": parsing time "Wed, 07 Oct 2026 01:08:42 +0000" as "Mon Jan _2 15:04:05 2006": cannot parse ", 07 Oct 2026 01:08:42 +0000" as " " --- FAIL: TestIndexMaxDepth (2.81s) === RUN TestIndexLinkIndex run.go:198: Remote "pcloud root 'rclone-test-kiziruq4votu'", Local "Local file system at /tmp/rclone148111752", Modify Window "1s" 2026/10/07 01:08:44 DEBUG : index.html.b9856c97.partial: size = 12167 OK 2026/10/07 01:08:44 DEBUG : index.html: sha1 = eb36ce0be687c15ae7eaf7aa3ce7f0c547ae2fa7 OK 2026/10/07 01:08:44 DEBUG : sub/deep/index.html.5d8fa2b3.partial: size = 12128 OK 2026/10/07 01:08:44 DEBUG : sub/deep/index.html: sha1 = 47bec00435ef4e695be98062531713998c1d58f9 OK 2026/10/07 01:08:44 DEBUG : sub/index.html.4f6d789b.partial: size = 12347 OK 2026/10/07 01:08:44 DEBUG : sub/index.html: sha1 = f1ae80320b8cdad350f25ea5dfca08c52fcc8b0a OK 2026/10/07 01:08:44 DEBUG : index.html.b9856c97.partial: renamed to: index.html 2026/10/07 01:08:44 INFO : index.html: Copied (new) 2026/10/07 01:08:44 DEBUG : sub/deep/index.html.5d8fa2b3.partial: renamed to: sub/deep/index.html 2026/10/07 01:08:44 INFO : sub/deep/index.html: Copied (new) 2026/10/07 01:08:44 DEBUG : sub/index.html.4f6d789b.partial: renamed to: sub/index.html 2026/10/07 01:08:44 INFO : sub/index.html: Copied (new) 2026/10/07 01:08:44 DEBUG : Couldn't parse Date: from server ecph1.pcloud.com: "Wed, 07 Oct 2026 01:08:44 +0000": parsing time "Wed, 07 Oct 2026 01:08:44 +0000" as "Mon Jan _2 15:04:05 2006": cannot parse ", 07 Oct 2026 01:08:44 +0000" as " " index_test.go:74: Error Trace: /home/rclone/go/src/github.com/rclone/rclone/fs/operations/index_test.go:74 /home/rclone/go/src/github.com/rclone/rclone/fs/operations/index_test.go:281 Error: Received unexpected error: object not found Test: TestIndexLinkIndex Messages: sub/index.html fstest.go:299: Sleeping for 1s for list eventual consistency: 1/3 fstest.go:302: Flushing the directory cache fstest.go:293: Sleeping for 6s just to make sure --- FAIL: TestIndexLinkIndex (10.24s) === RUN TestIndexDirTime run.go:198: Remote "pcloud root 'rclone-test-kiziruq4votu'", Local "Local file system at /tmp/rclone148111752", Modify Window "1s" 2026/10/07 01:08:54 DEBUG : index.json.49e262ab.partial: size = 253 OK 2026/10/07 01:08:54 DEBUG : index.json: sha1 = e4d83d51fdc16cfd7c75cd5ac1ff006c2b3289f7 OK 2026/10/07 01:08:54 DEBUG : sub/deep/index.json.0d7f130d.partial: size = 139 OK 2026/10/07 01:08:54 DEBUG : sub/deep/index.json: sha1 = 2c4f33ba76143f6dc6f19b4ea8f83c0bec111f20 OK 2026/10/07 01:08:54 DEBUG : sub/index.json.0b50a54b.partial: size = 255 OK 2026/10/07 01:08:54 DEBUG : sub/index.json: sha1 = 8669bc1eef34841057d86c5caef0b7fe24730037 OK 2026/10/07 01:08:54 DEBUG : index.json.49e262ab.partial: renamed to: index.json 2026/10/07 01:08:54 INFO : index.json: Copied (new) 2026/10/07 01:08:54 DEBUG : sub/deep/index.json.0d7f130d.partial: renamed to: sub/deep/index.json 2026/10/07 01:08:54 INFO : sub/deep/index.json: Copied (new) 2026/10/07 01:08:54 DEBUG : sub/index.json.0b50a54b.partial: renamed to: sub/index.json 2026/10/07 01:08:54 INFO : sub/index.json: Copied (new) 2026/10/07 01:08:55 DEBUG : Couldn't parse Date: from server ecph1.pcloud.com: "Wed, 07 Oct 2026 01:08:55 +0000": parsing time "Wed, 07 Oct 2026 01:08:55 +0000" as "Mon Jan _2 15:04:05 2006": cannot parse ", 07 Oct 2026 01:08:55 +0000" as " " 2026/10/07 01:08:55 DEBUG : sub/deep/index.json: sha1 = 2c4f33ba76143f6dc6f19b4ea8f83c0bec111f20 OK 2026/10/07 01:08:55 DEBUG : sub/deep/index.json: Unchanged skipping 2026/10/07 01:08:55 DEBUG : index.json.10841ff7.partial: size = 233 OK 2026/10/07 01:08:55 DEBUG : index.json: sha1 = 977b80ac729efecfeef9dddf4e897fd1b3224593 OK 2026/10/07 01:08:55 DEBUG : sub/index.json.905725de.partial: size = 235 OK 2026/10/07 01:08:55 DEBUG : sub/index.json: sha1 = 4b3ad497f51638e119024a420cc6b48f83b49bd0 OK 2026/10/07 01:08:55 DEBUG : index.json.10841ff7.partial: renamed to: index.json 2026/10/07 01:08:55 INFO : index.json: Copied (replaced existing) 2026/10/07 01:08:55 DEBUG : sub/index.json.905725de.partial: renamed to: sub/index.json 2026/10/07 01:08:55 INFO : sub/index.json: Copied (replaced existing) 2026/10/07 01:08:56 DEBUG : Couldn't parse Date: from server ecph1.pcloud.com: "Wed, 07 Oct 2026 01:08:56 +0000": parsing time "Wed, 07 Oct 2026 01:08:56 +0000" as "Mon Jan _2 15:04:05 2006": cannot parse ", 07 Oct 2026 01:08:56 +0000" as " " 2026/10/07 01:08:56 DEBUG : sub/index.json.73c0c72e.partial: size = 215 OK 2026/10/07 01:08:56 DEBUG : sub/index.json: sha1 = cbb54a3e32f00b47d40f5f16525254ffde95d22c OK 2026/10/07 01:08:56 DEBUG : index.json.076c27eb.partial: size = 213 OK 2026/10/07 01:08:56 DEBUG : index.json: sha1 = d9cc947acac4654612c985ff36907340f138a435 OK 2026/10/07 01:08:56 DEBUG : sub/deep/index.json.71aecc79.partial: size = 119 OK 2026/10/07 01:08:56 DEBUG : sub/deep/index.json: sha1 = e3dfc52c4591e7201f0d0680f34bca98cc6555eb OK 2026/10/07 01:08:56 DEBUG : sub/index.json.73c0c72e.partial: renamed to: sub/index.json 2026/10/07 01:08:56 INFO : sub/index.json: Copied (replaced existing) 2026/10/07 01:08:56 DEBUG : index.json.076c27eb.partial: renamed to: index.json 2026/10/07 01:08:56 INFO : index.json: Copied (replaced existing) 2026/10/07 01:08:56 DEBUG : sub/deep/index.json.71aecc79.partial: renamed to: sub/deep/index.json 2026/10/07 01:08:56 INFO : sub/deep/index.json: Copied (replaced existing) 2026/10/07 01:08:56 DEBUG : Couldn't parse Date: from server ecph1.pcloud.com: "Wed, 07 Oct 2026 01:08:56 +0000": parsing time "Wed, 07 Oct 2026 01:08:56 +0000" as "Mon Jan _2 15:04:05 2006": cannot parse ", 07 Oct 2026 01:08:56 +0000" as " " --- PASS: TestIndexDirTime (4.13s) === RUN TestIndexTemplate run.go:198: Remote "pcloud root 'rclone-test-kiziruq4votu'", Local "Local file system at /tmp/rclone148111752", Modify Window "1s" 2026/10/07 01:08:58 DEBUG : sub/deep/list.txt.b561b203.partial: size = 47 OK 2026/10/07 01:08:58 DEBUG : sub/deep/list.txt: sha1 = 6b26e0afe505dcf58bc2f6934908e0e65761c750 OK 2026/10/07 01:08:58 DEBUG : list.txt.ecabf480.partial: size = 59 OK 2026/10/07 01:08:58 DEBUG : list.txt: sha1 = 20ae469bfe6fec2422f3261eba9a4ff1198fe114 OK 2026/10/07 01:08:58 DEBUG : sub/list.txt.ae0b96ed.partial: size = 64 OK 2026/10/07 01:08:58 DEBUG : sub/list.txt: sha1 = 944987f3278269276a40877f628fc030e13b2c81 OK 2026/10/07 01:08:59 DEBUG : sub/deep/list.txt.b561b203.partial: renamed to: sub/deep/list.txt 2026/10/07 01:08:59 INFO : sub/deep/list.txt: Copied (new) 2026/10/07 01:08:59 DEBUG : list.txt.ecabf480.partial: renamed to: list.txt 2026/10/07 01:08:59 INFO : list.txt: Copied (new) 2026/10/07 01:08:59 DEBUG : sub/list.txt.ae0b96ed.partial: renamed to: sub/list.txt 2026/10/07 01:08:59 INFO : sub/list.txt: Copied (new) 2026/10/07 01:08:59 DEBUG : Couldn't parse Date: from server ecph1.pcloud.com: "Wed, 07 Oct 2026 01:08:59 +0000": parsing time "Wed, 07 Oct 2026 01:08:59 +0000" as "Mon Jan _2 15:04:05 2006": cannot parse ", 07 Oct 2026 01:08:59 +0000" as " " --- PASS: TestIndexTemplate (2.43s) === RUN TestIndexTemplateBuiltin --- PASS: TestIndexTemplateBuiltin (0.00s) === RUN TestRcIndex rc_test.go:31: Skipping test on non local remote --- SKIP: TestRcIndex (0.00s) === RUN TestIndexNoHash index_test.go:385: Skipping test on non local remote --- SKIP: TestIndexNoHash (0.00s) === RUN TestIndexChanged run.go:198: Remote "pcloud root 'rclone-test-kiziruq4votu'", Local "Local file system at /tmp/rclone148111752", Modify Window "1s" 2026/10/07 01:09:01 DEBUG : sub/deep/index.html.f4c27777.partial: size = 12087 OK 2026/10/07 01:09:01 DEBUG : sub/deep/index.html: sha1 = cb5eca4dce208e59c9a030ca0e93c482f8e2386c OK 2026/10/07 01:09:01 DEBUG : index.html.7c0624bb.partial: size = 12399 OK 2026/10/07 01:09:01 DEBUG : index.html: sha1 = 3d13f5c4fd3fc4eea805a1ac45050d0b367d403b OK 2026/10/07 01:09:01 DEBUG : other/index.html.89133c82.partial: size = 12058 OK 2026/10/07 01:09:01 DEBUG : other/index.html: sha1 = 270563d2e4dcfc0be37a5d4cf209574bff504dc2 OK 2026/10/07 01:09:01 DEBUG : sub/index.html.b0197f92.partial: size = 12306 OK 2026/10/07 01:09:01 DEBUG : sub/index.html: sha1 = 7b8f50e9afa63c49c26d616c8b95dbd33f22a6ff OK 2026/10/07 01:09:01 DEBUG : sub/deep/index.html.f4c27777.partial: renamed to: sub/deep/index.html 2026/10/07 01:09:01 INFO : sub/deep/index.html: Copied (new) 2026/10/07 01:09:01 DEBUG : index.html.7c0624bb.partial: renamed to: index.html 2026/10/07 01:09:01 INFO : index.html: Copied (new) 2026/10/07 01:09:01 DEBUG : other/index.html.89133c82.partial: renamed to: other/index.html 2026/10/07 01:09:01 INFO : other/index.html: Copied (new) 2026/10/07 01:09:01 DEBUG : sub/index.html.b0197f92.partial: renamed to: sub/index.html 2026/10/07 01:09:01 INFO : sub/index.html: Copied (new) 2026/10/07 01:09:02 INFO : pcloud root 'rclone-test-kiziruq4votu': Partial index: listing 3 directories and walking 0 changed directories 2026/10/07 01:09:02 DEBUG : index.html: sha1 = 3d13f5c4fd3fc4eea805a1ac45050d0b367d403b OK 2026/10/07 01:09:02 DEBUG : index.html: Unchanged skipping 2026/10/07 01:09:02 DEBUG : sub/index.html: sha1 = 7b8f50e9afa63c49c26d616c8b95dbd33f22a6ff OK 2026/10/07 01:09:02 DEBUG : sub/index.html: Unchanged skipping 2026/10/07 01:09:02 DEBUG : sub/deep/index.html.115fd808.partial: size = 12346 OK 2026/10/07 01:09:02 DEBUG : sub/deep/index.html: sha1 = 5841ec4641e748f2adb9d6ec1b7614b2bbfa85db OK 2026/10/07 01:09:02 DEBUG : sub/deep/index.html.115fd808.partial: renamed to: sub/deep/index.html 2026/10/07 01:09:02 INFO : sub/deep/index.html: Copied (replaced existing) 2026/10/07 01:09:02 DEBUG : Couldn't parse Date: from server ecph1.pcloud.com: "Wed, 07 Oct 2026 01:09:02 +0000": parsing time "Wed, 07 Oct 2026 01:09:02 +0000" as "Mon Jan _2 15:04:05 2006": cannot parse ", 07 Oct 2026 01:09:02 +0000" as " " 2026/10/07 01:09:03 DEBUG : Couldn't parse Date: from server ecph1.pcloud.com: "Wed, 07 Oct 2026 01:09:03 +0000": parsing time "Wed, 07 Oct 2026 01:09:03 +0000" as "Mon Jan _2 15:04:05 2006": cannot parse ", 07 Oct 2026 01:09:03 +0000" as " " 2026/10/07 01:09:03 INFO : pcloud root 'rclone-test-kiziruq4votu': Partial index: listing 3 directories and walking 0 changed directories 2026/10/07 01:09:03 DEBUG : index.html: sha1 = 3d13f5c4fd3fc4eea805a1ac45050d0b367d403b OK 2026/10/07 01:09:03 DEBUG : index.html: Unchanged skipping 2026/10/07 01:09:03 DEBUG : sub/new/index.html.d3e9797b.partial: size = 11827 OK 2026/10/07 01:09:03 DEBUG : sub/new/index.html: sha1 = 78949f3998aa7c564c4579a086b5f39c0d498ded OK 2026/10/07 01:09:03 DEBUG : sub/index.html.4ee8da1a.partial: size = 12554 OK 2026/10/07 01:09:03 DEBUG : sub/index.html: sha1 = dad1c01e5d737828ffbd3c29e90fc7bf1cf2bd1a OK 2026/10/07 01:09:04 DEBUG : sub/new/index.html.d3e9797b.partial: renamed to: sub/new/index.html 2026/10/07 01:09:04 INFO : sub/new/index.html: Copied (new) 2026/10/07 01:09:04 DEBUG : sub/index.html.4ee8da1a.partial: renamed to: sub/index.html 2026/10/07 01:09:04 INFO : sub/index.html: Copied (replaced existing) 2026/10/07 01:09:04 DEBUG : Couldn't parse Date: from server ecph1.pcloud.com: "Wed, 07 Oct 2026 01:09:04 +0000": parsing time "Wed, 07 Oct 2026 01:09:04 +0000" as "Mon Jan _2 15:04:05 2006": cannot parse ", 07 Oct 2026 01:09:04 +0000" as " " index_test.go:425: Error Trace: /home/rclone/go/src/github.com/rclone/rclone/fs/operations/index_test.go:425 Error: "\n\n\n\n\t\n\t\t/sub\n\t\t\n\t\t\n\t\t\n\n\t\n\t\n\t\t\n\t\t\t\n\t\t\t\t\n\t\t\t\t\n\t\t\t\t\n\t\t\t\t\n\t\t\t\n\t\t\n\t\t
\n\t\t\t
Folder path
\n\t\t\t

/sub/\n\t\t\t

\n\t\t
\n\t\t
\n\t\t\t
\n\t\t\t\t
\n\t\t\t\t\t\n\t\t\t\t\t\n\t\t\t\t\t6 total\n\t\t\t\t
\n\t\t\t\t
\n\t\t\t\t\t\n\t\t\t\t\t\t\n\t\t\t\t\t\t\t\n\t\t\t\t\t\t\t\t\n\t\t\t\t\t\t\t\t\n\t\t\t\t\t\t\t\t\n\t\t\t\t\t\t\t\n\t\t\t\t\t\t\n\t\t\t\t\t\t\n\t\t\t\t\t\t\t\n\t\t\t\t\t\t\t\n\t\t\t\t\t\t\t\t\n\t\t\t\t\t\t\t\t\n\t\t\t\t\t\t\t\t\n\t\t\t\t\t\t\t\n\t\t\t\t\t\t\t\n\t\t\t\t\t\t\t\t\n\t\t\t\t\t\t\t\t\n\t\t\t\t\t\t\t\t\n\t\t\t\t\t\t\t\n\t\t\t\t\t\t\t\n\t\t\t\t\t\t\n\t\t\t\t\t
\n\t\t\t\t\t\t\t\t\tName\n\t\t\t\t\t\t\t\t\t\n\t\t\t\t\t\t\t\tSizeModified
Go up——
deep/\n\t\t\t\t\t\t\t\t——
file2.txt\n\t\t\t\t\t\t\t\t6—
\n\t\t\t\t
\n\t\t\t
\n\t\t
\n\t\t\n\t\n\n" does not contain "new/" Test: TestIndexChanged index_test.go:74: Error Trace: /home/rclone/go/src/github.com/rclone/rclone/fs/operations/index_test.go:74 /home/rclone/go/src/github.com/rclone/rclone/fs/operations/index_test.go:426 Error: Received unexpected error: object not found Test: TestIndexChanged Messages: sub/new/index.html run.go:173: removing file "sub/index.html" failed - try 1/3: sleeping 1s: pcloud error: File not found. (2009) run.go:173: removing file "sub/index.html" failed - try 2/3: sleeping 1.5s: pcloud error: File not found. (2009) run.go:173: removing file "sub/index.html" failed: pcloud error: File not found. (2009) run.go:186: removing dir "sub/new" failed - try 1/3: sleeping 1s: rmdir failed: pcloud error: Folder is not empty. (2006) run.go:186: removing dir "sub/new" failed - try 2/3: sleeping 1.5s: rmdir failed: pcloud error: Folder is not empty. (2006) run.go:186: removing dir "sub/new" failed: rmdir failed: pcloud error: Folder is not empty. (2006) run.go:186: removing dir "sub" failed - try 1/3: sleeping 1s: rmdir failed: pcloud error: Folder is not empty. (2006) run.go:186: removing dir "sub" failed - try 2/3: sleeping 1.5s: rmdir failed: pcloud error: Folder is not empty. (2006) run.go:186: removing dir "sub" failed: rmdir failed: pcloud error: Folder is not empty. (2006) fstest.go:299: Sleeping for 1s for list eventual consistency: 1/3 fstest.go:302: Flushing the directory cache fstest.go:299: Sleeping for 2s for list eventual consistency: 2/3 fstest.go:302: Flushing the directory cache fstest.go:299: Sleeping for 4s for list eventual consistency: 3/3 fstest.go:302: Flushing the directory cache fstest.go:306: Error Trace: /home/rclone/go/src/github.com/rclone/rclone/fstest/fstest.go:306 /home/rclone/go/src/github.com/rclone/rclone/fstest/fstest.go:339 /home/rclone/go/src/github.com/rclone/rclone/fstest/run.go:191 /home/rclone/go/src/github.com/rclone/rclone/fstest/run.go:406 /usr/local/go/src/testing/testing.go:1460 /usr/local/go/src/testing/testing.go:1820 /usr/local/go/src/testing/testing.go:2187 /usr/local/go/src/runtime/panic.go:694 /usr/local/go/src/testing/testing.go:1106 /home/rclone/go/src/github.com/rclone/rclone/fs/operations/index_test.go:74 /home/rclone/go/src/github.com/rclone/rclone/fs/operations/index_test.go:426 Error: Should be true Test: TestIndexChanged Messages: listing wrong, want got sub/index.html (12554), sub/new/index.html (11827) fstest.go:192: Error Trace: /home/rclone/go/src/github.com/rclone/rclone/fstest/fstest.go:192 /home/rclone/go/src/github.com/rclone/rclone/fstest/fstest.go:309 /home/rclone/go/src/github.com/rclone/rclone/fstest/fstest.go:339 /home/rclone/go/src/github.com/rclone/rclone/fstest/run.go:191 /home/rclone/go/src/github.com/rclone/rclone/fstest/run.go:406 /usr/local/go/src/testing/testing.go:1460 /usr/local/go/src/testing/testing.go:1820 /usr/local/go/src/testing/testing.go:2187 /usr/local/go/src/runtime/panic.go:694 /usr/local/go/src/testing/testing.go:1106 /home/rclone/go/src/github.com/rclone/rclone/fs/operations/index_test.go:74 /home/rclone/go/src/github.com/rclone/rclone/fs/operations/index_test.go:426 Error: Should be true Test: TestIndexChanged Messages: Unexpected file "sub/new/index.html" fstest.go:192: Error Trace: /home/rclone/go/src/github.com/rclone/rclone/fstest/fstest.go:192 /home/rclone/go/src/github.com/rclone/rclone/fstest/fstest.go:309 /home/rclone/go/src/github.com/rclone/rclone/fstest/fstest.go:339 /home/rclone/go/src/github.com/rclone/rclone/fstest/run.go:191 /home/rclone/go/src/github.com/rclone/rclone/fstest/run.go:406 /usr/local/go/src/testing/testing.go:1460 /usr/local/go/src/testing/testing.go:1820 /usr/local/go/src/testing/testing.go:2187 /usr/local/go/src/runtime/panic.go:694 /usr/local/go/src/testing/testing.go:1106 /home/rclone/go/src/github.com/rclone/rclone/fs/operations/index_test.go:74 /home/rclone/go/src/github.com/rclone/rclone/fs/operations/index_test.go:426 Error: Should be true Test: TestIndexChanged Messages: Unexpected file "sub/index.html" fstest.go:328: Error Trace: /home/rclone/go/src/github.com/rclone/rclone/fstest/fstest.go:328 /home/rclone/go/src/github.com/rclone/rclone/fstest/fstest.go:339 /home/rclone/go/src/github.com/rclone/rclone/fstest/run.go:191 /home/rclone/go/src/github.com/rclone/rclone/fstest/run.go:406 /usr/local/go/src/testing/testing.go:1460 /usr/local/go/src/testing/testing.go:1820 /usr/local/go/src/testing/testing.go:2187 /usr/local/go/src/runtime/panic.go:694 /usr/local/go/src/testing/testing.go:1106 /home/rclone/go/src/github.com/rclone/rclone/fs/operations/index_test.go:74 /home/rclone/go/src/github.com/rclone/rclone/fs/operations/index_test.go:426 Error: Not equal: expected: []string{} actual : []string{"sub", "sub/new"} Diff: --- Expected +++ Actual @@ -1,2 +1,4 @@ -([]string) { +([]string) (len=2) { + (string) (len=3) "sub", + (string) (len=7) "sub/new" } Test: TestIndexChanged Messages: directories --- FAIL: TestIndexChanged (22.20s) === RUN TestIndexChangedDelete run.go:198: Remote "pcloud root 'rclone-test-kiziruq4votu'", Local "Local file system at /tmp/rclone148111752", Modify Window "1s" 2026/10/07 01:09:25 DEBUG : sub/new/index.html: sha1 = 78949f3998aa7c564c4579a086b5f39c0d498ded OK 2026/10/07 01:09:25 DEBUG : sub/new/index.html: Unchanged skipping 2026/10/07 01:09:25 DEBUG : sub/index.html: sha1 = dad1c01e5d737828ffbd3c29e90fc7bf1cf2bd1a OK 2026/10/07 01:09:25 DEBUG : sub/index.html: Unchanged skipping 2026/10/07 01:09:25 DEBUG : index.html.69fdcabe.partial: size = 12147 OK 2026/10/07 01:09:25 DEBUG : index.html: sha1 = b9e0cb2d9a629490e16cd0b619b3163d1b649fb7 OK 2026/10/07 01:09:25 DEBUG : sub/deep/index.html.b3b21d17.partial: size = 12087 OK 2026/10/07 01:09:25 DEBUG : sub/deep/index.html: sha1 = cb5eca4dce208e59c9a030ca0e93c482f8e2386c OK 2026/10/07 01:09:26 DEBUG : index.html.69fdcabe.partial: renamed to: index.html 2026/10/07 01:09:26 INFO : index.html: Copied (new) 2026/10/07 01:09:26 DEBUG : sub/deep/index.html.b3b21d17.partial: renamed to: sub/deep/index.html 2026/10/07 01:09:26 INFO : sub/deep/index.html: Copied (new) 2026/10/07 01:09:26 INFO : pcloud root 'rclone-test-kiziruq4votu': Partial index: listing 3 directories and walking 0 changed directories 2026/10/07 01:09:26 DEBUG : index.html: sha1 = b9e0cb2d9a629490e16cd0b619b3163d1b649fb7 OK 2026/10/07 01:09:26 DEBUG : index.html: Unchanged skipping 2026/10/07 01:09:26 DEBUG : sub/index.html: sha1 = dad1c01e5d737828ffbd3c29e90fc7bf1cf2bd1a OK 2026/10/07 01:09:26 DEBUG : sub/index.html: Unchanged skipping 2026/10/07 01:09:26 DEBUG : sub/deep/index.html.e3ff2b93.partial: size = 11829 OK 2026/10/07 01:09:26 DEBUG : sub/deep/index.html: sha1 = fbbe4f8bb1d6c76a3b3553c67ffb6aba4b2b4f02 OK 2026/10/07 01:09:26 DEBUG : sub/deep/index.html.e3ff2b93.partial: renamed to: sub/deep/index.html 2026/10/07 01:09:26 INFO : sub/deep/index.html: Copied (replaced existing) 2026/10/07 01:09:26 DEBUG : Couldn't parse Date: from server ecph1.pcloud.com: "Wed, 07 Oct 2026 01:09:26 +0000": parsing time "Wed, 07 Oct 2026 01:09:26 +0000" as "Mon Jan _2 15:04:05 2006": cannot parse ", 07 Oct 2026 01:09:26 +0000" as " " --- PASS: TestIndexChangedDelete (5.60s) === RUN TestIndexChangedFiles run.go:198: Remote "pcloud root 'rclone-test-kiziruq4votu'", Local "Local file system at /tmp/rclone148111752", Modify Window "1s" 2026/10/07 01:09:29 DEBUG : index.html.ed2ab914.partial: size = 12147 OK 2026/10/07 01:09:29 DEBUG : index.html: sha1 = b9e0cb2d9a629490e16cd0b619b3163d1b649fb7 OK 2026/10/07 01:09:29 DEBUG : sub/index.html.1fc74a17.partial: size = 12056 OK 2026/10/07 01:09:29 DEBUG : sub/index.html: sha1 = f43b1d12d38d70abb2f3e84adfc2e1aaeb33b012 OK 2026/10/07 01:09:29 DEBUG : index.html.ed2ab914.partial: renamed to: index.html 2026/10/07 01:09:29 INFO : index.html: Copied (new) 2026/10/07 01:09:29 DEBUG : sub/index.html.1fc74a17.partial: renamed to: sub/index.html 2026/10/07 01:09:29 INFO : sub/index.html: Copied (new) 2026/10/07 01:09:29 INFO : pcloud root 'rclone-test-kiziruq4votu': Partial index: listing 2 directories and walking 0 changed directories 2026/10/07 01:09:30 DEBUG : - odd/index.html.98e960ee.partial: size = 12316 OK 2026/10/07 01:09:30 DEBUG : - odd/index.html: sha1 = a613006947846f9d52448dac30f8111e8bd81d6f OK 2026/10/07 01:09:30 DEBUG : index.html.361c9d89.partial: size = 12401 OK 2026/10/07 01:09:30 DEBUG : index.html: sha1 = fbd1e1e0fed9c1ad59390920a3fc76cf6314ffdf OK 2026/10/07 01:09:30 DEBUG : index.html.361c9d89.partial: renamed to: index.html 2026/10/07 01:09:30 INFO : index.html: Copied (replaced existing) 2026/10/07 01:09:30 DEBUG : - odd/index.html.98e960ee.partial: renamed to: - odd/index.html 2026/10/07 01:09:30 INFO : - odd/index.html: Copied (new) index_test.go:68: Error Trace: /home/rclone/go/src/github.com/rclone/rclone/fs/operations/index_test.go:68 /home/rclone/go/src/github.com/rclone/rclone/fs/operations/index_test.go:522 Error: Not equal: expected: 1 actual : 2 Test: TestIndexChangedFiles 2026/10/07 01:09:30 DEBUG : Couldn't parse Date: from server ecph1.pcloud.com: "Wed, 07 Oct 2026 01:09:30 +0000": parsing time "Wed, 07 Oct 2026 01:09:30 +0000" as "Mon Jan _2 15:04:05 2006": cannot parse ", 07 Oct 2026 01:09:30 +0000" as " " 2026/10/07 01:09:30 DEBUG : Couldn't parse Date: from server ecph1.pcloud.com: "Wed, 07 Oct 2026 01:09:30 +0000": parsing time "Wed, 07 Oct 2026 01:09:30 +0000" as "Mon Jan _2 15:04:05 2006": cannot parse ", 07 Oct 2026 01:09:30 +0000" as " " 2026/10/07 01:09:30 INFO : pcloud root 'rclone-test-kiziruq4votu': Partial index: listing 4 directories and walking 0 changed directories 2026/10/07 01:09:31 DEBUG : index.html: sha1 = fbd1e1e0fed9c1ad59390920a3fc76cf6314ffdf OK 2026/10/07 01:09:31 DEBUG : index.html: Unchanged skipping 2026/10/07 01:09:31 DEBUG : - odd/index.html: sha1 = a613006947846f9d52448dac30f8111e8bd81d6f OK 2026/10/07 01:09:31 DEBUG : - odd/index.html: Unchanged skipping 2026/10/07 01:09:31 DEBUG : sub/deep/index.html.a290ef4b.partial: size = 12087 OK 2026/10/07 01:09:31 DEBUG : sub/deep/index.html: sha1 = cb5eca4dce208e59c9a030ca0e93c482f8e2386c OK 2026/10/07 01:09:31 DEBUG : sub/index.html.a43f5db1.partial: size = 12565 OK 2026/10/07 01:09:31 DEBUG : sub/index.html: sha1 = 22afe58f860229b214d3d5451e537cdb9db162af OK 2026/10/07 01:09:31 DEBUG : sub/deep/index.html.a290ef4b.partial: renamed to: sub/deep/index.html 2026/10/07 01:09:31 INFO : sub/deep/index.html: Copied (new) 2026/10/07 01:09:31 DEBUG : sub/index.html.a43f5db1.partial: renamed to: sub/index.html 2026/10/07 01:09:31 INFO : sub/index.html: Copied (replaced existing) index_test.go:68: Error Trace: /home/rclone/go/src/github.com/rclone/rclone/fs/operations/index_test.go:68 /home/rclone/go/src/github.com/rclone/rclone/fs/operations/index_test.go:532 Error: Not equal: expected: 1 actual : 2 Test: TestIndexChangedFiles 2026/10/07 01:09:31 DEBUG : Couldn't parse Date: from server ecph1.pcloud.com: "Wed, 07 Oct 2026 01:09:31 +0000": parsing time "Wed, 07 Oct 2026 01:09:31 +0000" as "Mon Jan _2 15:04:05 2006": cannot parse ", 07 Oct 2026 01:09:31 +0000" as " " --- FAIL: TestIndexChangedFiles (5.14s) === RUN TestIndexChangedDirTime run.go:198: Remote "pcloud root 'rclone-test-kiziruq4votu'", Local "Local file system at /tmp/rclone148111752", Modify Window "1s" 2026/10/07 01:09:34 DEBUG : index.json.a858dbdf.partial: size = 371 OK 2026/10/07 01:09:34 DEBUG : index.json: sha1 = 1c67f34523f7017b566aa89a66ec02041ebdf15f OK 2026/10/07 01:09:34 DEBUG : other/index.json.1e56419d.partial: size = 140 OK 2026/10/07 01:09:34 DEBUG : other/index.json: sha1 = dec8e1092777797889db0990e4b11509af1e1929 OK 2026/10/07 01:09:34 DEBUG : sub/deep/index.json.0d7f130d.partial: size = 139 OK 2026/10/07 01:09:34 DEBUG : sub/deep/index.json: sha1 = 2c4f33ba76143f6dc6f19b4ea8f83c0bec111f20 OK 2026/10/07 01:09:34 DEBUG : sub/index.json.0b50a54b.partial: size = 255 OK 2026/10/07 01:09:34 DEBUG : sub/index.json: sha1 = 8669bc1eef34841057d86c5caef0b7fe24730037 OK 2026/10/07 01:09:34 DEBUG : index.json.a858dbdf.partial: renamed to: index.json 2026/10/07 01:09:34 INFO : index.json: Copied (new) 2026/10/07 01:09:34 DEBUG : other/index.json.1e56419d.partial: renamed to: other/index.json 2026/10/07 01:09:34 INFO : other/index.json: Copied (new) 2026/10/07 01:09:34 DEBUG : sub/deep/index.json.0d7f130d.partial: renamed to: sub/deep/index.json 2026/10/07 01:09:34 INFO : sub/deep/index.json: Copied (new) 2026/10/07 01:09:34 DEBUG : sub/index.json.0b50a54b.partial: renamed to: sub/index.json 2026/10/07 01:09:34 INFO : sub/index.json: Copied (new) 2026/10/07 01:09:34 INFO : pcloud root 'rclone-test-kiziruq4votu': Partial index: listing 3 directories and walking 0 changed directories 2026/10/07 01:09:35 DEBUG : index.json: sha1 = 1e205c0cbbad045a593e15e1ad45d5d722a7e088 (memory) 2026/10/07 01:09:35 DEBUG : index.json: sha1 = 1c67f34523f7017b566aa89a66ec02041ebdf15f (pcloud root 'rclone-test-kiziruq4votu') 2026/10/07 01:09:35 DEBUG : sub/index.json: sha1 = caacbcb3686d92ae24949c5cfafaea0fc588a272 (memory) 2026/10/07 01:09:35 DEBUG : sub/index.json: sha1 = 8669bc1eef34841057d86c5caef0b7fe24730037 (pcloud root 'rclone-test-kiziruq4votu') 2026/10/07 01:09:35 DEBUG : sub/deep/index.json.d2416d9f.partial: size = 275 OK 2026/10/07 01:09:35 DEBUG : sub/deep/index.json: sha1 = 677c87dd83b2ea9dad3fac000bcafc4e783daea0 OK 2026/10/07 01:09:35 DEBUG : index.json.d189d56e.partial: size = 371 OK 2026/10/07 01:09:35 DEBUG : index.json: sha1 = 1e205c0cbbad045a593e15e1ad45d5d722a7e088 OK 2026/10/07 01:09:35 DEBUG : sub/index.json.daddd79e.partial: size = 255 OK 2026/10/07 01:09:35 DEBUG : sub/index.json: sha1 = caacbcb3686d92ae24949c5cfafaea0fc588a272 OK 2026/10/07 01:09:35 DEBUG : sub/deep/index.json.d2416d9f.partial: renamed to: sub/deep/index.json 2026/10/07 01:09:35 INFO : sub/deep/index.json: Copied (replaced existing) 2026/10/07 01:09:35 DEBUG : index.json.d189d56e.partial: renamed to: index.json 2026/10/07 01:09:35 INFO : index.json: Copied (replaced existing) 2026/10/07 01:09:35 DEBUG : sub/index.json.daddd79e.partial: renamed to: sub/index.json 2026/10/07 01:09:35 INFO : sub/index.json: Copied (replaced existing) 2026/10/07 01:09:35 DEBUG : Couldn't parse Date: from server ecph1.pcloud.com: "Wed, 07 Oct 2026 01:09:35 +0000": parsing time "Wed, 07 Oct 2026 01:09:35 +0000" as "Mon Jan _2 15:04:05 2006": cannot parse ", 07 Oct 2026 01:09:35 +0000" as " " --- PASS: TestIndexChangedDirTime (3.92s) === RUN TestListDirSorted run.go:198: Remote "pcloud root 'rclone-test-kiziruq4votu'", Local "Local file system at /tmp/rclone148111752", Modify Window "1s" 2026/10/07 01:09:39 DEBUG : a.txt: Excluded (Size Filter) 2026/10/07 01:09:39 DEBUG : a.txt: Excluded 2026/10/07 01:09:39 DEBUG : sub dir/hello world: Excluded (Size Filter) 2026/10/07 01:09:39 DEBUG : sub dir/hello world: Excluded 2026/10/07 01:09:39 DEBUG : sub dir/hello world2: Excluded (Size Filter) 2026/10/07 01:09:39 DEBUG : sub dir/hello world2: Excluded 2026/10/07 01:09:39 DEBUG : sub dir/ignore dir: Excluded 2026/10/07 01:09:39 DEBUG : sub dir/hello world: Excluded (Size Filter) 2026/10/07 01:09:39 DEBUG : sub dir/hello world: Excluded 2026/10/07 01:09:39 DEBUG : sub dir/hello world2: Excluded (Size Filter) 2026/10/07 01:09:39 DEBUG : sub dir/hello world2: Excluded 2026/10/07 01:09:39 DEBUG : sub dir/ignore dir: Excluded fstest.go:299: Sleeping for 1s for list eventual consistency: 1/3 fstest.go:302: Flushing the directory cache fstest.go:293: Sleeping for 6s just to make sure --- PASS: TestListDirSorted (13.21s) === RUN TestListDirSortedFn run.go:198: Remote "pcloud root 'rclone-test-kiziruq4votu'", Local "Local file system at /tmp/rclone148111752", Modify Window "1s" 2026/10/07 01:09:52 DEBUG : a.txt: Excluded (Size Filter) 2026/10/07 01:09:52 DEBUG : a.txt: Excluded 2026/10/07 01:09:52 DEBUG : sub dir/hello world: Excluded (Size Filter) 2026/10/07 01:09:52 DEBUG : sub dir/hello world: Excluded 2026/10/07 01:09:52 DEBUG : sub dir/hello world2: Excluded (Size Filter) 2026/10/07 01:09:52 DEBUG : sub dir/hello world2: Excluded 2026/10/07 01:09:53 DEBUG : sub dir/ignore dir: Excluded 2026/10/07 01:09:53 DEBUG : sub dir/hello world: Excluded (Size Filter) 2026/10/07 01:09:53 DEBUG : sub dir/hello world: Excluded 2026/10/07 01:09:53 DEBUG : sub dir/hello world2: Excluded (Size Filter) 2026/10/07 01:09:53 DEBUG : sub dir/hello world2: Excluded 2026/10/07 01:09:53 DEBUG : sub dir/ignore dir: Excluded --- PASS: TestListDirSortedFn (4.29s) === RUN TestListJSON run.go:198: Remote "pcloud root 'rclone-test-kiziruq4votu'", Local "Local file system at /tmp/rclone148111752", Modify Window "1s" === RUN TestListJSON/Default === RUN TestListJSON/FilesOnly === RUN TestListJSON/DirsOnly === RUN TestListJSON/Recurse === RUN TestListJSON/SubDir === RUN TestListJSON/NoModTime === RUN TestListJSON/NoMimeType === RUN TestListJSON/ShowHash === RUN TestListJSON/HashTypes === RUN TestListJSON/Metadata --- PASS: TestListJSON (2.27s) --- PASS: TestListJSON/Default (0.09s) --- PASS: TestListJSON/FilesOnly (0.09s) --- PASS: TestListJSON/DirsOnly (0.10s) --- PASS: TestListJSON/Recurse (0.09s) --- PASS: TestListJSON/SubDir (0.09s) --- PASS: TestListJSON/NoModTime (0.09s) --- PASS: TestListJSON/NoMimeType (0.09s) --- PASS: TestListJSON/ShowHash (0.18s) --- PASS: TestListJSON/HashTypes (0.19s) --- PASS: TestListJSON/Metadata (0.09s) === RUN TestStatJSON run.go:198: Remote "pcloud root 'rclone-test-kiziruq4votu'", Local "Local file system at /tmp/rclone148111752", Modify Window "1s" === RUN TestStatJSON/Root === RUN TestStatJSON/RootFilesOnly === RUN TestStatJSON/RootDirsOnly === RUN TestStatJSON/Dir === RUN TestStatJSON/DirWithTrailingSlash === RUN TestStatJSON/File === RUN TestStatJSON/NotFound === RUN TestStatJSON/DirFilesOnly === RUN TestStatJSON/FileFilesOnly === RUN TestStatJSON/NotFoundFilesOnly === RUN TestStatJSON/DirDirsOnly === RUN TestStatJSON/FileDirsOnly === RUN TestStatJSON/NotFoundDirsOnly === RUN TestStatJSON/RootNotFound 2026/10/07 01:09:58 DEBUG : Creating backend with remote "TestPcloud:rclone-test-kiziruq4votu/notfound" === NAME TestStatJSON fstest.go:299: Sleeping for 1s for list eventual consistency: 1/3 fstest.go:302: Flushing the directory cache fstest.go:293: Sleeping for 6s just to make sure --- PASS: TestStatJSON (12.38s) --- PASS: TestStatJSON/Root (0.09s) --- PASS: TestStatJSON/RootFilesOnly (0.00s) --- PASS: TestStatJSON/RootDirsOnly (0.09s) --- PASS: TestStatJSON/Dir (0.19s) --- PASS: TestStatJSON/DirWithTrailingSlash (0.10s) --- PASS: TestStatJSON/File (0.09s) --- PASS: TestStatJSON/NotFound (0.18s) --- PASS: TestStatJSON/DirFilesOnly (0.10s) --- PASS: TestStatJSON/FileFilesOnly (0.10s) --- PASS: TestStatJSON/NotFoundFilesOnly (0.10s) --- PASS: TestStatJSON/DirDirsOnly (0.09s) --- PASS: TestStatJSON/FileDirsOnly (0.10s) --- PASS: TestStatJSON/NotFoundDirsOnly (0.09s) --- PASS: TestStatJSON/RootNotFound (1.09s) === RUN TestStatJSONMemory 2026/10/07 01:10:09 DEBUG : Creating backend with remote ":memory:" 2026/10/07 01:10:09 DEBUG : Memory root '': File to upload is small (5 bytes), uploading instead of streaming 2026/10/07 01:10:09 DEBUG : sub/file1: size = 5 OK 2026/10/07 01:10:09 DEBUG : sub/file1: md5 = 5d41402abc4b2a76b9719d911017c592 OK 2026/10/07 01:10:09 DEBUG : sub/file1: Size and md5 of src and dst objects identical === RUN TestStatJSONMemory/Dir === RUN TestStatJSONMemory/DirWithTrailingSlash === RUN TestStatJSONMemory/File === RUN TestStatJSONMemory/NotFound --- PASS: TestStatJSONMemory (0.00s) --- PASS: TestStatJSONMemory/Dir (0.00s) --- PASS: TestStatJSONMemory/DirWithTrailingSlash (0.00s) --- PASS: TestStatJSONMemory/File (0.00s) --- PASS: TestStatJSONMemory/NotFound (0.00s) === RUN TestStatJSONConfinement --- PASS: TestStatJSONConfinement (0.00s) === RUN TestMkdir run.go:198: Remote "pcloud root 'rclone-test-kiziruq4votu'", Local "Local file system at /tmp/rclone148111752", Modify Window "1s" 2026/10/07 01:10:09 INFO : pcloud root 'rclone-test-kiziruq4votu': Making directory 2026/10/07 01:10:09 INFO : pcloud root 'rclone-test-kiziruq4votu': Making directory --- PASS: TestMkdir (0.28s) === RUN TestLsd run.go:198: Remote "pcloud root 'rclone-test-kiziruq4votu'", Local "Local file system at /tmp/rclone148111752", Modify Window "1s" --- PASS: TestLsd (0.97s) === RUN TestLs run.go:198: Remote "pcloud root 'rclone-test-kiziruq4votu'", Local "Local file system at /tmp/rclone148111752", Modify Window "1s" --- PASS: TestLs (0.97s) === RUN TestLsWithFilesFrom run.go:198: Remote "pcloud root 'rclone-test-kiziruq4votu'", Local "Local file system at /tmp/rclone148111752", Modify Window "1s" 2026/10/07 01:10:12 DEBUG : empty space: Excluded (FilesFrom Filter) 2026/10/07 01:10:12 DEBUG : empty space: Excluded --- PASS: TestLsWithFilesFrom (1.12s) === RUN TestLsLong run.go:198: Remote "pcloud root 'rclone-test-kiziruq4votu'", Local "Local file system at /tmp/rclone148111752", Modify Window "1s" --- PASS: TestLsLong (0.97s) === RUN TestHashSums run.go:198: Remote "pcloud root 'rclone-test-kiziruq4votu'", Local "Local file system at /tmp/rclone148111752", Modify Window "1s" === RUN TestHashSums/Sha1 === RUN TestHashSums/Sha1Download 2026/10/07 01:10:14 DEBUG : Couldn't parse Date: from server ecph1.pcloud.com: "Wed, 07 Oct 2026 01:10:14 +0000": parsing time "Wed, 07 Oct 2026 01:10:14 +0000" as "Mon Jan _2 15:04:05 2006": cannot parse ", 07 Oct 2026 01:10:14 +0000" as " " 2026/10/07 01:10:14 DEBUG : Couldn't parse Date: from server ecph1.pcloud.com: "Wed, 07 Oct 2026 01:10:14 +0000": parsing time "Wed, 07 Oct 2026 01:10:14 +0000" as "Mon Jan _2 15:04:05 2006": cannot parse ", 07 Oct 2026 01:10:14 +0000" as " " --- PASS: TestHashSums (1.39s) --- PASS: TestHashSums/Sha1 (0.20s) --- PASS: TestHashSums/Sha1Download (0.28s) === RUN TestHashSumsWithErrors 2026/10/07 01:10:15 DEBUG : Creating backend with remote ":memory:" 2026/10/07 01:10:15 ERROR : file1: hash unsupported: hash type not supported 2026/10/07 01:10:15 ERROR : sub/file1: hash unsupported: hash type not supported 2026/10/07 01:10:15 ERROR : sub/file1: hash unsupported: hash type not supported --- PASS: TestHashSumsWithErrors (0.00s) === RUN TestHashStream 2026/10/07 01:10:15 DEBUG : Creating md5 hash of 0 bytes read from input stream 2026/10/07 01:10:15 DEBUG : Creating md5 hash of 0 bytes read from input stream 2026/10/07 01:10:15 DEBUG : Creating sha1 hash of 0 bytes read from input stream 2026/10/07 01:10:15 DEBUG : Creating sha1 hash of 0 bytes read from input stream 2026/10/07 01:10:15 DEBUG : Creating md5 hash of 12 bytes read from input stream 2026/10/07 01:10:15 DEBUG : Creating md5 hash of 12 bytes read from input stream 2026/10/07 01:10:15 DEBUG : Creating sha1 hash of 12 bytes read from input stream 2026/10/07 01:10:15 DEBUG : Creating sha1 hash of 12 bytes read from input stream --- PASS: TestHashStream (0.00s) === RUN TestSuffixName --- PASS: TestSuffixName (0.00s) === RUN TestCount run.go:198: Remote "pcloud root 'rclone-test-kiziruq4votu'", Local "Local file system at /tmp/rclone148111752", Modify Window "1s" --- PASS: TestCount (1.60s) === RUN TestDelete run.go:198: Remote "pcloud root 'rclone-test-kiziruq4votu'", Local "Local file system at /tmp/rclone148111752", Modify Window "1s" 2026/10/07 01:10:17 DEBUG : Waiting for deletions to finish 2026/10/07 01:10:17 DEBUG : large: Excluded (Size Filter) 2026/10/07 01:10:17 INFO : medium: Deleted 2026/10/07 01:10:17 INFO : small: Deleted --- PASS: TestDelete (1.39s) === RUN TestDeleteFatalError run.go:198: Remote "pcloud root 'rclone-test-kiziruq4votu'", Local "Local file system at /tmp/rclone148111752", Modify Window "1s" 2026/10/07 01:10:20 DEBUG : Waiting for deletions to finish 2026/10/07 01:10:20 ERROR : file0: Got fatal error on delete: --max-delete threshold reached 2026/10/07 01:10:20 ERROR : file10: Got fatal error on delete: --max-delete threshold reached 2026/10/07 01:10:20 ERROR : file1: Got fatal error on delete: --max-delete threshold reached 2026/10/07 01:10:20 ERROR : file12: Got fatal error on delete: --max-delete threshold reached 2026/10/07 01:10:20 ERROR : file13: Got fatal error on delete: --max-delete threshold reached 2026/10/07 01:10:20 ERROR : file2: Got fatal error on delete: --max-delete threshold reached 2026/10/07 01:10:20 ERROR : file3: Got fatal error on delete: --max-delete threshold reached 2026/10/07 01:10:20 ERROR : file4: Got fatal error on delete: --max-delete threshold reached 2026/10/07 01:10:20 ERROR : file5: Got fatal error on delete: --max-delete threshold reached 2026/10/07 01:10:20 ERROR : file6: Got fatal error on delete: --max-delete threshold reached 2026/10/07 01:10:20 ERROR : file7: Got fatal error on delete: --max-delete threshold reached 2026/10/07 01:10:20 ERROR : file8: Got fatal error on delete: --max-delete threshold reached 2026/10/07 01:10:20 ERROR : file9: Got fatal error on delete: --max-delete threshold reached 2026/10/07 01:10:20 ERROR : file11: Got fatal error on delete: --max-delete threshold reached fstest.go:299: Sleeping for 1s for list eventual consistency: 1/3 fstest.go:302: Flushing the directory cache fstest.go:299: Sleeping for 2s for list eventual consistency: 2/3 fstest.go:302: Flushing the directory cache fstest.go:299: Sleeping for 4s for list eventual consistency: 3/3 fstest.go:302: Flushing the directory cache fstest.go:306: Error Trace: /home/rclone/go/src/github.com/rclone/rclone/fstest/fstest.go:306 /home/rclone/go/src/github.com/rclone/rclone/fstest/fstest.go:339 /home/rclone/go/src/github.com/rclone/rclone/fstest/run.go:191 /home/rclone/go/src/github.com/rclone/rclone/fstest/run.go:406 /usr/local/go/src/testing/testing.go:1460 /usr/local/go/src/testing/testing.go:1820 /usr/local/go/src/testing/testing.go:2187 Error: Should be true Test: TestDeleteFatalError Messages: listing wrong, want got file14 (1), file15 (1), file16 (1), file17 (1), file18 (1), file19 (1) fstest.go:192: Error Trace: /home/rclone/go/src/github.com/rclone/rclone/fstest/fstest.go:192 /home/rclone/go/src/github.com/rclone/rclone/fstest/fstest.go:309 /home/rclone/go/src/github.com/rclone/rclone/fstest/fstest.go:339 /home/rclone/go/src/github.com/rclone/rclone/fstest/run.go:191 /home/rclone/go/src/github.com/rclone/rclone/fstest/run.go:406 /usr/local/go/src/testing/testing.go:1460 /usr/local/go/src/testing/testing.go:1820 /usr/local/go/src/testing/testing.go:2187 Error: Should be true Test: TestDeleteFatalError Messages: Unexpected file "file14" fstest.go:192: Error Trace: /home/rclone/go/src/github.com/rclone/rclone/fstest/fstest.go:192 /home/rclone/go/src/github.com/rclone/rclone/fstest/fstest.go:309 /home/rclone/go/src/github.com/rclone/rclone/fstest/fstest.go:339 /home/rclone/go/src/github.com/rclone/rclone/fstest/run.go:191 /home/rclone/go/src/github.com/rclone/rclone/fstest/run.go:406 /usr/local/go/src/testing/testing.go:1460 /usr/local/go/src/testing/testing.go:1820 /usr/local/go/src/testing/testing.go:2187 Error: Should be true Test: TestDeleteFatalError Messages: Unexpected file "file15" fstest.go:192: Error Trace: /home/rclone/go/src/github.com/rclone/rclone/fstest/fstest.go:192 /home/rclone/go/src/github.com/rclone/rclone/fstest/fstest.go:309 /home/rclone/go/src/github.com/rclone/rclone/fstest/fstest.go:339 /home/rclone/go/src/github.com/rclone/rclone/fstest/run.go:191 /home/rclone/go/src/github.com/rclone/rclone/fstest/run.go:406 /usr/local/go/src/testing/testing.go:1460 /usr/local/go/src/testing/testing.go:1820 /usr/local/go/src/testing/testing.go:2187 Error: Should be true Test: TestDeleteFatalError Messages: Unexpected file "file16" fstest.go:192: Error Trace: /home/rclone/go/src/github.com/rclone/rclone/fstest/fstest.go:192 /home/rclone/go/src/github.com/rclone/rclone/fstest/fstest.go:309 /home/rclone/go/src/github.com/rclone/rclone/fstest/fstest.go:339 /home/rclone/go/src/github.com/rclone/rclone/fstest/run.go:191 /home/rclone/go/src/github.com/rclone/rclone/fstest/run.go:406 /usr/local/go/src/testing/testing.go:1460 /usr/local/go/src/testing/testing.go:1820 /usr/local/go/src/testing/testing.go:2187 Error: Should be true Test: TestDeleteFatalError Messages: Unexpected file "file17" fstest.go:192: Error Trace: /home/rclone/go/src/github.com/rclone/rclone/fstest/fstest.go:192 /home/rclone/go/src/github.com/rclone/rclone/fstest/fstest.go:309 /home/rclone/go/src/github.com/rclone/rclone/fstest/fstest.go:339 /home/rclone/go/src/github.com/rclone/rclone/fstest/run.go:191 /home/rclone/go/src/github.com/rclone/rclone/fstest/run.go:406 /usr/local/go/src/testing/testing.go:1460 /usr/local/go/src/testing/testing.go:1820 /usr/local/go/src/testing/testing.go:2187 Error: Should be true Test: TestDeleteFatalError Messages: Unexpected file "file18" fstest.go:192: Error Trace: /home/rclone/go/src/github.com/rclone/rclone/fstest/fstest.go:192 /home/rclone/go/src/github.com/rclone/rclone/fstest/fstest.go:309 /home/rclone/go/src/github.com/rclone/rclone/fstest/fstest.go:339 /home/rclone/go/src/github.com/rclone/rclone/fstest/run.go:191 /home/rclone/go/src/github.com/rclone/rclone/fstest/run.go:406 /usr/local/go/src/testing/testing.go:1460 /usr/local/go/src/testing/testing.go:1820 /usr/local/go/src/testing/testing.go:2187 Error: Should be true Test: TestDeleteFatalError Messages: Unexpected file "file19" --- FAIL: TestDeleteFatalError (14.15s) === RUN TestMaxDelete run.go:198: Remote "pcloud root 'rclone-test-kiziruq4votu'", Local "Local file system at /tmp/rclone148111752", Modify Window "1s" fstest.go:299: Sleeping for 1s for list eventual consistency: 1/3 fstest.go:302: Flushing the directory cache fstest.go:299: Sleeping for 2s for list eventual consistency: 2/3 fstest.go:302: Flushing the directory cache fstest.go:299: Sleeping for 4s for list eventual consistency: 3/3 fstest.go:302: Flushing the directory cache fstest.go:306: Error Trace: /home/rclone/go/src/github.com/rclone/rclone/fstest/fstest.go:306 /home/rclone/go/src/github.com/rclone/rclone/fstest/fstest.go:339 /home/rclone/go/src/github.com/rclone/rclone/fstest/fstest.go:351 /home/rclone/go/src/github.com/rclone/rclone/fstest/run.go:358 /home/rclone/go/src/github.com/rclone/rclone/fs/operations/operations_test.go:478 Error: Should be true Test: TestMaxDelete Messages: listing wrong, want large (100), medium (60), small (10) got file14 (1), file15 (1), file16 (1), file17 (1), file18 (1), file19 (1), large (100), medium (60), small (10) fstest.go:192: Error Trace: /home/rclone/go/src/github.com/rclone/rclone/fstest/fstest.go:192 /home/rclone/go/src/github.com/rclone/rclone/fstest/fstest.go:309 /home/rclone/go/src/github.com/rclone/rclone/fstest/fstest.go:339 /home/rclone/go/src/github.com/rclone/rclone/fstest/fstest.go:351 /home/rclone/go/src/github.com/rclone/rclone/fstest/run.go:358 /home/rclone/go/src/github.com/rclone/rclone/fs/operations/operations_test.go:478 /usr/local/go/src/runtime/asm_amd64.s:1264 Error: Should be true Test: TestMaxDelete Messages: Unexpected file "file14" fstest.go:192: Error Trace: /home/rclone/go/src/github.com/rclone/rclone/fstest/fstest.go:192 /home/rclone/go/src/github.com/rclone/rclone/fstest/fstest.go:309 /home/rclone/go/src/github.com/rclone/rclone/fstest/fstest.go:339 /home/rclone/go/src/github.com/rclone/rclone/fstest/fstest.go:351 /home/rclone/go/src/github.com/rclone/rclone/fstest/run.go:358 /home/rclone/go/src/github.com/rclone/rclone/fs/operations/operations_test.go:478 /usr/local/go/src/runtime/asm_amd64.s:1264 Error: Should be true Test: TestMaxDelete Messages: Unexpected file "file15" fstest.go:192: Error Trace: /home/rclone/go/src/github.com/rclone/rclone/fstest/fstest.go:192 /home/rclone/go/src/github.com/rclone/rclone/fstest/fstest.go:309 /home/rclone/go/src/github.com/rclone/rclone/fstest/fstest.go:339 /home/rclone/go/src/github.com/rclone/rclone/fstest/fstest.go:351 /home/rclone/go/src/github.com/rclone/rclone/fstest/run.go:358 /home/rclone/go/src/github.com/rclone/rclone/fs/operations/operations_test.go:478 /usr/local/go/src/runtime/asm_amd64.s:1264 Error: Should be true Test: TestMaxDelete Messages: Unexpected file "file16" fstest.go:192: Error Trace: /home/rclone/go/src/github.com/rclone/rclone/fstest/fstest.go:192 /home/rclone/go/src/github.com/rclone/rclone/fstest/fstest.go:309 /home/rclone/go/src/github.com/rclone/rclone/fstest/fstest.go:339 /home/rclone/go/src/github.com/rclone/rclone/fstest/fstest.go:351 /home/rclone/go/src/github.com/rclone/rclone/fstest/run.go:358 /home/rclone/go/src/github.com/rclone/rclone/fs/operations/operations_test.go:478 /usr/local/go/src/runtime/asm_amd64.s:1264 Error: Should be true Test: TestMaxDelete Messages: Unexpected file "file17" fstest.go:192: Error Trace: /home/rclone/go/src/github.com/rclone/rclone/fstest/fstest.go:192 /home/rclone/go/src/github.com/rclone/rclone/fstest/fstest.go:309 /home/rclone/go/src/github.com/rclone/rclone/fstest/fstest.go:339 /home/rclone/go/src/github.com/rclone/rclone/fstest/fstest.go:351 /home/rclone/go/src/github.com/rclone/rclone/fstest/run.go:358 /home/rclone/go/src/github.com/rclone/rclone/fs/operations/operations_test.go:478 /usr/local/go/src/runtime/asm_amd64.s:1264 Error: Should be true Test: TestMaxDelete Messages: Unexpected file "file18" fstest.go:192: Error Trace: /home/rclone/go/src/github.com/rclone/rclone/fstest/fstest.go:192 /home/rclone/go/src/github.com/rclone/rclone/fstest/fstest.go:309 /home/rclone/go/src/github.com/rclone/rclone/fstest/fstest.go:339 /home/rclone/go/src/github.com/rclone/rclone/fstest/fstest.go:351 /home/rclone/go/src/github.com/rclone/rclone/fstest/run.go:358 /home/rclone/go/src/github.com/rclone/rclone/fs/operations/operations_test.go:478 /usr/local/go/src/runtime/asm_amd64.s:1264 Error: Should be true Test: TestMaxDelete Messages: Unexpected file "file19" 2026/10/07 01:10:42 DEBUG : Waiting for deletions to finish 2026/10/07 01:10:45 ERROR : file14: Got fatal error on delete: --max-delete threshold reached 2026/10/07 01:10:45 ERROR : file19: Got fatal error on delete: --max-delete threshold reached 2026/10/07 01:10:45 ERROR : file18: Got fatal error on delete: --max-delete threshold reached 2026/10/07 01:10:45 ERROR : file16: Got fatal error on delete: --max-delete threshold reached 2026/10/07 01:10:45 ERROR : large: Got fatal error on delete: --max-delete threshold reached 2026/10/07 01:10:45 ERROR : file15: Got fatal error on delete: --max-delete threshold reached 2026/10/07 01:10:45 ERROR : small: Got fatal error on delete: --max-delete threshold reached 2026/10/07 01:10:45 INFO : medium: Deleted 2026/10/07 01:10:45 INFO : file17: Deleted operations_test.go:484: Error Trace: /home/rclone/go/src/github.com/rclone/rclone/fs/operations/operations_test.go:484 Error: Not equal: expected: 1 actual : 9 Test: TestMaxDelete --- FAIL: TestMaxDelete (15.16s) === RUN TestMaxDeleteSizeLargeFile run.go:198: Remote "pcloud root 'rclone-test-kiziruq4votu'", Local "Local file system at /tmp/rclone148111752", Modify Window "1s" 2026/10/07 01:10:48 DEBUG : Waiting for deletions to finish 2026/10/07 01:10:48 ERROR : large: Got fatal error on delete: --max-delete-size threshold reached 2026/10/07 01:10:48 INFO : medium: Deleted 2026/10/07 01:10:48 INFO : small: Deleted --- PASS: TestMaxDeleteSizeLargeFile (1.56s) === RUN TestMaxDeleteSize run.go:198: Remote "pcloud root 'rclone-test-kiziruq4votu'", Local "Local file system at /tmp/rclone148111752", Modify Window "1s" 2026/10/07 01:10:49 DEBUG : Waiting for deletions to finish 2026/10/07 01:10:49 ERROR : small: Got fatal error on delete: --max-delete-size threshold reached 2026/10/07 01:10:49 INFO : large: Deleted 2026/10/07 01:10:49 INFO : medium: Deleted --- PASS: TestMaxDeleteSize (1.47s) === RUN TestReadFile run.go:198: Remote "pcloud root 'rclone-test-kiziruq4votu'", Local "Local file system at /tmp/rclone148111752", Modify Window "1s" 2026/10/07 01:10:50 DEBUG : Couldn't parse Date: from server ecph1.pcloud.com: "Wed, 07 Oct 2026 01:10:50 +0000": parsing time "Wed, 07 Oct 2026 01:10:50 +0000" as "Mon Jan _2 15:04:05 2006": cannot parse ", 07 Oct 2026 01:10:50 +0000" as " " --- PASS: TestReadFile (1.01s) === RUN TestRetry 2026/10/07 01:10:51 DEBUG : Received error: Wrapped EOF is retriable: EOF - low level retry 1/5 2026/10/07 01:10:51 DEBUG : Received error: Wrapped EOF is retriable: EOF - low level retry 2/5 2026/10/07 01:10:51 DEBUG : Sleeping for 10ms (as indicated by the server) to obey Retry-After error: BANG: trying again in 10ms 2026/10/07 01:10:51 DEBUG : Sleeping for 10ms (as indicated by the server) to obey Retry-After error: BANG: trying again in 10ms 2026/10/07 01:10:51 DEBUG : Sleeping for 10ms (as indicated by the server) to obey Retry-After error: BANG: trying again in 10ms 2026/10/07 01:10:51 DEBUG : Sleeping for 10ms (as indicated by the server) to obey Retry-After error: BANG: trying again in 10ms --- PASS: TestRetry (0.04s) === RUN TestRetryAfterContextCancel 2026/10/07 01:10:51 DEBUG : Sleeping for 1h0m0s (as indicated by the server) to obey Retry-After error: BANG: trying again in 1h0m0s --- PASS: TestRetryAfterContextCancel (0.00s) === RUN TestRetryAfterLastTry --- PASS: TestRetryAfterLastTry (0.00s) === RUN TestCat run.go:198: Remote "pcloud root 'rclone-test-kiziruq4votu'", Local "Local file system at /tmp/rclone148111752", Modify Window "1s" 2026/10/07 01:10:52 DEBUG : Couldn't parse Date: from server ecph1.pcloud.com: "Wed, 07 Oct 2026 01:10:52 +0000": parsing time "Wed, 07 Oct 2026 01:10:52 +0000" as "Mon Jan _2 15:04:05 2006": cannot parse ", 07 Oct 2026 01:10:52 +0000" as " " 2026/10/07 01:10:52 DEBUG : Couldn't parse Date: from server ecph1.pcloud.com: "Wed, 07 Oct 2026 01:10:52 +0000": parsing time "Wed, 07 Oct 2026 01:10:52 +0000" as "Mon Jan _2 15:04:05 2006": cannot parse ", 07 Oct 2026 01:10:52 +0000" as " " 2026/10/07 01:10:52 DEBUG : Couldn't parse Date: from server ecph1.pcloud.com: "Wed, 07 Oct 2026 01:10:52 +0000": parsing time "Wed, 07 Oct 2026 01:10:52 +0000" as "Mon Jan _2 15:04:05 2006": cannot parse ", 07 Oct 2026 01:10:52 +0000" as " " 2026/10/07 01:10:52 DEBUG : Couldn't parse Date: from server ecph1.pcloud.com: "Wed, 07 Oct 2026 01:10:52 +0000": parsing time "Wed, 07 Oct 2026 01:10:52 +0000" as "Mon Jan _2 15:04:05 2006": cannot parse ", 07 Oct 2026 01:10:52 +0000" as " " 2026/10/07 01:10:53 DEBUG : Couldn't parse Date: from server ecph1.pcloud.com: "Wed, 07 Oct 2026 01:10:52 +0000": parsing time "Wed, 07 Oct 2026 01:10:52 +0000" as "Mon Jan _2 15:04:05 2006": cannot parse ", 07 Oct 2026 01:10:52 +0000" as " " 2026/10/07 01:10:53 DEBUG : Couldn't parse Date: from server ecph1.pcloud.com: "Wed, 07 Oct 2026 01:10:53 +0000": parsing time "Wed, 07 Oct 2026 01:10:53 +0000" as "Mon Jan _2 15:04:05 2006": cannot parse ", 07 Oct 2026 01:10:53 +0000" as " " 2026/10/07 01:10:53 DEBUG : Couldn't parse Date: from server ecph1.pcloud.com: "Wed, 07 Oct 2026 01:10:53 +0000": parsing time "Wed, 07 Oct 2026 01:10:53 +0000" as "Mon Jan _2 15:04:05 2006": cannot parse ", 07 Oct 2026 01:10:53 +0000" as " " 2026/10/07 01:10:53 DEBUG : Couldn't parse Date: from server ecph1.pcloud.com: "Wed, 07 Oct 2026 01:10:53 +0000": parsing time "Wed, 07 Oct 2026 01:10:53 +0000" as "Mon Jan _2 15:04:05 2006": cannot parse ", 07 Oct 2026 01:10:53 +0000" as " " 2026/10/07 01:10:53 DEBUG : Couldn't parse Date: from server ecph1.pcloud.com: "Wed, 07 Oct 2026 01:10:53 +0000": parsing time "Wed, 07 Oct 2026 01:10:53 +0000" as "Mon Jan _2 15:04:05 2006": cannot parse ", 07 Oct 2026 01:10:53 +0000" as " " 2026/10/07 01:10:53 DEBUG : Couldn't parse Date: from server ecph1.pcloud.com: "Wed, 07 Oct 2026 01:10:53 +0000": parsing time "Wed, 07 Oct 2026 01:10:53 +0000" as "Mon Jan _2 15:04:05 2006": cannot parse ", 07 Oct 2026 01:10:53 +0000" as " " --- PASS: TestCat (2.90s) === RUN TestPurge 2026/10/07 01:10:54 DEBUG : Creating backend with remote "TestPcloud:rclone-test-fofocud8cowi" 2026/10/07 01:10:54 DEBUG : Using config file from "/home/rclone/.rclone.conf" 2026/10/07 01:10:55 DEBUG : Creating backend with remote "/tmp/rclone1825769349" run.go:198: Remote "pcloud root 'rclone-test-fofocud8cowi'", Local "Local file system at /tmp/rclone1825769349", Modify Window "1s" 2026/10/07 01:10:56 INFO : A2: Making directory 2026/10/07 01:10:57 INFO : A1/B2: Making directory 2026/10/07 01:10:57 INFO : A1/B2/C2: Making directory 2026/10/07 01:10:57 INFO : A1/B1/C3: Making directory 2026/10/07 01:10:57 INFO : A3: Making directory 2026/10/07 01:10:57 INFO : A3/B3: Making directory 2026/10/07 01:10:58 INFO : A3/B3/C4: Making directory 2026/10/07 01:10:59 DEBUG : pcloud root 'rclone-test-fofocud8cowi': Purge remote 2026/10/07 01:11:00 NOTICE: purge failed: directory not found --- PASS: TestPurge (6.09s) === RUN TestRmdirsNoLeaveRoot run.go:198: Remote "pcloud root 'rclone-test-kiziruq4votu'", Local "Local file system at /tmp/rclone148111752", Modify Window "1s" 2026/10/07 01:11:01 INFO : A2: Making directory 2026/10/07 01:11:01 INFO : A1/B2: Making directory 2026/10/07 01:11:01 INFO : A1/B2/C2: Making directory 2026/10/07 01:11:01 INFO : A1/B1/C3: Making directory 2026/10/07 01:11:01 INFO : A3: Making directory 2026/10/07 01:11:02 INFO : A3/B3: Making directory 2026/10/07 01:11:02 INFO : A3/B3/C4: Making directory 2026/10/07 01:11:02 DEBUG : removing 1 level 3 directories 2026/10/07 01:11:02 INFO : A3/B3/C4: Removing directory 2026/10/07 01:11:03 DEBUG : removing 2 level 3 directories 2026/10/07 01:11:03 INFO : A1/B2/C2: Removing directory 2026/10/07 01:11:03 INFO : A1/B1/C3: Removing directory 2026/10/07 01:11:03 DEBUG : removing 2 level 2 directories 2026/10/07 01:11:03 INFO : A3/B3: Removing directory 2026/10/07 01:11:03 INFO : A1/B2: Removing directory 2026/10/07 01:11:03 DEBUG : removing 2 level 1 directories 2026/10/07 01:11:03 INFO : A3: Removing directory 2026/10/07 01:11:03 INFO : A2: Removing directory fstest.go:299: Sleeping for 1s for list eventual consistency: 1/3 fstest.go:302: Flushing the directory cache fstest.go:293: Sleeping for 6s just to make sure 2026/10/07 01:11:12 DEBUG : removing 1 level 3 directories 2026/10/07 01:11:12 INFO : A1/B1/C1: Removing directory 2026/10/07 01:11:12 DEBUG : removing 1 level 2 directories 2026/10/07 01:11:12 INFO : A1/B1: Removing directory 2026/10/07 01:11:12 DEBUG : removing 1 level 1 directories 2026/10/07 01:11:12 INFO : A1: Removing directory 2026/10/07 01:11:13 DEBUG : removing 1 level 0 directories 2026/10/07 01:11:13 INFO : pcloud root 'rclone-test-kiziruq4votu': Removing directory --- PASS: TestRmdirsNoLeaveRoot (13.64s) === RUN TestRmdirsLeaveRoot run.go:198: Remote "pcloud root 'rclone-test-kiziruq4votu'", Local "Local file system at /tmp/rclone148111752", Modify Window "1s" 2026/10/07 01:11:15 INFO : A1: Making directory 2026/10/07 01:11:15 INFO : A1/B1: Making directory 2026/10/07 01:11:15 INFO : A1/B1/C1: Making directory fstest.go:299: Sleeping for 1s for list eventual consistency: 1/3 fstest.go:302: Flushing the directory cache fstest.go:293: Sleeping for 6s just to make sure 2026/10/07 01:11:23 DEBUG : removing 1 level 3 directories 2026/10/07 01:11:23 INFO : A1/B1/C1: Removing directory 2026/10/07 01:11:23 DEBUG : removing 1 level 2 directories 2026/10/07 01:11:23 INFO : A1/B1: Removing directory --- PASS: TestRmdirsLeaveRoot (10.30s) === RUN TestRmdirsWithFilter run.go:198: Remote "pcloud root 'rclone-test-kiziruq4votu'", Local "Local file system at /tmp/rclone148111752", Modify Window "1s" 2026/10/07 01:11:24 INFO : A1: Making directory 2026/10/07 01:11:24 INFO : A1/B1: Making directory 2026/10/07 01:11:24 INFO : A1/B1/C1: Making directory 2026/10/07 01:11:25 DEBUG : removing 1 level 3 directories 2026/10/07 01:11:25 INFO : A1/B1/C1: Removing directory 2026/10/07 01:11:25 DEBUG : removing 1 level 2 directories 2026/10/07 01:11:25 INFO : A1/B1: Removing directory --- PASS: TestRmdirsWithFilter (1.65s) === RUN TestCopyURL run.go:198: Remote "pcloud root 'rclone-test-kiziruq4votu'", Local "Local file system at /tmp/rclone148111752", Modify Window "1s" 2026/10/07 01:11:26 DEBUG : file1: size = 14 OK 2026/10/07 01:11:26 DEBUG : file1: sha1 = 3c3771c1f3304bdb052b101cc97a23df1ab9531f OK 2026/10/07 01:11:26 DEBUG : filename.txt: File name found in url 2026/10/07 01:11:26 DEBUG : filename.txt: size = 14 OK 2026/10/07 01:11:26 DEBUG : filename.txt: sha1 = 3c3771c1f3304bdb052b101cc97a23df1ab9531f OK 2026/10/07 01:11:26 DEBUG : headerfilename.txt: filename found in Content-Disposition header. 2026/10/07 01:11:26 DEBUG : headerfilename.txt: size = 14 OK 2026/10/07 01:11:26 DEBUG : headerfilename.txt: sha1 = 3c3771c1f3304bdb052b101cc97a23df1ab9531f OK 2026/10/07 01:11:26 DEBUG : file2: size = 14 OK 2026/10/07 01:11:26 DEBUG : file2: sha1 = 3c3771c1f3304bdb052b101cc97a23df1ab9531f OK --- PASS: TestCopyURL (1.88s) === RUN TestCopyURLDownloadHeaders run.go:198: Remote "pcloud root 'rclone-test-kiziruq4votu'", Local "Local file system at /tmp/rclone148111752", Modify Window "1s" 2026/10/07 01:11:27 DEBUG : file1: size = 14 OK 2026/10/07 01:11:27 DEBUG : file1: sha1 = 3c3771c1f3304bdb052b101cc97a23df1ab9531f OK --- PASS: TestCopyURLDownloadHeaders (0.39s) === RUN TestCopyURLToWriter --- PASS: TestCopyURLToWriter (0.00s) === RUN TestMoveFile run.go:198: Remote "pcloud root 'rclone-test-kiziruq4votu'", Local "Local file system at /tmp/rclone148111752", Modify Window "1s" 2026/10/07 01:11:28 DEBUG : file1: Need to transfer - File not found at Destination 2026/10/07 01:11:28 DEBUG : sub/file2.3cb2966d.partial: size = 14 OK 2026/10/07 01:11:28 DEBUG : file1: sha1 = a379624177abc4679cafafa8eae1d73e1478aaa6 OK 2026/10/07 01:11:28 DEBUG : sub/file2.3cb2966d.partial: renamed to: sub/file2 2026/10/07 01:11:28 INFO : file1: Copied (new) to: sub/file2 2026/10/07 01:11:28 INFO : file1: Deleted 2026/10/07 01:11:28 DEBUG : sub/file2: size = 14 OK 2026/10/07 01:11:28 DEBUG : file1: Size and modification time the same (differ by -499.999999ms, within tolerance 1s) 2026/10/07 01:11:28 DEBUG : file1: Unchanged skipping 2026/10/07 01:11:28 INFO : file1: Deleted 2026/10/07 01:11:29 DEBUG : pcloud root 'rclone-test-kiziruq4votu': don't need to copy/move sub/file2, it is already at target location --- PASS: TestMoveFile (1.52s) === RUN TestMoveFileWithIgnoreExisting run.go:198: Remote "pcloud root 'rclone-test-kiziruq4votu'", Local "Local file system at /tmp/rclone148111752", Modify Window "1s" 2026/10/07 01:11:29 DEBUG : file1: Need to transfer - File not found at Destination 2026/10/07 01:11:29 DEBUG : file1.9aa3f62d.partial: size = 14 OK 2026/10/07 01:11:29 DEBUG : file1: sha1 = a379624177abc4679cafafa8eae1d73e1478aaa6 OK 2026/10/07 01:11:30 DEBUG : file1.9aa3f62d.partial: renamed to: file1 2026/10/07 01:11:30 INFO : file1: Copied (new) 2026/10/07 01:11:30 INFO : file1: Deleted 2026/10/07 01:11:30 DEBUG : file1: Destination exists, skipping 2026/10/07 01:11:30 DEBUG : file1: Not removing source file as destination file exists and --ignore-existing is set --- PASS: TestMoveFileWithIgnoreExisting (1.06s) === RUN TestMoveFileImmutable run.go:198: Remote "pcloud root 'rclone-test-kiziruq4votu'", Local "Local file system at /tmp/rclone148111752", Modify Window "1s" 2026/10/07 01:11:31 DEBUG : existing: size = 8 (Local file system at /tmp/rclone148111752) 2026/10/07 01:11:31 DEBUG : existing: size = 6 (pcloud root 'rclone-test-kiziruq4votu') 2026/10/07 01:11:31 DEBUG : existing: Sizes differ 2026/10/07 01:11:31 ERROR : existing: Source and destination exist but do not match: immutable file modified --- PASS: TestMoveFileImmutable (0.85s) === RUN TestCaseInsensitiveMoveFile run.go:198: Remote "pcloud root 'rclone-test-kiziruq4votu'", Local "Local file system at /tmp/rclone148111752", Modify Window "1s" --- PASS: TestCaseInsensitiveMoveFile (0.19s) === RUN TestCaseInsensitiveMoveFileDryRun run.go:198: Remote "pcloud root 'rclone-test-kiziruq4votu'", Local "Local file system at /tmp/rclone148111752", Modify Window "1s" --- PASS: TestCaseInsensitiveMoveFileDryRun (0.18s) === RUN TestMoveFileBackupDir run.go:198: Remote "pcloud root 'rclone-test-kiziruq4votu'", Local "Local file system at /tmp/rclone148111752", Modify Window "1s" fstest.go:299: Sleeping for 1s for list eventual consistency: 1/3 fstest.go:302: Flushing the directory cache fstest.go:293: Sleeping for 6s just to make sure 2026/10/07 01:11:40 DEBUG : Creating backend with remote "TestPcloud:rclone-test-kiziruq4votu/backup" 2026/10/07 01:11:40 DEBUG : Config file has changed externally - reloading 2026/10/07 01:11:43 DEBUG : dst/file1: size = 14 (Local file system at /tmp/rclone148111752) 2026/10/07 01:11:43 DEBUG : dst/file1: size = 18 (pcloud root 'rclone-test-kiziruq4votu') 2026/10/07 01:11:43 DEBUG : dst/file1: Sizes differ 2026/10/07 01:11:43 INFO : dst/file1: Moved (server-side) 2026/10/07 01:11:43 DEBUG : dst/file1.58903690.partial: size = 14 OK 2026/10/07 01:11:43 DEBUG : dst/file1: sha1 = a379624177abc4679cafafa8eae1d73e1478aaa6 OK 2026/10/07 01:11:44 DEBUG : dst/file1.58903690.partial: renamed to: dst/file1 2026/10/07 01:11:44 INFO : dst/file1: Copied (new) 2026/10/07 01:11:44 INFO : dst/file1: Deleted --- PASS: TestMoveFileBackupDir (12.97s) === RUN TestSameConfig --- PASS: TestSameConfig (0.00s) === RUN TestSame --- PASS: TestSame (0.00s) === RUN TestOverlappingFilterCheckWithoutFilter --- PASS: TestOverlappingFilterCheckWithoutFilter (0.00s) === RUN TestOverlappingFilterCheckWithFilter --- PASS: TestOverlappingFilterCheckWithFilter (0.00s) === RUN TestListFormat --- PASS: TestListFormat (0.00s) === RUN TestDirMoveMoveError run.go:198: Remote "pcloud root 'rclone-test-kiziruq4votu'", Local "Local file system at /tmp/rclone148111752", Modify Window "1s" operations_test.go:1490: Skipping test on non local remote --- SKIP: TestDirMoveMoveError (4.68s) === RUN TestDirMoveContext run.go:198: Remote "pcloud root 'rclone-test-kiziruq4votu'", Local "Local file system at /tmp/rclone148111752", Modify Window "1s" operations_test.go:1490: Skipping test on non local remote --- SKIP: TestDirMoveContext (0.89s) === RUN TestDirMove run.go:198: Remote "pcloud root 'rclone-test-kiziruq4votu'", Local "Local file system at /tmp/rclone148111752", Modify Window "1s" 2026/10/07 01:11:51 INFO : A1/B2: Making directory 2026/10/07 01:11:52 INFO : A1/B1/C3: Making directory fstest.go:299: Sleeping for 1s for list eventual consistency: 1/3 fstest.go:302: Flushing the directory cache fstest.go:293: Sleeping for 6s just to make sure 2026/10/07 01:12:02 INFO : A2/B1/C1/four: Moved (server-side) to: A3/B1/C1/four 2026/10/07 01:12:02 INFO : A2/B1/C2/five: Moved (server-side) to: A3/B1/C2/five 2026/10/07 01:12:02 INFO : A2/one: Moved (server-side) to: A3/one 2026/10/07 01:12:02 INFO : A2/B1/three: Moved (server-side) to: A3/B1/three 2026/10/07 01:12:02 INFO : A2/two: Moved (server-side) to: A3/two 2026/10/07 01:12:03 INFO : pcloud root 'rclone-test-kiziruq4votu': Can't DirMove - falling back to file moves: can't move directory - incompatible remotes 2026/10/07 01:12:05 INFO : A3/B1/three: Moved (server-side) to: A4/B1/three 2026/10/07 01:12:05 INFO : A3/B1/C1/four: Moved (server-side) to: A4/B1/C1/four 2026/10/07 01:12:05 INFO : A3/B1/C2/five: Moved (server-side) to: A4/B1/C2/five 2026/10/07 01:12:05 INFO : A3/one: Moved (server-side) to: A4/one 2026/10/07 01:12:05 INFO : A3/two: Moved (server-side) to: A4/two --- PASS: TestDirMove (17.35s) === RUN TestGetFsInfo run.go:198: Remote "pcloud root 'rclone-test-kiziruq4votu'", Local "Local file system at /tmp/rclone148111752", Modify Window "1s" --- PASS: TestGetFsInfo (0.19s) === RUN TestRcat === RUN TestRcat/withChecksum=false,ignoreChecksum=false run.go:198: Remote "pcloud root 'rclone-test-kiziruq4votu'", Local "Local file system at /tmp/rclone148111752", Modify Window "1s" 2026/10/07 01:12:08 DEBUG : pcloud root 'rclone-test-kiziruq4votu': File to upload is small (34 bytes), uploading instead of streaming 2026/10/07 01:12:08 DEBUG : no_checksum_small_file_from_pipe: size = 34 OK 2026/10/07 01:12:08 DEBUG : no_checksum_small_file_from_pipe: sha1 = 4c3452689ee5e2b950454c46181b8b5e7bcfeca9 OK 2026/10/07 01:12:08 DEBUG : no_checksum_small_file_from_pipe: Size and sha1 of src and dst objects identical 2026/10/07 01:12:08 DEBUG : pcloud root 'rclone-test-kiziruq4votu': Target remote doesn't support streaming uploads, creating temporary local FS to spool file 2026/10/07 01:12:08 DEBUG : no_checksum_big_file_from_pipe: size = 102401 OK 2026/10/07 01:12:08 DEBUG : no_checksum_big_file_from_pipe: sha1 = d0080f73aa8b494570ad63df1beb25c01ea9eea2 OK 2026/10/07 01:12:08 DEBUG : no_checksum_big_file_from_pipe: Size and sha1 of src and dst objects identical fstest.go:299: Sleeping for 1s for list eventual consistency: 1/3 fstest.go:302: Flushing the directory cache fstest.go:293: Sleeping for 6s just to make sure === RUN TestRcat/withChecksum=true,ignoreChecksum=false run.go:198: Remote "pcloud root 'rclone-test-kiziruq4votu'", Local "Local file system at /tmp/rclone148111752", Modify Window "1s" 2026/10/07 01:12:17 DEBUG : pcloud root 'rclone-test-kiziruq4votu': File to upload is small (34 bytes), uploading instead of streaming 2026/10/07 01:12:17 DEBUG : with_checksum_small_file_from_pipe: size = 34 OK 2026/10/07 01:12:17 DEBUG : with_checksum_small_file_from_pipe: sha1 = 4c3452689ee5e2b950454c46181b8b5e7bcfeca9 OK 2026/10/07 01:12:17 DEBUG : with_checksum_small_file_from_pipe: Size and sha1 of src and dst objects identical 2026/10/07 01:12:17 DEBUG : pcloud root 'rclone-test-kiziruq4votu': Target remote doesn't support streaming uploads, creating temporary local FS to spool file 2026/10/07 01:12:17 DEBUG : with_checksum_big_file_from_pipe: size = 102401 OK 2026/10/07 01:12:17 DEBUG : with_checksum_big_file_from_pipe: sha1 = d0080f73aa8b494570ad63df1beb25c01ea9eea2 OK 2026/10/07 01:12:17 DEBUG : with_checksum_big_file_from_pipe: Size and sha1 of src and dst objects identical fstest.go:299: Sleeping for 1s for list eventual consistency: 1/3 fstest.go:302: Flushing the directory cache fstest.go:293: Sleeping for 6s just to make sure === RUN TestRcat/withChecksum=false,ignoreChecksum=true run.go:198: Remote "pcloud root 'rclone-test-kiziruq4votu'", Local "Local file system at /tmp/rclone148111752", Modify Window "1s" 2026/10/07 01:12:25 DEBUG : pcloud root 'rclone-test-kiziruq4votu': File to upload is small (34 bytes), uploading instead of streaming 2026/10/07 01:12:25 DEBUG : ignore_checksum_small_file_from_pipe: size = 34 OK 2026/10/07 01:12:25 DEBUG : ignore_checksum_small_file_from_pipe: Size and modification time the same (differ by -499.999999ms, within tolerance 1s) 2026/10/07 01:12:25 DEBUG : pcloud root 'rclone-test-kiziruq4votu': Target remote doesn't support streaming uploads, creating temporary local FS to spool file 2026/10/07 01:12:26 DEBUG : ignore_checksum_big_file_from_pipe: size = 102401 OK 2026/10/07 01:12:26 DEBUG : ignore_checksum_big_file_from_pipe: Size and modification time the same (differ by -123.456789ms, within tolerance 1s) === RUN TestRcat/withChecksum=true,ignoreChecksum=true run.go:198: Remote "pcloud root 'rclone-test-kiziruq4votu'", Local "Local file system at /tmp/rclone148111752", Modify Window "1s" 2026/10/07 01:12:26 DEBUG : pcloud root 'rclone-test-kiziruq4votu': File to upload is small (34 bytes), uploading instead of streaming 2026/10/07 01:12:26 DEBUG : ignore_checksum_small_file_from_pipe: size = 34 OK 2026/10/07 01:12:26 DEBUG : ignore_checksum_small_file_from_pipe: Src hash empty - aborting Dst hash check 2026/10/07 01:12:26 DEBUG : ignore_checksum_small_file_from_pipe: Size of src and dst objects identical 2026/10/07 01:12:26 DEBUG : pcloud root 'rclone-test-kiziruq4votu': Target remote doesn't support streaming uploads, creating temporary local FS to spool file 2026/10/07 01:12:27 DEBUG : ignore_checksum_big_file_from_pipe: size = 102401 OK 2026/10/07 01:12:27 DEBUG : ignore_checksum_big_file_from_pipe: Src hash empty - aborting Dst hash check 2026/10/07 01:12:27 DEBUG : ignore_checksum_big_file_from_pipe: Size of src and dst objects identical fstest.go:299: Sleeping for 1s for list eventual consistency: 1/3 fstest.go:302: Flushing the directory cache fstest.go:293: Sleeping for 6s just to make sure --- PASS: TestRcat (27.18s) --- PASS: TestRcat/withChecksum=false,ignoreChecksum=false (8.97s) --- PASS: TestRcat/withChecksum=true,ignoreChecksum=false (8.54s) --- PASS: TestRcat/withChecksum=false,ignoreChecksum=true (1.06s) --- PASS: TestRcat/withChecksum=true,ignoreChecksum=true (8.60s) === RUN TestRcatMetadata run.go:198: Remote "pcloud root 'rclone-test-kiziruq4votu'", Local "Local file system at /tmp/rclone148111752", Modify Window "1s" operations_test.go:1745: Skipping as destination doesn't support user metadata --- SKIP: TestRcatMetadata (0.19s) === RUN TestRcatSize run.go:198: Remote "pcloud root 'rclone-test-kiziruq4votu'", Local "Local file system at /tmp/rclone148111752", Modify Window "1s" 2026/10/07 01:12:35 DEBUG : potato1: size = 60 OK 2026/10/07 01:12:35 DEBUG : potato1: sha1 = 9dc7f7d3279715991a22853f5981df582b7f9f6d OK 2026/10/07 01:12:35 DEBUG : pcloud root 'rclone-test-kiziruq4votu': File to upload is small (60 bytes), uploading instead of streaming 2026/10/07 01:12:35 DEBUG : potato2: size = 60 OK 2026/10/07 01:12:35 DEBUG : potato2: sha1 = 9dc7f7d3279715991a22853f5981df582b7f9f6d OK 2026/10/07 01:12:35 DEBUG : potato2: Size and sha1 of src and dst objects identical fstest.go:299: Sleeping for 1s for list eventual consistency: 1/3 fstest.go:302: Flushing the directory cache fstest.go:293: Sleeping for 6s just to make sure --- PASS: TestRcatSize (9.21s) === RUN TestRcatSizeShortEOF run.go:198: Remote "pcloud root 'rclone-test-kiziruq4votu'", Local "Local file system at /tmp/rclone148111752", Modify Window "1s" 2026/10/07 01:12:44 DEBUG : pacer: low level retry 1/1 (error Put "https://eapi.pcloud.com/uploadfile?filename=potato1&folderid=26963824515&mtime=981173106&nopartial=1": net/http: HTTP/1.x transport connection broken: http: ContentLength=120 with Body length 60) 2026/10/07 01:12:44 DEBUG : pacer: Rate limited, increasing sleep to 20ms 2026/10/07 01:12:44 DEBUG : pacer: Reducing sleep to 15ms 2026/10/07 01:12:44 DEBUG : pacer: Reducing sleep to 11.25ms 2026/10/07 01:12:44 ERROR : potato1: Post request put error: Put "https://eapi.pcloud.com/uploadfile?filename=potato1&folderid=26963824515&mtime=981173106&nopartial=1": net/http: HTTP/1.x transport connection broken: http: ContentLength=120 with Body length 60 2026/10/07 01:12:45 DEBUG : pacer: Reducing sleep to 10ms --- PASS: TestRcatSizeShortEOF (0.44s) === RUN TestRcatSizeMetadata run.go:198: Remote "pcloud root 'rclone-test-kiziruq4votu'", Local "Local file system at /tmp/rclone148111752", Modify Window "1s" operations_test.go:1838: Skipping as destination doesn't support user metadata --- SKIP: TestRcatSizeMetadata (0.19s) === RUN TestRcatSizeUploadHeaders run.go:198: Remote "pcloud root 'rclone-test-kiziruq4votu'", Local "Local file system at /tmp/rclone148111752", Modify Window "1s" 2026/10/07 01:12:45 DEBUG : potato1: size = 60 OK 2026/10/07 01:12:45 DEBUG : potato1: sha1 = 9dc7f7d3279715991a22853f5981df582b7f9f6d OK --- PASS: TestRcatSizeUploadHeaders (0.39s) === RUN TestRcatSizeChecksum === RUN TestRcatSizeChecksum/Corrupted run.go:198: Remote "pcloud root 'rclone-test-kiziruq4votu'", Local "Local file system at /tmp/rclone148111752", Modify Window "1s" 2026/10/07 01:12:45 DEBUG : potato1: size = 60 OK 2026/10/07 01:12:45 DEBUG : potato1: sha1 = 9dc7f7d3279715991a22853f5981df582b7f9f6d (pcloud root 'rclone-test-kiziruq4votu') 2026/10/07 01:12:45 DEBUG : potato1: sha1 = 3639923d60907789b4155daea94152f89e4fb69c (pcloud root 'rclone-test-kiziruq4votu') 2026/10/07 01:12:45 ERROR : potato1: corrupted on transfer: sha1 hashes differ src "9dc7f7d3279715991a22853f5981df582b7f9f6d" vs dst(pcloud root 'rclone-test-kiziruq4votu') "3639923d60907789b4155daea94152f89e4fb69c" 2026/10/07 01:12:45 INFO : potato1: Removing failed copy === RUN TestRcatSizeChecksum/SizeDiffers run.go:198: Remote "pcloud root 'rclone-test-kiziruq4votu'", Local "Local file system at /tmp/rclone148111752", Modify Window "1s" 2026/10/07 01:12:46 DEBUG : potato4: size = 60 (pcloud root 'rclone-test-kiziruq4votu') 2026/10/07 01:12:46 DEBUG : potato4: size = 59 (pcloud root 'rclone-test-kiziruq4votu') 2026/10/07 01:12:46 ERROR : potato4: corrupted on transfer: sizes differ src 60 vs dst(pcloud root 'rclone-test-kiziruq4votu') 59 2026/10/07 01:12:46 INFO : potato4: Removing failed copy === RUN TestRcatSizeChecksum/IgnoreChecksum run.go:198: Remote "pcloud root 'rclone-test-kiziruq4votu'", Local "Local file system at /tmp/rclone148111752", Modify Window "1s" 2026/10/07 01:12:46 DEBUG : potato2: size = 60 OK === RUN TestRcatSizeChecksum/NoHashes run.go:198: Remote "pcloud root 'rclone-test-kiziruq4votu'", Local "Local file system at /tmp/rclone148111752", Modify Window "1s" 2026/10/07 01:12:47 DEBUG : potato3: size = 60 OK --- PASS: TestRcatSizeChecksum (1.76s) --- PASS: TestRcatSizeChecksum/Corrupted (0.49s) --- PASS: TestRcatSizeChecksum/SizeDiffers (0.50s) --- PASS: TestRcatSizeChecksum/IgnoreChecksum (0.38s) --- PASS: TestRcatSizeChecksum/NoHashes (0.40s) === RUN TestTouchDir run.go:198: Remote "pcloud root 'rclone-test-kiziruq4votu'", Local "Local file system at /tmp/rclone148111752", Modify Window "1s" 2026/10/07 01:12:48 DEBUG : pcloud root 'rclone-test-kiziruq4votu': Touching "potato2" 2026/10/07 01:12:48 DEBUG : pcloud root 'rclone-test-kiziruq4votu': Touching "sub dir/potato3" 2026/10/07 01:12:48 DEBUG : pcloud root 'rclone-test-kiziruq4votu': Touching "empty space" --- PASS: TestTouchDir (1.91s) === RUN TestMkdirMetadata run.go:198: Remote "pcloud root 'rclone-test-kiziruq4votu'", Local "Local file system at /tmp/rclone148111752", Modify Window "1s" operations_test.go:2058: Skipping test as remote does not support MkdirMetadata --- SKIP: TestMkdirMetadata (0.19s) === RUN TestMkdirModTime run.go:198: Remote "pcloud root 'rclone-test-kiziruq4votu'", Local "Local file system at /tmp/rclone148111752", Modify Window "1s" operations_test.go:2079: Skipping test as remote does not support DirSetModTime or MkdirMetadata --- SKIP: TestMkdirModTime (0.19s) === RUN TestCopyDirMetadata run.go:198: Remote "pcloud root 'rclone-test-kiziruq4votu'", Local "Local file system at /tmp/rclone148111752", Modify Window "1s" operations_test.go:2123: Skipping test as remote does not support WriteDirMetadata or MkdirMetadata --- SKIP: TestCopyDirMetadata (0.19s) === RUN TestSetDirModTime run.go:198: Remote "pcloud root 'rclone-test-kiziruq4votu'", Local "Local file system at /tmp/rclone148111752", Modify Window "1s" operations_test.go:2161: Skipping test as remote does not support DirSetModTime or WriteDirSetModTime --- SKIP: TestSetDirModTime (0.22s) === RUN TestDirsEqual run.go:198: Remote "pcloud root 'rclone-test-kiziruq4votu'", Local "Local file system at /tmp/rclone148111752", Modify Window "1s" operations_test.go:2212: Skipping test as remote does not support WriteDirMetadata or MkdirMetadata --- SKIP: TestDirsEqual (0.19s) === RUN TestRemoveExisting run.go:198: Remote "pcloud root 'rclone-test-kiziruq4votu'", Local "Local file system at /tmp/rclone148111752", Modify Window "1s" 2026/10/07 01:12:52 DEBUG : sub dir/test remove existing: TEST: renaming existing object to "sub dir/test remove existing.fiwelem2" before starting 2026/10/07 01:12:52 DEBUG : sub dir/test remove existing.fiwelem2: TEST: removing renamed existing file after operation 2026/10/07 01:12:53 DEBUG : sub dir/test remove existing with long name 123456789012345678901234567890123456789012345678901234567890123456789: TEST: renaming existing object to "sub dir/test remove existing with long name 123456789012345678901234567890123456789012345678901234567890.xuwenuk6" before starting operations_test.go:2324: Error Trace: /home/rclone/go/src/github.com/rclone/rclone/fs/operations/operations_test.go:2324 Error: " 21 sub dir/test remove existing with long name 123456789012345678901234567890123456789012345678901234567890123456789\n" should not contain " 21 sub dir/test remove existing with long name 123456789012345678901234567890123456789012345678901234567890123456789\n" Test: TestRemoveExisting 2026/10/07 01:12:53 DEBUG : sub dir/test remove existing with long name 123456789012345678901234567890123456789012345678901234567890.xuwenuk6: TEST: renaming existing back after failed operation fstest.go:299: Sleeping for 1s for list eventual consistency: 1/3 fstest.go:302: Flushing the directory cache fstest.go:293: Sleeping for 6s just to make sure 2026/10/07 01:13:02 DEBUG : sub dir/test remove existing with long name 123456789012345678901234567890123456789012345678901234567890123456789: TEST: renaming existing object to "sub dir/test remove existing with long name 123456789012345678901234567890123456789012345678901234567890.mikuxuk7" before starting operations_test.go:2341: Error Trace: /home/rclone/go/src/github.com/rclone/rclone/fs/operations/operations_test.go:2341 Error: " 21 sub dir/test remove existing with long name 123456789012345678901234567890123456789012345678901234567890123456789\n" should not contain " 21 sub dir/test remove existing with long name 123456789012345678901234567890123456789012345678901234567890123456789\n" Test: TestRemoveExisting 2026/10/07 01:13:02 DEBUG : sub dir/test remove existing with long name 123456789012345678901234567890123456789012345678901234567890.mikuxuk7: TEST: removing renamed existing file after operation --- FAIL: TestRemoveExisting (13.06s) === RUN TestRcatInputFailurePreservesDestination 2026/10/07 01:13:03 DEBUG : Creating backend with remote "/tmp/TestRcatInputFailurePreservesDestination1665112560/001" --- PASS: TestRcatInputFailurePreservesDestination (0.00s) === RUN TestRcAbout rc_test.go:31: Skipping test on non local remote --- SKIP: TestRcAbout (0.00s) === RUN TestRcCleanup rc_test.go:31: Skipping test on non local remote --- SKIP: TestRcCleanup (0.00s) === RUN TestRcCopyfile rc_test.go:31: Skipping test on non local remote --- SKIP: TestRcCopyfile (0.00s) === RUN TestRcCopyurl rc_test.go:31: Skipping test on non local remote --- SKIP: TestRcCopyurl (0.00s) === RUN TestRcDelete rc_test.go:31: Skipping test on non local remote --- SKIP: TestRcDelete (0.00s) === RUN TestRcDeletefile rc_test.go:31: Skipping test on non local remote --- SKIP: TestRcDeletefile (0.00s) === RUN TestRcList rc_test.go:31: Skipping test on non local remote --- SKIP: TestRcList (0.00s) === RUN TestRcStat rc_test.go:31: Skipping test on non local remote --- SKIP: TestRcStat (0.00s) === RUN TestRcSetTier rc_test.go:31: Skipping test on non local remote --- SKIP: TestRcSetTier (0.00s) === RUN TestRcSetTierFile rc_test.go:31: Skipping test on non local remote --- SKIP: TestRcSetTierFile (0.00s) === RUN TestRcMkdir rc_test.go:31: Skipping test on non local remote --- SKIP: TestRcMkdir (0.00s) === RUN TestRcMovefile rc_test.go:31: Skipping test on non local remote --- SKIP: TestRcMovefile (0.00s) === RUN TestRcPurge rc_test.go:31: Skipping test on non local remote --- SKIP: TestRcPurge (0.00s) === RUN TestRcRmdir rc_test.go:31: Skipping test on non local remote --- SKIP: TestRcRmdir (0.00s) === RUN TestRcRmdirs rc_test.go:31: Skipping test on non local remote --- SKIP: TestRcRmdirs (0.00s) === RUN TestRcSize rc_test.go:31: Skipping test on non local remote --- SKIP: TestRcSize (0.00s) === RUN TestRcPublicLink rc_test.go:31: Skipping test on non local remote --- SKIP: TestRcPublicLink (0.00s) === RUN TestRcFsInfo rc_test.go:31: Skipping test on non local remote --- SKIP: TestRcFsInfo (0.00s) === RUN TestUploadFile rc_test.go:31: Skipping test on non local remote --- SKIP: TestUploadFile (0.00s) === RUN TestRcCommand rc_test.go:31: Skipping test on non local remote --- SKIP: TestRcCommand (0.00s) === RUN TestRcDu rc_test.go:31: Skipping test on non local remote --- SKIP: TestRcDu (0.00s) === RUN TestRcCheck rc_test.go:31: Skipping test on non local remote --- SKIP: TestRcCheck (0.00s) === RUN TestRcHashsum rc_test.go:31: Skipping test on non local remote --- SKIP: TestRcHashsum (0.00s) === RUN TestRcHashsumSingleFile rc_test.go:31: Skipping test on non local remote --- SKIP: TestRcHashsumSingleFile (0.00s) === RUN TestRcHashsumFile rc_test.go:31: Skipping test on non local remote --- SKIP: TestRcHashsumFile (0.00s) === RUN TestRcGetFile rc_test.go:31: Skipping test on non local remote --- SKIP: TestRcGetFile (0.00s) FAIL 2026/10/07 01:13:03 DEBUG : pcloud root 'rclone-test-kiziruq4votu': Purge remote "./operations.test -test.v -test.timeout 1h0m0s -remote TestPcloud: -verbose" - Finished ERROR in 8m7.758356468s (try 1/5): exit status 1: Failed [TestApplyTransforms TestIndexRules TestIndexMaxDepth TestIndexLinkIndex TestIndexChanged TestIndexChangedFiles TestDeleteFatalError TestMaxDelete TestRemoveExisting]