"./operations.test -test.v -test.timeout 2h0m0s -remote TestInternxt: -list-retries 5 -verbose" - Starting (try 1/5) 2026/10/04 03:25:55 DEBUG : Creating backend with remote "TestInternxt:rclone-test-xivasil4fali" 2026/10/04 03:25:55 DEBUG : Using config file from "/home/rclone/.rclone.conf" 2026/10/04 03:25:55 DEBUG : User info: rootFolderId=2661cf64-e104-478b-b737-48c3ac8984d2, bucket=697358bf16ceabcf39af85f2 2026/10/04 03:25:55 DEBUG : Saving config "token" in section "TestInternxt" of the config file 2026/10/04 03:25:55 DEBUG : TestInternxt: Saved new token in config file 2026/10/04 03:25:55 DEBUG : Internxt root 'rclone-test-xivasil4fali': Persisted rotated token from user info, expiry: 2026-10-11 03:25:55 +0000 UTC 2026/10/04 03:25:55 DEBUG : Creating backend with remote "/tmp/rclone1821118965" === RUN TestDoMultiThreadCopy --- PASS: TestDoMultiThreadCopy (0.00s) === RUN TestMultithreadCalculateNumChunks === RUN TestMultithreadCalculateNumChunks/{size:1_chunkSize:65536_wantNumChunks:1} === RUN TestMultithreadCalculateNumChunks/{size:1048576_chunkSize:1_wantNumChunks:1048576} === RUN TestMultithreadCalculateNumChunks/{size:1048576_chunkSize:2_wantNumChunks:524288} === RUN TestMultithreadCalculateNumChunks/{size:1048577_chunkSize:2_wantNumChunks:524289} === RUN TestMultithreadCalculateNumChunks/{size:1048575_chunkSize:2_wantNumChunks:524288} --- PASS: TestMultithreadCalculateNumChunks (0.00s) --- PASS: TestMultithreadCalculateNumChunks/{size:1_chunkSize:65536_wantNumChunks:1} (0.00s) --- PASS: TestMultithreadCalculateNumChunks/{size:1048576_chunkSize:1_wantNumChunks:1048576} (0.00s) --- PASS: TestMultithreadCalculateNumChunks/{size:1048576_chunkSize:2_wantNumChunks:524288} (0.00s) --- PASS: TestMultithreadCalculateNumChunks/{size:1048577_chunkSize:2_wantNumChunks:524289} (0.00s) --- PASS: TestMultithreadCalculateNumChunks/{size:1048575_chunkSize:2_wantNumChunks:524288} (0.00s) === RUN TestMultithreadCopy run.go:198: Remote "Internxt root 'rclone-test-xivasil4fali'", Local "Local file system at /tmp/rclone1821118965", Modify Window "876000h0m0s" FileLimitsResponse { "maxUploadFileSize": 107374182400, "versioning": { "enabled": true, "maxFileSize": 20971520, "retentionDays": 30, "maxVersions": 20 } } 2026/10/04 03:25:56 NOTICE: Internxt root 'rclone-test-xivasil4fali': Multipart upload aborted for chunksize-probe === RUN TestMultithreadCopy/upload=false,size=62914559,streams=2 2026/10/04 03:26:01 DEBUG : test-multithread-copy-false-62914559-2: multi-thread copy: disabling buffering because destination uses OpenWriterAt 2026/10/04 03:26:01 DEBUG : test-multithread-copy-false-62914559-2: multi-thread copy: write buffer set to 131072 2026/10/04 03:26:01 DEBUG : test-multithread-copy-false-62914559-2: multi-thread copy: chunk size 64Mi was bigger than source file size 60.000Mi 2026/10/04 03:26:01 DEBUG : test-multithread-copy-false-62914559-2: multi-thread copy: using backend concurrency of 4 instead of --multi-thread-streams 2 2026/10/04 03:26:01 DEBUG : test-multithread-copy-false-62914559-2: multi-thread copy: number of streams 4 was bigger than number of chunks 1 2026/10/04 03:26:01 DEBUG : test-multithread-copy-false-62914559-2: Starting multi-thread copy with 1 chunks of size 60.000Mi with 1 parallel streams 2026/10/04 03:26:01 DEBUG : test-multithread-copy-false-62914559-2: multi-thread copy: chunk 1/1 (0-62914559) size 60.000Mi starting 2026/10/04 03:26:02 DEBUG : test-multithread-copy-false-62914559-2: writing chunk 0 2026/10/04 03:26:03 DEBUG : test-multithread-copy-false-62914559-2: multi-thread copy: chunk 1/1 (0-62914559) size 60.000Mi finished 2026/10/04 03:26:03 DEBUG : test-multithread-copy-false-62914559-2: Finished multi-thread copy with 1 parts of size 60.000Mi === RUN TestMultithreadCopy/upload=false,size=62914560,streams=2 2026/10/04 03:26:13 DEBUG : test-multithread-copy-false-62914560-2: multi-thread copy: disabling buffering because destination uses OpenWriterAt 2026/10/04 03:26:13 DEBUG : test-multithread-copy-false-62914560-2: multi-thread copy: write buffer set to 131072 2026/10/04 03:26:13 DEBUG : test-multithread-copy-false-62914560-2: multi-thread copy: chunk size 64Mi was bigger than source file size 60Mi 2026/10/04 03:26:13 DEBUG : test-multithread-copy-false-62914560-2: multi-thread copy: using backend concurrency of 4 instead of --multi-thread-streams 2 2026/10/04 03:26:13 DEBUG : test-multithread-copy-false-62914560-2: multi-thread copy: number of streams 4 was bigger than number of chunks 1 2026/10/04 03:26:13 DEBUG : test-multithread-copy-false-62914560-2: Starting multi-thread copy with 1 chunks of size 60Mi with 1 parallel streams 2026/10/04 03:26:13 DEBUG : test-multithread-copy-false-62914560-2: multi-thread copy: chunk 1/1 (0-62914560) size 60Mi starting 2026/10/04 03:26:14 DEBUG : test-multithread-copy-false-62914560-2: writing chunk 0 2026/10/04 03:26:15 DEBUG : test-multithread-copy-false-62914560-2: multi-thread copy: chunk 1/1 (0-62914560) size 60Mi finished 2026/10/04 03:26:15 DEBUG : test-multithread-copy-false-62914560-2: Finished multi-thread copy with 1 parts of size 60Mi === RUN TestMultithreadCopy/upload=false,size=62914561,streams=2 2026/10/04 03:26:24 DEBUG : test-multithread-copy-false-62914561-2: multi-thread copy: disabling buffering because destination uses OpenWriterAt 2026/10/04 03:26:24 DEBUG : test-multithread-copy-false-62914561-2: multi-thread copy: write buffer set to 131072 2026/10/04 03:26:24 DEBUG : test-multithread-copy-false-62914561-2: multi-thread copy: chunk size 64Mi was bigger than source file size 60.000Mi 2026/10/04 03:26:24 DEBUG : test-multithread-copy-false-62914561-2: multi-thread copy: using backend concurrency of 4 instead of --multi-thread-streams 2 2026/10/04 03:26:24 DEBUG : test-multithread-copy-false-62914561-2: multi-thread copy: number of streams 4 was bigger than number of chunks 1 2026/10/04 03:26:24 DEBUG : test-multithread-copy-false-62914561-2: Starting multi-thread copy with 1 chunks of size 60.000Mi with 1 parallel streams 2026/10/04 03:26:24 DEBUG : test-multithread-copy-false-62914561-2: multi-thread copy: chunk 1/1 (0-62914561) size 60.000Mi starting 2026/10/04 03:26:24 DEBUG : test-multithread-copy-false-62914561-2: writing chunk 0 2026/10/04 03:26:27 DEBUG : test-multithread-copy-false-62914561-2: multi-thread copy: chunk 1/1 (0-62914561) size 60.000Mi finished 2026/10/04 03:26:27 DEBUG : test-multithread-copy-false-62914561-2: Finished multi-thread copy with 1 parts of size 60.000Mi === RUN TestMultithreadCopy/upload=true,size=62914559,streams=2 2026/10/04 03:26:37 DEBUG : test-multithread-copy-true-62914559-2: multi-thread copy: disabling buffering because source is local disk multithread_test.go:227: file too small for multipart upload: multi-thread copy: failed to open chunk writer: file too small for multipart upload (minimum 104857600 bytes) === RUN TestMultithreadCopy/upload=true,size=62914560,streams=2 2026/10/04 03:26:43 DEBUG : test-multithread-copy-true-62914560-2: multi-thread copy: disabling buffering because source is local disk multithread_test.go:227: file too small for multipart upload: multi-thread copy: failed to open chunk writer: file too small for multipart upload (minimum 104857600 bytes) === RUN TestMultithreadCopy/upload=true,size=62914561,streams=2 2026/10/04 03:26:48 DEBUG : test-multithread-copy-true-62914561-2: multi-thread copy: disabling buffering because source is local disk multithread_test.go:227: file too small for multipart upload: multi-thread copy: failed to open chunk writer: file too small for multipart upload (minimum 104857600 bytes) --- PASS: TestMultithreadCopy (53.13s) --- PASS: TestMultithreadCopy/upload=false,size=62914559,streams=2 (10.25s) --- PASS: TestMultithreadCopy/upload=false,size=62914560,streams=2 (11.44s) --- PASS: TestMultithreadCopy/upload=false,size=62914561,streams=2 (13.79s) --- SKIP: TestMultithreadCopy/upload=true,size=62914559,streams=2 (5.62s) --- SKIP: TestMultithreadCopy/upload=true,size=62914560,streams=2 (5.62s) --- SKIP: TestMultithreadCopy/upload=true,size=62914561,streams=2 (5.40s) === RUN TestMultithreadCopyAbort run.go:198: Remote "Internxt root 'rclone-test-xivasil4fali'", Local "Local file system at /tmp/rclone1821118965", Modify Window "876000h0m0s" 2026/10/04 03:26:49 NOTICE: Internxt root 'rclone-test-xivasil4fali': Multipart upload aborted for chunksize-probe 2026/10/04 03:26:55 DEBUG : test-multithread-abort: multi-thread copy: disabling buffering because source is local disk multithread_test.go:332: file too small for multipart upload: multi-thread copy: failed to open chunk writer: file too small for multipart upload (minimum 104857600 bytes) --- SKIP: TestMultithreadCopyAbort (6.84s) === RUN TestMultithreadCopyWriterAtErrors === RUN TestMultithreadCopyWriterAtErrors/open/fatal=false 2026/10/04 03:26:55 DEBUG : file.txt: multi-thread copy: disabling buffering because destination uses OpenWriterAt === RUN TestMultithreadCopyWriterAtErrors/open/fatal=true 2026/10/04 03:26:55 DEBUG : file.txt: multi-thread copy: disabling buffering because destination uses OpenWriterAt === RUN TestMultithreadCopyWriterAtErrors/write/fatal=false 2026/10/04 03:26:55 DEBUG : file.txt: multi-thread copy: disabling buffering because destination uses OpenWriterAt 2026/10/04 03:26:55 DEBUG : file.txt: Starting multi-thread copy with 4 chunks of size 4 with 2 parallel streams 2026/10/04 03:26:55 DEBUG : file.txt: multi-thread copy: chunk 2/4 (4-8) size 4 starting 2026/10/04 03:26:55 DEBUG : file.txt: writing chunk 1 2026/10/04 03:26:55 DEBUG : file.txt: multi-thread copy: chunk 2/4 failed: multi-thread copy: failed to write chunk: disk full 2026/10/04 03:26:55 DEBUG : file.txt: multi-thread copy: chunk 3/4 (8-12) size 4 starting 2026/10/04 03:26:55 DEBUG : file.txt: writing chunk 2 2026/10/04 03:26:55 DEBUG : file.txt: multi-thread copy: chunk 3/4 failed: multi-thread copy: failed to write chunk: disk full 2026/10/04 03:26:55 DEBUG : file.txt: multi-thread copy: chunk 1/4 (0-4) size 4 starting 2026/10/04 03:26:55 DEBUG : file.txt: writing chunk 0 2026/10/04 03:26:55 DEBUG : file.txt: multi-thread copy: chunk 1/4 failed: multi-thread copy: failed to write chunk: disk full 2026/10/04 03:26:55 DEBUG : file.txt: multi-thread copy: cancelling transfer on exit 2026/10/04 03:26:55 DEBUG : file.txt: multi-thread copy: abort failed: multi-thread copy: failed to find temp file when aborting chunk writer: object not found === RUN TestMultithreadCopyWriterAtErrors/write/fatal=true 2026/10/04 03:26:55 DEBUG : file.txt: multi-thread copy: disabling buffering because destination uses OpenWriterAt 2026/10/04 03:26:55 DEBUG : file.txt: Starting multi-thread copy with 4 chunks of size 4 with 2 parallel streams 2026/10/04 03:26:55 DEBUG : file.txt: multi-thread copy: chunk 2/4 (4-8) size 4 starting 2026/10/04 03:26:55 DEBUG : file.txt: writing chunk 1 2026/10/04 03:26:55 DEBUG : file.txt: multi-thread copy: chunk 2/4 failed: multi-thread copy: failed to write chunk: disk full 2026/10/04 03:26:55 DEBUG : file.txt: multi-thread copy: chunk 3/4 (8-12) size 4 starting 2026/10/04 03:26:55 DEBUG : file.txt: writing chunk 2 2026/10/04 03:26:55 DEBUG : file.txt: multi-thread copy: chunk 3/4 failed: multi-thread copy: failed to write chunk: disk full 2026/10/04 03:26:55 DEBUG : file.txt: multi-thread copy: chunk 1/4 (0-4) size 4 starting 2026/10/04 03:26:55 DEBUG : file.txt: writing chunk 0 2026/10/04 03:26:55 DEBUG : file.txt: multi-thread copy: chunk 1/4 failed: multi-thread copy: failed to write chunk: disk full 2026/10/04 03:26:55 DEBUG : file.txt: multi-thread copy: cancelling transfer on exit 2026/10/04 03:26:55 DEBUG : file.txt: multi-thread copy: abort failed: multi-thread copy: failed to find temp file when aborting chunk writer: object not found === RUN TestMultithreadCopyWriterAtErrors/close/fatal=false 2026/10/04 03:26:55 DEBUG : file.txt: multi-thread copy: disabling buffering because destination uses OpenWriterAt 2026/10/04 03:26:55 DEBUG : file.txt: Starting multi-thread copy with 4 chunks of size 4 with 2 parallel streams 2026/10/04 03:26:55 DEBUG : file.txt: multi-thread copy: chunk 2/4 (4-8) size 4 starting 2026/10/04 03:26:55 DEBUG : file.txt: writing chunk 1 2026/10/04 03:26:55 DEBUG : file.txt: multi-thread copy: chunk 2/4 (4-8) size 4 finished 2026/10/04 03:26:55 DEBUG : file.txt: multi-thread copy: chunk 3/4 (8-12) size 4 starting 2026/10/04 03:26:55 DEBUG : file.txt: writing chunk 2 2026/10/04 03:26:55 DEBUG : file.txt: multi-thread copy: chunk 3/4 (8-12) size 4 finished 2026/10/04 03:26:55 DEBUG : file.txt: multi-thread copy: chunk 4/4 (12-16) size 4 starting 2026/10/04 03:26:55 DEBUG : file.txt: writing chunk 3 2026/10/04 03:26:55 DEBUG : file.txt: multi-thread copy: chunk 4/4 (12-16) size 4 finished 2026/10/04 03:26:55 DEBUG : file.txt: multi-thread copy: chunk 1/4 (0-4) size 4 starting 2026/10/04 03:26:55 DEBUG : file.txt: writing chunk 0 2026/10/04 03:26:55 DEBUG : file.txt: multi-thread copy: chunk 1/4 (0-4) size 4 finished 2026/10/04 03:26:55 DEBUG : file.txt: multi-thread copy: cancelling transfer on exit 2026/10/04 03:26:55 DEBUG : file.txt: multi-thread copy: abort failed: multi-thread copy: failed to find temp file when aborting chunk writer: object not found === RUN TestMultithreadCopyWriterAtErrors/close/fatal=true 2026/10/04 03:26:55 DEBUG : file.txt: multi-thread copy: disabling buffering because destination uses OpenWriterAt 2026/10/04 03:26:55 DEBUG : file.txt: Starting multi-thread copy with 4 chunks of size 4 with 2 parallel streams 2026/10/04 03:26:55 DEBUG : file.txt: multi-thread copy: chunk 2/4 (4-8) size 4 starting 2026/10/04 03:26:55 DEBUG : file.txt: writing chunk 1 2026/10/04 03:26:55 DEBUG : file.txt: multi-thread copy: chunk 2/4 (4-8) size 4 finished 2026/10/04 03:26:55 DEBUG : file.txt: multi-thread copy: chunk 3/4 (8-12) size 4 starting 2026/10/04 03:26:55 DEBUG : file.txt: writing chunk 2 2026/10/04 03:26:55 DEBUG : file.txt: multi-thread copy: chunk 3/4 (8-12) size 4 finished 2026/10/04 03:26:55 DEBUG : file.txt: multi-thread copy: chunk 4/4 (12-16) size 4 starting 2026/10/04 03:26:55 DEBUG : file.txt: writing chunk 3 2026/10/04 03:26:55 DEBUG : file.txt: multi-thread copy: chunk 4/4 (12-16) size 4 finished 2026/10/04 03:26:55 DEBUG : file.txt: multi-thread copy: chunk 1/4 (0-4) size 4 starting 2026/10/04 03:26:55 DEBUG : file.txt: writing chunk 0 2026/10/04 03:26:55 DEBUG : file.txt: multi-thread copy: chunk 1/4 (0-4) size 4 finished 2026/10/04 03:26:55 DEBUG : file.txt: multi-thread copy: cancelling transfer on exit 2026/10/04 03:26:55 DEBUG : file.txt: multi-thread copy: abort failed: multi-thread copy: failed to find temp file when aborting chunk writer: object not found --- PASS: TestMultithreadCopyWriterAtErrors (0.00s) --- PASS: TestMultithreadCopyWriterAtErrors/open/fatal=false (0.00s) --- PASS: TestMultithreadCopyWriterAtErrors/open/fatal=true (0.00s) --- PASS: TestMultithreadCopyWriterAtErrors/write/fatal=false (0.00s) --- PASS: TestMultithreadCopyWriterAtErrors/write/fatal=true (0.00s) --- PASS: TestMultithreadCopyWriterAtErrors/close/fatal=false (0.00s) --- PASS: TestMultithreadCopyWriterAtErrors/close/fatal=true (0.00s) === RUN TestSizeDiffers 2026/10/04 03:26:55 DEBUG : a: size = 0 OK 2026/10/04 03:26:55 DEBUG : a: size = 1 (memory) 2026/10/04 03:26:55 DEBUG : a: size = 2 (memory) --- PASS: TestSizeDiffers (0.00s) === RUN TestDirTransferEntry --- PASS: TestDirTransferEntry (0.00s) === RUN TestReOpen === RUN TestReOpen/Normal === RUN TestReOpen/Normal/Basics 2026/10/04 03:26:55 DEBUG : potato: Seek from 10 to 0 === RUN TestReOpen/Normal/ErrorAtStart === RUN TestReOpen/Normal/WithErrors 2026/10/04 03:26:55 DEBUG : potato: Reopening on read failure after offset 2 bytes: retry 1/10: test error 2026/10/04 03:26:55 DEBUG : potato: Reopening on read failure after offset 3 bytes: retry 2/10: test error 2026/10/04 03:26:55 DEBUG : potato: Reopening on read failure after offset 6 bytes: retry 3/10: test error === RUN TestReOpen/Normal/TooManyErrors 2026/10/04 03:26:55 DEBUG : potato: Reopening on read failure after offset 2 bytes: retry 1/3: test error 2026/10/04 03:26:55 DEBUG : potato: Reopening on read failure after offset 3 bytes: retry 2/3: test error 2026/10/04 03:26:55 DEBUG : potato: Reopening on read failure after offset 6 bytes: retry 3/3: test error 2026/10/04 03:26:55 DEBUG : potato: Reopen failed after offset 6 bytes read: failed to reopen: too many retries === RUN TestReOpen/Normal/ReadAt 2026/10/04 03:26:55 DEBUG : potato: Reopening on read failure after offset 2 bytes: retry 0/10: test error 2026/10/04 03:26:55 DEBUG : potato: Reopening on read failure after offset 3 bytes: retry 1/10: test error 2026/10/04 03:26:55 DEBUG : potato: Seek from 5 to 1 === RUN TestReOpen/Normal/Seek 2026/10/04 03:26:55 DEBUG : potato: Reopening on read failure after offset 2 bytes: retry 0/10: test error 2026/10/04 03:26:55 DEBUG : potato: Reopening on read failure after offset 3 bytes: retry 1/10: test error 2026/10/04 03:26:55 DEBUG : potato: Seek from 5 to 2 === RUN TestReOpen/Normal/AccountRead === RUN TestReOpen/Normal/AccountReadDelay 2026/10/04 03:26:55 DEBUG : potato: Seek from 10 to 0 2026/10/04 03:26:55 DEBUG : potato: Seek from 10 to 0 2026/10/04 03:26:55 DEBUG : potato: Seek from 10 to 0 === RUN TestReOpen/Normal/AccountReadError === RUN TestReOpen/WithRangeOption === RUN TestReOpen/WithRangeOption/Basics 2026/10/04 03:26:55 DEBUG : potato: Seek from 7 to 0 === RUN TestReOpen/WithRangeOption/ErrorAtStart === RUN TestReOpen/WithRangeOption/WithErrors 2026/10/04 03:26:55 DEBUG : potato: Reopening on read failure after offset 2 bytes: retry 1/10: test error 2026/10/04 03:26:55 DEBUG : potato: Reopening on read failure after offset 3 bytes: retry 2/10: test error 2026/10/04 03:26:55 DEBUG : potato: Reopening on read failure after offset 6 bytes: retry 3/10: test error === RUN TestReOpen/WithRangeOption/TooManyErrors 2026/10/04 03:26:55 DEBUG : potato: Reopening on read failure after offset 2 bytes: retry 1/3: test error 2026/10/04 03:26:55 DEBUG : potato: Reopening on read failure after offset 3 bytes: retry 2/3: test error 2026/10/04 03:26:55 DEBUG : potato: Reopening on read failure after offset 6 bytes: retry 3/3: test error 2026/10/04 03:26:55 DEBUG : potato: Reopen failed after offset 6 bytes read: failed to reopen: too many retries === RUN TestReOpen/WithRangeOption/ReadAt 2026/10/04 03:26:55 DEBUG : potato: Reopening on read failure after offset 2 bytes: retry 0/10: test error 2026/10/04 03:26:55 DEBUG : potato: Reopening on read failure after offset 3 bytes: retry 1/10: test error 2026/10/04 03:26:55 DEBUG : potato: Seek from 5 to 1 === RUN TestReOpen/WithRangeOption/Seek 2026/10/04 03:26:55 DEBUG : potato: Reopening on read failure after offset 2 bytes: retry 0/10: test error 2026/10/04 03:26:55 DEBUG : potato: Reopening on read failure after offset 3 bytes: retry 1/10: test error 2026/10/04 03:26:55 DEBUG : potato: Seek from 5 to 2 2026/10/04 03:26:55 DEBUG : potato: Seek from 7 to 4 === RUN TestReOpen/WithRangeOption/AccountRead === RUN TestReOpen/WithRangeOption/AccountReadDelay 2026/10/04 03:26:55 DEBUG : potato: Seek from 7 to 0 2026/10/04 03:26:55 DEBUG : potato: Seek from 7 to 0 2026/10/04 03:26:55 DEBUG : potato: Seek from 7 to 0 === RUN TestReOpen/WithRangeOption/AccountReadError === RUN TestReOpen/WithSeekOption === RUN TestReOpen/WithSeekOption/Basics 2026/10/04 03:26:55 DEBUG : potato: Seek from 8 to 0 === RUN TestReOpen/WithSeekOption/ErrorAtStart === RUN TestReOpen/WithSeekOption/WithErrors 2026/10/04 03:26:55 DEBUG : potato: Reopening on read failure after offset 2 bytes: retry 1/10: test error 2026/10/04 03:26:55 DEBUG : potato: Reopening on read failure after offset 3 bytes: retry 2/10: test error 2026/10/04 03:26:55 DEBUG : potato: Reopening on read failure after offset 6 bytes: retry 3/10: test error === RUN TestReOpen/WithSeekOption/TooManyErrors 2026/10/04 03:26:55 DEBUG : potato: Reopening on read failure after offset 2 bytes: retry 1/3: test error 2026/10/04 03:26:55 DEBUG : potato: Reopening on read failure after offset 3 bytes: retry 2/3: test error 2026/10/04 03:26:55 DEBUG : potato: Reopening on read failure after offset 6 bytes: retry 3/3: test error 2026/10/04 03:26:55 DEBUG : potato: Reopen failed after offset 6 bytes read: failed to reopen: too many retries === RUN TestReOpen/WithSeekOption/ReadAt 2026/10/04 03:26:55 DEBUG : potato: Reopening on read failure after offset 2 bytes: retry 0/10: test error 2026/10/04 03:26:55 DEBUG : potato: Reopening on read failure after offset 3 bytes: retry 1/10: test error 2026/10/04 03:26:55 DEBUG : potato: Seek from 5 to 1 === RUN TestReOpen/WithSeekOption/Seek 2026/10/04 03:26:55 DEBUG : potato: Reopening on read failure after offset 2 bytes: retry 0/10: test error 2026/10/04 03:26:55 DEBUG : potato: Reopening on read failure after offset 3 bytes: retry 1/10: test error 2026/10/04 03:26:55 DEBUG : potato: Seek from 5 to 2 2026/10/04 03:26:55 DEBUG : potato: Seek from 7 to 5 === RUN TestReOpen/WithSeekOption/AccountRead === RUN TestReOpen/WithSeekOption/AccountReadDelay 2026/10/04 03:26:55 DEBUG : potato: Seek from 8 to 0 2026/10/04 03:26:55 DEBUG : potato: Seek from 8 to 0 2026/10/04 03:26:55 DEBUG : potato: Seek from 8 to 0 === RUN TestReOpen/WithSeekOption/AccountReadError === RUN TestReOpen/UnknownSize === RUN TestReOpen/UnknownSize/Basics 2026/10/04 03:26:55 DEBUG : potato: Seek from 9 to 0 === RUN TestReOpen/UnknownSize/ErrorAtStart === RUN TestReOpen/UnknownSize/WithErrors 2026/10/04 03:26:55 DEBUG : potato: Reopening on read failure after offset 2 bytes: retry 1/10: test error 2026/10/04 03:26:55 DEBUG : potato: Reopening on read failure after offset 3 bytes: retry 2/10: test error 2026/10/04 03:26:55 DEBUG : potato: Reopening on read failure after offset 6 bytes: retry 3/10: test error === RUN TestReOpen/UnknownSize/TooManyErrors 2026/10/04 03:26:55 DEBUG : potato: Reopening on read failure after offset 2 bytes: retry 1/3: test error 2026/10/04 03:26:55 DEBUG : potato: Reopening on read failure after offset 3 bytes: retry 2/3: test error 2026/10/04 03:26:55 DEBUG : potato: Reopening on read failure after offset 6 bytes: retry 3/3: test error 2026/10/04 03:26:55 DEBUG : potato: Reopen failed after offset 6 bytes read: failed to reopen: too many retries === RUN TestReOpen/UnknownSize/ReadAt 2026/10/04 03:26:55 DEBUG : potato: Reopening on read failure after offset 2 bytes: retry 0/10: test error 2026/10/04 03:26:55 DEBUG : potato: Reopening on read failure after offset 3 bytes: retry 1/10: test error 2026/10/04 03:26:55 DEBUG : potato: Seek from 5 to 1 === RUN TestReOpen/UnknownSize/Seek 2026/10/04 03:26:55 DEBUG : potato: Reopening on read failure after offset 2 bytes: retry 0/10: test error 2026/10/04 03:26:55 DEBUG : potato: Reopening on read failure after offset 3 bytes: retry 1/10: test error 2026/10/04 03:26:55 DEBUG : potato: Seek from 5 to 2 2026/10/04 03:26:55 DEBUG : potato: Seek from 7 to 6 === RUN TestReOpen/UnknownSize/AccountRead === RUN TestReOpen/UnknownSize/AccountReadDelay 2026/10/04 03:26:55 DEBUG : potato: Seek from 9 to 0 2026/10/04 03:26:55 DEBUG : potato: Seek from 9 to 0 2026/10/04 03:26:55 DEBUG : potato: Seek from 9 to 0 === RUN TestReOpen/UnknownSize/AccountReadError --- PASS: TestReOpen (0.00s) --- PASS: TestReOpen/Normal (0.00s) --- PASS: TestReOpen/Normal/Basics (0.00s) --- PASS: TestReOpen/Normal/ErrorAtStart (0.00s) --- PASS: TestReOpen/Normal/WithErrors (0.00s) --- PASS: TestReOpen/Normal/TooManyErrors (0.00s) --- PASS: TestReOpen/Normal/ReadAt (0.00s) --- PASS: TestReOpen/Normal/Seek (0.00s) --- PASS: TestReOpen/Normal/AccountRead (0.00s) --- PASS: TestReOpen/Normal/AccountReadDelay (0.00s) --- PASS: TestReOpen/Normal/AccountReadError (0.00s) --- PASS: TestReOpen/WithRangeOption (0.00s) --- PASS: TestReOpen/WithRangeOption/Basics (0.00s) --- PASS: TestReOpen/WithRangeOption/ErrorAtStart (0.00s) --- PASS: TestReOpen/WithRangeOption/WithErrors (0.00s) --- PASS: TestReOpen/WithRangeOption/TooManyErrors (0.00s) --- PASS: TestReOpen/WithRangeOption/ReadAt (0.00s) --- PASS: TestReOpen/WithRangeOption/Seek (0.00s) --- PASS: TestReOpen/WithRangeOption/AccountRead (0.00s) --- PASS: TestReOpen/WithRangeOption/AccountReadDelay (0.00s) --- PASS: TestReOpen/WithRangeOption/AccountReadError (0.00s) --- PASS: TestReOpen/WithSeekOption (0.00s) --- PASS: TestReOpen/WithSeekOption/Basics (0.00s) --- PASS: TestReOpen/WithSeekOption/ErrorAtStart (0.00s) --- PASS: TestReOpen/WithSeekOption/WithErrors (0.00s) --- PASS: TestReOpen/WithSeekOption/TooManyErrors (0.00s) --- PASS: TestReOpen/WithSeekOption/ReadAt (0.00s) --- PASS: TestReOpen/WithSeekOption/Seek (0.00s) --- PASS: TestReOpen/WithSeekOption/AccountRead (0.00s) --- PASS: TestReOpen/WithSeekOption/AccountReadDelay (0.00s) --- PASS: TestReOpen/WithSeekOption/AccountReadError (0.00s) --- PASS: TestReOpen/UnknownSize (0.00s) --- PASS: TestReOpen/UnknownSize/Basics (0.00s) --- PASS: TestReOpen/UnknownSize/ErrorAtStart (0.00s) --- PASS: TestReOpen/UnknownSize/WithErrors (0.00s) --- PASS: TestReOpen/UnknownSize/TooManyErrors (0.00s) --- PASS: TestReOpen/UnknownSize/ReadAt (0.00s) --- PASS: TestReOpen/UnknownSize/Seek (0.00s) --- PASS: TestReOpen/UnknownSize/AccountRead (0.00s) --- PASS: TestReOpen/UnknownSize/AccountReadDelay (0.00s) --- PASS: TestReOpen/UnknownSize/AccountReadError (0.00s) === RUN TestCheck run.go:198: Remote "Internxt root 'rclone-test-xivasil4fali'", Local "Local file system at /tmp/rclone1821118965", Modify Window "876000h0m0s" === RUN TestCheck/1 === RUN TestCheck/2 === RUN TestCheck/3 === RUN TestCheck/4 === RUN TestCheck/5 === RUN TestCheck/6 === RUN TestCheck/7 --- PASS: TestCheck (8.96s) --- PASS: TestCheck/1 (0.25s) --- PASS: TestCheck/2 (0.23s) --- PASS: TestCheck/3 (0.39s) --- PASS: TestCheck/4 (0.22s) --- PASS: TestCheck/5 (0.21s) --- PASS: TestCheck/6 (0.24s) --- PASS: TestCheck/7 (1.92s) === RUN TestCheckFsError 2026/10/04 03:27:04 DEBUG : Creating backend with remote "nonexistent" 2026/10/04 03:27:04 DEBUG : Creating backend with remote "nonexistent" 2026/10/04 03:27:04 DEBUG : Local file system at nonexistent: Waiting for checks to finish 2026/10/04 03:27:04 ERROR : Local file system at nonexistent: error reading source root directory: directory not found 2026/10/04 03:27:04 NOTICE: Local file system at nonexistent: 0 differences found 2026/10/04 03:27:04 NOTICE: Local file system at nonexistent: 2 errors while checking --- PASS: TestCheckFsError (0.00s) === RUN TestCheckDownload run.go:198: Remote "Internxt root 'rclone-test-xivasil4fali'", Local "Local file system at /tmp/rclone1821118965", Modify Window "876000h0m0s" === RUN TestCheckDownload/1 === RUN TestCheckDownload/2 === RUN TestCheckDownload/3 === RUN TestCheckDownload/4 === RUN TestCheckDownload/5 === RUN TestCheckDownload/6 === RUN TestCheckDownload/7 --- PASS: TestCheckDownload (9.93s) --- PASS: TestCheckDownload/1 (0.64s) --- PASS: TestCheckDownload/2 (0.55s) --- PASS: TestCheckDownload/3 (0.51s) --- PASS: TestCheckDownload/4 (0.64s) --- PASS: TestCheckDownload/5 (0.66s) --- PASS: TestCheckDownload/6 (1.39s) --- PASS: TestCheckDownload/7 (0.55s) === RUN TestCheckSizeOnly run.go:198: Remote "Internxt root 'rclone-test-xivasil4fali'", Local "Local file system at /tmp/rclone1821118965", Modify Window "876000h0m0s" === RUN TestCheckSizeOnly/1 === RUN TestCheckSizeOnly/2 === RUN TestCheckSizeOnly/3 === RUN TestCheckSizeOnly/4 === RUN TestCheckSizeOnly/5 === RUN TestCheckSizeOnly/6 === RUN TestCheckSizeOnly/7 --- PASS: TestCheckSizeOnly (6.81s) --- PASS: TestCheckSizeOnly/1 (0.25s) --- PASS: TestCheckSizeOnly/2 (0.41s) --- PASS: TestCheckSizeOnly/3 (0.22s) --- PASS: TestCheckSizeOnly/4 (0.23s) --- PASS: TestCheckSizeOnly/5 (0.27s) --- PASS: TestCheckSizeOnly/6 (0.32s) --- PASS: TestCheckSizeOnly/7 (0.22s) === RUN TestCheckEqualReaders --- PASS: TestCheckEqualReaders (0.00s) === RUN TestParseSumFile run.go:198: Remote "Internxt root 'rclone-test-xivasil4fali'", Local "Local file system at /tmp/rclone1821118965", Modify Window "876000h0m0s" 2026/10/04 03:27:22 NOTICE: test.sum: improperly formatted checksum line 4 2026/10/04 03:27:22 NOTICE: test.sum: improperly formatted checksum line 5 2026/10/04 03:27:22 NOTICE: test.sum: improperly formatted checksum line 6 2026/10/04 03:27:22 NOTICE: test.sum: 2 warning(s) suppressed... 2026/10/04 03:27:23 DEBUG : Internxt root 'rclone-test-xivasil4fali': Renamed existing file test.sum to backup test.rclone-backup-qomeriq0.sum (UUID: 01a104f3-b1b4-70c4-9e70-fea40ffba764) 2026/10/04 03:27:23 DEBUG : Internxt root 'rclone-test-xivasil4fali': Upload succeeded, deleting backup file test.rclone-backup-qomeriq0.sum (UUID: 01a104f3-b1b4-70c4-9e70-fea40ffba764) 2026/10/04 03:27:23 DEBUG : Internxt root 'rclone-test-xivasil4fali': Successfully deleted backup file 2026/10/04 03:27:24 NOTICE: test.sum: improperly formatted checksum line 4 2026/10/04 03:27:24 NOTICE: test.sum: improperly formatted checksum line 5 2026/10/04 03:27:24 NOTICE: test.sum: improperly formatted checksum line 6 2026/10/04 03:27:24 NOTICE: test.sum: 2 warning(s) suppressed... --- PASS: TestParseSumFile (3.58s) === RUN TestCheckSum run.go:198: Remote "Internxt root 'rclone-test-xivasil4fali'", Local "Local file system at /tmp/rclone1821118965", Modify Window "876000h0m0s" 2026/10/04 03:27:25 DEBUG : Creating backend with remote "TestInternxt:rclone-test-xivasil4fali/data" 2026/10/04 03:27:25 DEBUG : User info: rootFolderId=2661cf64-e104-478b-b737-48c3ac8984d2, bucket=697358bf16ceabcf39af85f2 2026/10/04 03:27:25 DEBUG : Saving config "token" in section "TestInternxt" of the config file 2026/10/04 03:27:25 DEBUG : TestInternxt: Saved new token in config file 2026/10/04 03:27:25 DEBUG : Internxt root 'rclone-test-xivasil4fali/data': Persisted rotated token from user info, expiry: 2026-10-11 03:27:25 +0000 UTC check_test.go:354: Internxt root 'rclone-test-xivasil4fali/data' lacks md5, skipping --- SKIP: TestCheckSum (2.80s) === RUN TestCheckSumDownload run.go:198: Remote "Internxt root 'rclone-test-xivasil4fali'", Local "Local file system at /tmp/rclone1821118965", Modify Window "876000h0m0s" 2026/10/04 03:27:27 DEBUG : Creating backend with remote "TestInternxt:rclone-test-xivasil4fali/data" 2026/10/04 03:27:28 DEBUG : User info: rootFolderId=2661cf64-e104-478b-b737-48c3ac8984d2, bucket=697358bf16ceabcf39af85f2 2026/10/04 03:27:28 DEBUG : Saving config "token" in section "TestInternxt" of the config file 2026/10/04 03:27:28 DEBUG : TestInternxt: Saved new token in config file 2026/10/04 03:27:28 DEBUG : Internxt root 'rclone-test-xivasil4fali/data': Persisted rotated token from user info, expiry: 2026-10-11 03:27:28 +0000 UTC === RUN TestCheckSumDownload/subtest1 2026/10/04 03:27:35 DEBUG : Internxt root 'rclone-test-xivasil4fali': Renamed existing file test.sum to backup test.rclone-backup-pidoxek1.sum (UUID: 01a104f3-d1b7-70bc-869b-6822ec76c77d) 2026/10/04 03:27:35 DEBUG : Internxt root 'rclone-test-xivasil4fali': Upload succeeded, deleting backup file test.rclone-backup-pidoxek1.sum (UUID: 01a104f3-d1b7-70bc-869b-6822ec76c77d) 2026/10/04 03:27:36 DEBUG : Internxt root 'rclone-test-xivasil4fali': Successfully deleted backup file === RUN TestCheckSumDownload/subtest2 2026/10/04 03:27:38 DEBUG : Internxt root 'rclone-test-xivasil4fali': Renamed existing file test.sum to backup test.rclone-backup-xoxosos7.sum (UUID: 01a104f3-e79d-75bf-89a9-c17493a74bde) 2026/10/04 03:27:39 DEBUG : Internxt root 'rclone-test-xivasil4fali': Upload succeeded, deleting backup file test.rclone-backup-xoxosos7.sum (UUID: 01a104f3-e79d-75bf-89a9-c17493a74bde) 2026/10/04 03:27:39 DEBUG : Internxt root 'rclone-test-xivasil4fali': Successfully deleted backup file === RUN TestCheckSumDownload/subtest3 2026/10/04 03:27:41 DEBUG : Internxt root 'rclone-test-xivasil4fali': Renamed existing file test.sum to backup test.rclone-backup-cateyaw7.sum (UUID: 01a104f3-f476-751b-8c6e-587a6f6b5950) 2026/10/04 03:27:42 DEBUG : Internxt root 'rclone-test-xivasil4fali': Upload succeeded, deleting backup file test.rclone-backup-cateyaw7.sum (UUID: 01a104f3-f476-751b-8c6e-587a6f6b5950) 2026/10/04 03:27:42 DEBUG : Internxt root 'rclone-test-xivasil4fali': Successfully deleted backup file === RUN TestCheckSumDownload/subtest4 2026/10/04 03:27:44 DEBUG : Internxt root 'rclone-test-xivasil4fali': Renamed existing file test.sum to backup test.rclone-backup-cupihon4.sum (UUID: 01a104f3-ffef-72ef-b2df-4be7a011db6e) === NAME TestCheckSumDownload run.go:299: Retry Put of "test.sum" to Internxt root 'rclone-test-xivasil4fali': 1/10 (failed to create file metadata: create meta: File already exists (status 409)) 2026/10/04 03:27:48 DEBUG : Internxt root 'rclone-test-xivasil4fali': Renamed existing file test.sum to backup test.rclone-backup-guvifil9.sum (UUID: 01a104f3-ffef-72ef-b2df-4be7a011db6e) 2026/10/04 03:27:49 DEBUG : Internxt root 'rclone-test-xivasil4fali': Upload succeeded, deleting backup file test.rclone-backup-guvifil9.sum (UUID: 01a104f3-ffef-72ef-b2df-4be7a011db6e) 2026/10/04 03:27:49 DEBUG : Internxt root 'rclone-test-xivasil4fali': Successfully deleted backup file === RUN TestCheckSumDownload/subtest5 2026/10/04 03:27:51 DEBUG : Internxt root 'rclone-test-xivasil4fali': Renamed existing file test.sum to backup test.rclone-backup-jobazok8.sum (UUID: 01a104f4-1b34-7299-a448-151bcb3eead1) 2026/10/04 03:27:51 DEBUG : Internxt root 'rclone-test-xivasil4fali': Upload succeeded, deleting backup file test.rclone-backup-jobazok8.sum (UUID: 01a104f4-1b34-7299-a448-151bcb3eead1) 2026/10/04 03:27:52 DEBUG : Internxt root 'rclone-test-xivasil4fali': Successfully deleted backup file === NAME TestCheckSumDownload fstest.go:299: Sleeping for 1s for list eventual consistency: 1/5 fstest.go:302: Flushing the directory cache fstest.go:299: Sleeping for 2s for list eventual consistency: 2/5 fstest.go:302: Flushing the directory cache fstest.go:293: Sleeping for 7s just to make sure === RUN TestCheckSumDownload/subtest6 2026/10/04 03:28:05 DEBUG : Internxt root 'rclone-test-xivasil4fali': Renamed existing file data/banana to backup banana.rclone-backup-vukebug3. (UUID: 01a104f3-cef7-76aa-a0f5-0aeb469dc474) 2026/10/04 03:28:06 DEBUG : Internxt root 'rclone-test-xivasil4fali': Upload succeeded, deleting backup file banana.rclone-backup-vukebug3. (UUID: 01a104f3-cef7-76aa-a0f5-0aeb469dc474) 2026/10/04 03:28:06 DEBUG : Internxt root 'rclone-test-xivasil4fali': Successfully deleted backup file 2026/10/04 03:28:06 DEBUG : Internxt root 'rclone-test-xivasil4fali': Renamed existing file data/potato to backup potato.rclone-backup-boqivet1. (UUID: 01a104f3-dc3f-75f3-a45b-4dc346ca7e3d) 2026/10/04 03:28:07 DEBUG : Internxt root 'rclone-test-xivasil4fali': Upload succeeded, deleting backup file potato.rclone-backup-boqivet1. (UUID: 01a104f3-dc3f-75f3-a45b-4dc346ca7e3d) 2026/10/04 03:28:07 DEBUG : Internxt root 'rclone-test-xivasil4fali': Successfully deleted backup file 2026/10/04 03:28:07 DEBUG : Internxt root 'rclone-test-xivasil4fali': Renamed existing file test.sum to backup test.rclone-backup-zenihox5.sum (UUID: 01a104f4-2676-736a-8f40-c0547a6d1504) 2026/10/04 03:28:08 DEBUG : Internxt root 'rclone-test-xivasil4fali': Upload succeeded, deleting backup file test.rclone-backup-zenihox5.sum (UUID: 01a104f4-2676-736a-8f40-c0547a6d1504) 2026/10/04 03:28:08 DEBUG : Internxt root 'rclone-test-xivasil4fali': Successfully deleted backup file === RUN TestCheckSumDownload/subtest7 --- PASS: TestCheckSumDownload (46.00s) --- PASS: TestCheckSumDownload/subtest1 (1.58s) --- PASS: TestCheckSumDownload/subtest2 (1.65s) --- PASS: TestCheckSumDownload/subtest3 (1.23s) --- PASS: TestCheckSumDownload/subtest4 (1.85s) --- PASS: TestCheckSumDownload/subtest5 (1.18s) --- PASS: TestCheckSumDownload/subtest6 (1.20s) --- PASS: TestCheckSumDownload/subtest7 (2.75s) === RUN TestCheckSumConcurrency 2026/10/04 03:28:13 DEBUG : file0: md5 = 022eb0c0085c731f335df970fafa7446 OK 2026/10/04 03:28:13 DEBUG : file2: md5 = a58f09ae3db8ae4b943fdbaace096072 OK 2026/10/04 03:28:13 DEBUG : file1: md5 = 17fbabbccbdea0e6be9eb64c8c6fea41 OK 2026/10/04 03:28:13 DEBUG : file3: md5 = e0639b17e0744aca9a3ba29c049e59ee OK 2026/10/04 03:28:13 NOTICE: Mock file system at checkSum: 0 differences found 2026/10/04 03:28:13 NOTICE: Mock file system at checkSum: 4 matching files --- PASS: TestCheckSumConcurrency (0.00s) === RUN TestCheckSumDownloadConcurrency 2026/10/04 03:28:13 DEBUG : file0: md5 = 022eb0c0085c731f335df970fafa7446 OK 2026/10/04 03:28:13 DEBUG : file2: md5 = a58f09ae3db8ae4b943fdbaace096072 OK 2026/10/04 03:28:13 DEBUG : file1: md5 = 17fbabbccbdea0e6be9eb64c8c6fea41 OK 2026/10/04 03:28:13 DEBUG : file3: md5 = e0639b17e0744aca9a3ba29c049e59ee OK 2026/10/04 03:28:13 NOTICE: Mock file system at checkSum: 0 differences found 2026/10/04 03:28:13 NOTICE: Mock file system at checkSum: 4 matching files --- PASS: TestCheckSumDownloadConcurrency (0.00s) === RUN TestApplyTransforms 2026/10/04 03:28:13 DEBUG : Creating backend with remote "TestInternxt:rclone-test-nayaroc3ceya" 2026/10/04 03:28:13 DEBUG : Using config file from "/home/rclone/.rclone.conf" 2026/10/04 03:28:14 DEBUG : User info: rootFolderId=2661cf64-e104-478b-b737-48c3ac8984d2, bucket=697358bf16ceabcf39af85f2 2026/10/04 03:28:14 DEBUG : Saving config "token" in section "TestInternxt" of the config file 2026/10/04 03:28:14 DEBUG : TestInternxt: Saved new token in config file 2026/10/04 03:28:14 DEBUG : Internxt root 'rclone-test-nayaroc3ceya': Persisted rotated token from user info, expiry: 2026-10-11 03:28:14 +0000 UTC 2026/10/04 03:28:14 DEBUG : Creating backend with remote "/tmp/rclone3179678111" run.go:198: Remote "Internxt root 'rclone-test-nayaroc3ceya'", Local "Local file system at /tmp/rclone3179678111", Modify Window "876000h0m0s" FileLimitsResponse { "maxUploadFileSize": 107374182400, "versioning": { "enabled": true, "maxFileSize": 20971520, "retentionDays": 30, "maxVersions": 20 } } upper checkfile vs. lower remote (without normalization) 2026/10/04 03:28:16 ERROR : hello, world!: sum not found 2026/10/04 03:28:16 ERROR : HELLO, WORLD!: file not in Internxt root 'rclone-test-nayaroc3ceya' 2026/10/04 03:28:16 NOTICE: Internxt root 'rclone-test-nayaroc3ceya': 1 files missing 2026/10/04 03:28:16 NOTICE: 1 hashes missing 2026/10/04 03:28:16 NOTICE: Internxt root 'rclone-test-nayaroc3ceya': 1 differences found 2026/10/04 03:28:16 NOTICE: Internxt root 'rclone-test-nayaroc3ceya': 2 errors while checking upper checkfile vs. lower remote (with normalization) 2026/10/04 03:28:17 DEBUG : hello, world!: md5 = 65a8e27d8879283831b664bd8b7f0ad4 OK 2026/10/04 03:28:17 NOTICE: Internxt root 'rclone-test-nayaroc3ceya': 0 differences found 2026/10/04 03:28:17 NOTICE: Internxt root 'rclone-test-nayaroc3ceya': 1 matching files 2026/10/04 03:28:17 DEBUG : Creating backend with remote "TestInternxt:rclone-test-suzapum5yoce" 2026/10/04 03:28:17 DEBUG : Using config file from "/home/rclone/.rclone.conf" 2026/10/04 03:28:17 DEBUG : User info: rootFolderId=2661cf64-e104-478b-b737-48c3ac8984d2, bucket=697358bf16ceabcf39af85f2 2026/10/04 03:28:17 DEBUG : Saving config "token" in section "TestInternxt" of the config file 2026/10/04 03:28:17 DEBUG : TestInternxt: Saved new token in config file 2026/10/04 03:28:17 DEBUG : Internxt root 'rclone-test-suzapum5yoce': Persisted rotated token from user info, expiry: 2026-10-11 03:28:17 +0000 UTC 2026/10/04 03:28:17 DEBUG : Creating backend with remote "/tmp/rclone276853287" run.go:198: Remote "Internxt root 'rclone-test-suzapum5yoce'", Local "Local file system at /tmp/rclone276853287", Modify Window "876000h0m0s" FileLimitsResponse { "maxUploadFileSize": 107374182400, "versioning": { "enabled": true, "maxFileSize": 20971520, "retentionDays": 30, "maxVersions": 20 } } lower checkfile vs. upper remote (without normalization) 2026/10/04 03:28:19 ERROR : HELLO, WORLD!: sum not found 2026/10/04 03:28:19 ERROR : hello, world!: file not in Internxt root 'rclone-test-suzapum5yoce' 2026/10/04 03:28:19 NOTICE: Internxt root 'rclone-test-suzapum5yoce': 1 files missing 2026/10/04 03:28:19 NOTICE: 1 hashes missing 2026/10/04 03:28:19 NOTICE: Internxt root 'rclone-test-suzapum5yoce': 1 differences found 2026/10/04 03:28:19 NOTICE: Internxt root 'rclone-test-suzapum5yoce': 2 errors while checking lower checkfile vs. upper remote (with normalization) 2026/10/04 03:28:20 DEBUG : HELLO, WORLD!: md5 = 65a8e27d8879283831b664bd8b7f0ad4 OK 2026/10/04 03:28:20 NOTICE: Internxt root 'rclone-test-suzapum5yoce': 0 differences found 2026/10/04 03:28:20 NOTICE: Internxt root 'rclone-test-suzapum5yoce': 1 matching files 2026/10/04 03:28:20 DEBUG : Creating backend with remote "TestInternxt:rclone-test-zacejus7vunu" 2026/10/04 03:28:20 DEBUG : Using config file from "/home/rclone/.rclone.conf" 2026/10/04 03:28:20 DEBUG : User info: rootFolderId=2661cf64-e104-478b-b737-48c3ac8984d2, bucket=697358bf16ceabcf39af85f2 2026/10/04 03:28:20 DEBUG : Saving config "token" in section "TestInternxt" of the config file 2026/10/04 03:28:20 DEBUG : TestInternxt: Saved new token in config file 2026/10/04 03:28:20 DEBUG : Internxt root 'rclone-test-zacejus7vunu': Persisted rotated token from user info, expiry: 2026-10-11 03:28:20 +0000 UTC 2026/10/04 03:28:21 DEBUG : Creating backend with remote "/tmp/rclone63761321" run.go:198: Remote "Internxt root 'rclone-test-zacejus7vunu'", Local "Local file system at /tmp/rclone63761321", Modify Window "876000h0m0s" 2026/10/04 03:28:22 DEBUG : pacer: low level retry 1/10 (error check files existence: Not Found (status 404)) 2026/10/04 03:28:22 DEBUG : pacer: Rate limited, increasing sleep to 20ms 2026/10/04 03:28:22 DEBUG : pacer: low level retry 2/10 (error check files existence: Not Found (status 404)) 2026/10/04 03:28:22 DEBUG : pacer: Rate limited, increasing sleep to 40ms 2026/10/04 03:28:22 DEBUG : pacer: low level retry 3/10 (error check files existence: Not Found (status 404)) 2026/10/04 03:28:22 DEBUG : pacer: Rate limited, increasing sleep to 80ms 2026/10/04 03:28:22 DEBUG : pacer: low level retry 4/10 (error check files existence: Not Found (status 404)) 2026/10/04 03:28:22 DEBUG : pacer: Rate limited, increasing sleep to 160ms 2026/10/04 03:28:22 DEBUG : pacer: low level retry 5/10 (error check files existence: Not Found (status 404)) 2026/10/04 03:28:22 DEBUG : pacer: Rate limited, increasing sleep to 320ms 2026/10/04 03:28:22 DEBUG : pacer: low level retry 6/10 (error check files existence: Not Found (status 404)) 2026/10/04 03:28:22 DEBUG : pacer: Rate limited, increasing sleep to 640ms 2026/10/04 03:28:22 DEBUG : pacer: low level retry 7/10 (error check files existence: Not Found (status 404)) 2026/10/04 03:28:22 DEBUG : pacer: Rate limited, increasing sleep to 1.28s 2026/10/04 03:28:23 DEBUG : pacer: Reducing sleep to 960ms FileLimitsResponse { "maxUploadFileSize": 107374182400, "versioning": { "enabled": true, "maxFileSize": 20971520, "retentionDays": 30, "maxVersions": 20 } } 2026/10/04 03:28:25 DEBUG : pacer: Reducing sleep to 720ms 2026/10/04 03:28:25 DEBUG : pacer: Reducing sleep to 540ms 2026/10/04 03:28:26 DEBUG : pacer: Reducing sleep to 405ms lower checkfile vs. upperlowermixed remote (without normalization) 2026/10/04 03:28:27 DEBUG : pacer: Reducing sleep to 303.75ms 2026/10/04 03:28:27 DEBUG : pacer: Reducing sleep to 227.8125ms 2026/10/04 03:28:27 ERROR : HeLlO, wOrLd!: sum not found 2026/10/04 03:28:27 ERROR : hello, world!: file not in Internxt root 'rclone-test-zacejus7vunu' 2026/10/04 03:28:27 NOTICE: Internxt root 'rclone-test-zacejus7vunu': 1 files missing 2026/10/04 03:28:27 NOTICE: 1 hashes missing 2026/10/04 03:28:27 NOTICE: Internxt root 'rclone-test-zacejus7vunu': 1 differences found 2026/10/04 03:28:27 NOTICE: Internxt root 'rclone-test-zacejus7vunu': 2 errors while checking lower checkfile vs. upperlowermixed remote (with normalization) 2026/10/04 03:28:27 DEBUG : pacer: Reducing sleep to 170.859375ms 2026/10/04 03:28:28 DEBUG : pacer: Reducing sleep to 128.144531ms 2026/10/04 03:28:28 DEBUG : pacer: Reducing sleep to 96.108398ms 2026/10/04 03:28:28 DEBUG : HeLlO, wOrLd!: md5 = 65a8e27d8879283831b664bd8b7f0ad4 OK 2026/10/04 03:28:28 NOTICE: Internxt root 'rclone-test-zacejus7vunu': 0 differences found 2026/10/04 03:28:28 NOTICE: Internxt root 'rclone-test-zacejus7vunu': 1 matching files 2026/10/04 03:28:28 DEBUG : Creating backend with remote "TestInternxt:rclone-test-vulepij8huso" 2026/10/04 03:28:28 DEBUG : Using config file from "/home/rclone/.rclone.conf" 2026/10/04 03:28:30 DEBUG : User info: rootFolderId=2661cf64-e104-478b-b737-48c3ac8984d2, bucket=697358bf16ceabcf39af85f2 2026/10/04 03:28:30 DEBUG : Saving config "token" in section "TestInternxt" of the config file 2026/10/04 03:28:30 DEBUG : TestInternxt: Saved new token in config file 2026/10/04 03:28:30 DEBUG : Internxt root 'rclone-test-vulepij8huso': Persisted rotated token from user info, expiry: 2026-10-11 03:28:30 +0000 UTC 2026/10/04 03:28:30 DEBUG : Creating backend with remote "/tmp/rclone1115291411" run.go:198: Remote "Internxt root 'rclone-test-vulepij8huso'", Local "Local file system at /tmp/rclone1115291411", Modify Window "876000h0m0s" FileLimitsResponse { "maxUploadFileSize": 107374182400, "versioning": { "enabled": true, "maxFileSize": 20971520, "retentionDays": 30, "maxVersions": 20 } } upperlowermixed checkfile vs. upper remote (without normalization) 2026/10/04 03:28:32 ERROR : HELLO, WORLD!: sum not found 2026/10/04 03:28:32 ERROR : HeLlO, wOrLd!: file not in Internxt root 'rclone-test-vulepij8huso' 2026/10/04 03:28:32 NOTICE: Internxt root 'rclone-test-vulepij8huso': 1 files missing 2026/10/04 03:28:32 NOTICE: 1 hashes missing 2026/10/04 03:28:32 NOTICE: Internxt root 'rclone-test-vulepij8huso': 1 differences found 2026/10/04 03:28:32 NOTICE: Internxt root 'rclone-test-vulepij8huso': 2 errors while checking upperlowermixed checkfile vs. upper remote (with normalization) 2026/10/04 03:28:33 DEBUG : HELLO, WORLD!: md5 = 65a8e27d8879283831b664bd8b7f0ad4 OK 2026/10/04 03:28:33 NOTICE: Internxt root 'rclone-test-vulepij8huso': 0 differences found 2026/10/04 03:28:33 NOTICE: Internxt root 'rclone-test-vulepij8huso': 1 matching files 2026/10/04 03:28:33 DEBUG : Creating backend with remote "TestInternxt:rclone-test-savuzac9fuvi" 2026/10/04 03:28:33 DEBUG : Using config file from "/home/rclone/.rclone.conf" 2026/10/04 03:28:33 DEBUG : User info: rootFolderId=2661cf64-e104-478b-b737-48c3ac8984d2, bucket=697358bf16ceabcf39af85f2 2026/10/04 03:28:33 DEBUG : Saving config "token" in section "TestInternxt" of the config file 2026/10/04 03:28:33 DEBUG : TestInternxt: Saved new token in config file 2026/10/04 03:28:33 DEBUG : Internxt root 'rclone-test-savuzac9fuvi': Persisted rotated token from user info, expiry: 2026-10-11 03:28:33 +0000 UTC 2026/10/04 03:28:34 DEBUG : Creating backend with remote "/tmp/rclone1454739099" run.go:198: Remote "Internxt root 'rclone-test-savuzac9fuvi'", Local "Local file system at /tmp/rclone1454739099", Modify Window "876000h0m0s" FileLimitsResponse { "maxUploadFileSize": 107374182400, "versioning": { "enabled": true, "maxFileSize": 20971520, "retentionDays": 30, "maxVersions": 20 } } NFD checkfile vs. NFC remote (without normalization) 2026/10/04 03:28:36 ERROR : 測試_Русский___ě_áñ: sum not found 2026/10/04 03:28:36 ERROR : 測試_Русский___ě_áñ: file not in Internxt root 'rclone-test-savuzac9fuvi' 2026/10/04 03:28:36 NOTICE: Internxt root 'rclone-test-savuzac9fuvi': 1 files missing 2026/10/04 03:28:36 NOTICE: 1 hashes missing 2026/10/04 03:28:36 NOTICE: Internxt root 'rclone-test-savuzac9fuvi': 1 differences found 2026/10/04 03:28:36 NOTICE: Internxt root 'rclone-test-savuzac9fuvi': 2 errors while checking NFD checkfile vs. NFC remote (with normalization) 2026/10/04 03:28:37 DEBUG : 測試_Русский___ě_áñ: md5 = 65a8e27d8879283831b664bd8b7f0ad4 OK 2026/10/04 03:28:37 NOTICE: Internxt root 'rclone-test-savuzac9fuvi': 0 differences found 2026/10/04 03:28:37 NOTICE: Internxt root 'rclone-test-savuzac9fuvi': 1 matching files 2026/10/04 03:28:37 DEBUG : Creating backend with remote "TestInternxt:rclone-test-yocecek9neye" 2026/10/04 03:28:37 DEBUG : Using config file from "/home/rclone/.rclone.conf" 2026/10/04 03:28:37 DEBUG : User info: rootFolderId=2661cf64-e104-478b-b737-48c3ac8984d2, bucket=697358bf16ceabcf39af85f2 2026/10/04 03:28:37 DEBUG : Saving config "token" in section "TestInternxt" of the config file 2026/10/04 03:28:37 DEBUG : TestInternxt: Saved new token in config file 2026/10/04 03:28:37 DEBUG : Internxt root 'rclone-test-yocecek9neye': Persisted rotated token from user info, expiry: 2026-10-11 03:28:37 +0000 UTC 2026/10/04 03:28:37 DEBUG : Creating backend with remote "/tmp/rclone63789621" run.go:198: Remote "Internxt root 'rclone-test-yocecek9neye'", Local "Local file system at /tmp/rclone63789621", Modify Window "876000h0m0s" FileLimitsResponse { "maxUploadFileSize": 107374182400, "versioning": { "enabled": true, "maxFileSize": 20971520, "retentionDays": 30, "maxVersions": 20 } } NFC checkfile vs. NFD remote (without normalization) 2026/10/04 03:28:39 ERROR : 測試_Русский___ě_áñ: sum not found 2026/10/04 03:28:39 ERROR : 測試_Русский___ě_áñ: file not in Internxt root 'rclone-test-yocecek9neye' 2026/10/04 03:28:39 NOTICE: Internxt root 'rclone-test-yocecek9neye': 1 files missing 2026/10/04 03:28:39 NOTICE: 1 hashes missing 2026/10/04 03:28:39 NOTICE: Internxt root 'rclone-test-yocecek9neye': 1 differences found 2026/10/04 03:28:39 NOTICE: Internxt root 'rclone-test-yocecek9neye': 2 errors while checking NFC checkfile vs. NFD remote (with normalization) 2026/10/04 03:28:40 DEBUG : 測試_Русский___ě_áñ: md5 = 65a8e27d8879283831b664bd8b7f0ad4 OK 2026/10/04 03:28:40 NOTICE: Internxt root 'rclone-test-yocecek9neye': 0 differences found 2026/10/04 03:28:40 NOTICE: Internxt root 'rclone-test-yocecek9neye': 1 matching files 2026/10/04 03:28:40 DEBUG : Creating backend with remote "TestInternxt:rclone-test-kojisom0quzi" 2026/10/04 03:28:40 DEBUG : Using config file from "/home/rclone/.rclone.conf" 2026/10/04 03:28:40 DEBUG : User info: rootFolderId=2661cf64-e104-478b-b737-48c3ac8984d2, bucket=697358bf16ceabcf39af85f2 2026/10/04 03:28:40 DEBUG : Saving config "token" in section "TestInternxt" of the config file 2026/10/04 03:28:40 DEBUG : TestInternxt: Saved new token in config file 2026/10/04 03:28:40 DEBUG : Internxt root 'rclone-test-kojisom0quzi': Persisted rotated token from user info, expiry: 2026-10-11 03:28:40 +0000 UTC 2026/10/04 03:28:41 DEBUG : Creating backend with remote "/tmp/rclone1127346287" run.go:198: Remote "Internxt root 'rclone-test-kojisom0quzi'", Local "Local file system at /tmp/rclone1127346287", Modify Window "876000h0m0s" FileLimitsResponse { "maxUploadFileSize": 107374182400, "versioning": { "enabled": true, "maxFileSize": 20971520, "retentionDays": 30, "maxVersions": 20 } } NFDx2 checkfile vs. both remote (without normalization) 2026/10/04 03:28:43 ERROR : 測試_Русский___ě_áñ測試_Русский___ě_áñ: sum not found 2026/10/04 03:28:43 ERROR : 測試_Русский___ě_áñ測試_Русский___ě_áñ: file not in Internxt root 'rclone-test-kojisom0quzi' 2026/10/04 03:28:43 NOTICE: Internxt root 'rclone-test-kojisom0quzi': 1 files missing 2026/10/04 03:28:43 NOTICE: 1 hashes missing 2026/10/04 03:28:43 NOTICE: Internxt root 'rclone-test-kojisom0quzi': 1 differences found 2026/10/04 03:28:43 NOTICE: Internxt root 'rclone-test-kojisom0quzi': 2 errors while checking NFDx2 checkfile vs. both remote (with normalization) 2026/10/04 03:28:44 DEBUG : 測試_Русский___ě_áñ測試_Русский___ě_áñ: md5 = 65a8e27d8879283831b664bd8b7f0ad4 OK 2026/10/04 03:28:44 NOTICE: Internxt root 'rclone-test-kojisom0quzi': 0 differences found 2026/10/04 03:28:44 NOTICE: Internxt root 'rclone-test-kojisom0quzi': 1 matching files 2026/10/04 03:28:44 DEBUG : Creating backend with remote "TestInternxt:rclone-test-tolovon9wibu" 2026/10/04 03:28:44 DEBUG : Using config file from "/home/rclone/.rclone.conf" 2026/10/04 03:28:44 DEBUG : User info: rootFolderId=2661cf64-e104-478b-b737-48c3ac8984d2, bucket=697358bf16ceabcf39af85f2 2026/10/04 03:28:44 DEBUG : Saving config "token" in section "TestInternxt" of the config file 2026/10/04 03:28:44 DEBUG : TestInternxt: Saved new token in config file 2026/10/04 03:28:44 DEBUG : Internxt root 'rclone-test-tolovon9wibu': Persisted rotated token from user info, expiry: 2026-10-11 03:28:44 +0000 UTC 2026/10/04 03:28:44 DEBUG : Creating backend with remote "/tmp/rclone3530543071" run.go:198: Remote "Internxt root 'rclone-test-tolovon9wibu'", Local "Local file system at /tmp/rclone3530543071", Modify Window "876000h0m0s" FileLimitsResponse { "maxUploadFileSize": 107374182400, "versioning": { "enabled": true, "maxFileSize": 20971520, "retentionDays": 30, "maxVersions": 20 } } NFCx2 checkfile vs. both remote (without normalization) 2026/10/04 03:28:47 ERROR : 測試_Русский___ě_áñ測試_Русский___ě_áñ: sum not found 2026/10/04 03:28:47 ERROR : 測試_Русский___ě_áñ測試_Русский___ě_áñ: file not in Internxt root 'rclone-test-tolovon9wibu' 2026/10/04 03:28:47 NOTICE: Internxt root 'rclone-test-tolovon9wibu': 1 files missing 2026/10/04 03:28:47 NOTICE: 1 hashes missing 2026/10/04 03:28:47 NOTICE: Internxt root 'rclone-test-tolovon9wibu': 1 differences found 2026/10/04 03:28:47 NOTICE: Internxt root 'rclone-test-tolovon9wibu': 2 errors while checking NFCx2 checkfile vs. both remote (with normalization) 2026/10/04 03:28:48 DEBUG : 測試_Русский___ě_áñ測試_Русский___ě_áñ: md5 = 65a8e27d8879283831b664bd8b7f0ad4 OK 2026/10/04 03:28:48 NOTICE: Internxt root 'rclone-test-tolovon9wibu': 0 differences found 2026/10/04 03:28:48 NOTICE: Internxt root 'rclone-test-tolovon9wibu': 1 matching files 2026/10/04 03:28:48 DEBUG : Creating backend with remote "TestInternxt:rclone-test-podipef5boba" 2026/10/04 03:28:48 DEBUG : Using config file from "/home/rclone/.rclone.conf" 2026/10/04 03:28:48 DEBUG : User info: rootFolderId=2661cf64-e104-478b-b737-48c3ac8984d2, bucket=697358bf16ceabcf39af85f2 2026/10/04 03:28:48 DEBUG : Saving config "token" in section "TestInternxt" of the config file 2026/10/04 03:28:48 DEBUG : TestInternxt: Saved new token in config file 2026/10/04 03:28:48 DEBUG : Internxt root 'rclone-test-podipef5boba': Persisted rotated token from user info, expiry: 2026-10-11 03:28:48 +0000 UTC 2026/10/04 03:28:48 DEBUG : Creating backend with remote "/tmp/rclone4232996977" run.go:198: Remote "Internxt root 'rclone-test-podipef5boba'", Local "Local file system at /tmp/rclone4232996977", Modify Window "876000h0m0s" FileLimitsResponse { "maxUploadFileSize": 107374182400, "versioning": { "enabled": true, "maxFileSize": 20971520, "retentionDays": 30, "maxVersions": 20 } } both checkfile vs. NFDx2 remote (without normalization) 2026/10/04 03:28:52 ERROR : 測試_Русский___ě_áñ測試_Русский___ě_áñ: sum not found 2026/10/04 03:28:52 ERROR : 測試_Русский___ě_áñ測試_Русский___ě_áñ: file not in Internxt root 'rclone-test-podipef5boba' 2026/10/04 03:28:52 NOTICE: Internxt root 'rclone-test-podipef5boba': 1 files missing 2026/10/04 03:28:52 NOTICE: 1 hashes missing 2026/10/04 03:28:52 NOTICE: Internxt root 'rclone-test-podipef5boba': 1 differences found 2026/10/04 03:28:52 NOTICE: Internxt root 'rclone-test-podipef5boba': 2 errors while checking both checkfile vs. NFDx2 remote (with normalization) 2026/10/04 03:28:52 DEBUG : 測試_Русский___ě_áñ測試_Русский___ě_áñ: md5 = 65a8e27d8879283831b664bd8b7f0ad4 OK 2026/10/04 03:28:52 NOTICE: Internxt root 'rclone-test-podipef5boba': 0 differences found 2026/10/04 03:28:52 NOTICE: Internxt root 'rclone-test-podipef5boba': 1 matching files 2026/10/04 03:28:52 DEBUG : Creating backend with remote "TestInternxt:rclone-test-cepuqiw8mefa" 2026/10/04 03:28:52 DEBUG : Using config file from "/home/rclone/.rclone.conf" 2026/10/04 03:28:53 DEBUG : User info: rootFolderId=2661cf64-e104-478b-b737-48c3ac8984d2, bucket=697358bf16ceabcf39af85f2 2026/10/04 03:28:53 DEBUG : Saving config "token" in section "TestInternxt" of the config file 2026/10/04 03:28:53 DEBUG : TestInternxt: Saved new token in config file 2026/10/04 03:28:53 DEBUG : Internxt root 'rclone-test-cepuqiw8mefa': Persisted rotated token from user info, expiry: 2026-10-11 03:28:53 +0000 UTC 2026/10/04 03:28:53 DEBUG : Creating backend with remote "/tmp/rclone54221770" run.go:198: Remote "Internxt root 'rclone-test-cepuqiw8mefa'", Local "Local file system at /tmp/rclone54221770", Modify Window "876000h0m0s" FileLimitsResponse { "maxUploadFileSize": 107374182400, "versioning": { "enabled": true, "maxFileSize": 20971520, "retentionDays": 30, "maxVersions": 20 } } both checkfile vs. NFCx2 remote (without normalization) 2026/10/04 03:28:55 ERROR : 測試_Русский___ě_áñ測試_Русский___ě_áñ: sum not found 2026/10/04 03:28:55 ERROR : 測試_Русский___ě_áñ測試_Русский___ě_áñ: file not in Internxt root 'rclone-test-cepuqiw8mefa' 2026/10/04 03:28:55 NOTICE: Internxt root 'rclone-test-cepuqiw8mefa': 1 files missing 2026/10/04 03:28:55 NOTICE: 1 hashes missing 2026/10/04 03:28:55 NOTICE: Internxt root 'rclone-test-cepuqiw8mefa': 1 differences found 2026/10/04 03:28:55 NOTICE: Internxt root 'rclone-test-cepuqiw8mefa': 2 errors while checking both checkfile vs. NFCx2 remote (with normalization) 2026/10/04 03:28:56 DEBUG : 測試_Русский___ě_áñ測試_Русский___ě_áñ: md5 = 65a8e27d8879283831b664bd8b7f0ad4 OK 2026/10/04 03:28:56 NOTICE: Internxt root 'rclone-test-cepuqiw8mefa': 0 differences found 2026/10/04 03:28:56 NOTICE: Internxt root 'rclone-test-cepuqiw8mefa': 1 matching files 2026/10/04 03:28:57 DEBUG : Internxt root 'rclone-test-cepuqiw8mefa': Purge object "測試_Русский___ě_áñ測試_Русский___ě_áñ" 2026/10/04 03:28:57 DEBUG : Internxt root 'rclone-test-cepuqiw8mefa': Purge dir "" 2026/10/04 03:28:58 DEBUG : Internxt root 'rclone-test-podipef5boba': Purge object "測試_Русский___ě_áñ測試_Русский___ě_áñ" 2026/10/04 03:28:58 DEBUG : Internxt root 'rclone-test-podipef5boba': Purge dir "" 2026/10/04 03:28:59 DEBUG : Internxt root 'rclone-test-tolovon9wibu': Purge object "測試_Русский___ě_áñ測試_Русский___ě_áñ" 2026/10/04 03:28:59 DEBUG : Internxt root 'rclone-test-tolovon9wibu': Purge dir "" 2026/10/04 03:28:59 DEBUG : Internxt root 'rclone-test-kojisom0quzi': Purge object "測試_Русский___ě_áñ測試_Русский___ě_áñ" 2026/10/04 03:29:00 DEBUG : Internxt root 'rclone-test-kojisom0quzi': Purge dir "" 2026/10/04 03:29:00 DEBUG : Internxt root 'rclone-test-yocecek9neye': Purge object "測試_Русский___ě_áñ" 2026/10/04 03:29:00 DEBUG : Internxt root 'rclone-test-yocecek9neye': Purge dir "" 2026/10/04 03:29:01 DEBUG : Internxt root 'rclone-test-savuzac9fuvi': Purge object "測試_Русский___ě_áñ" 2026/10/04 03:29:02 DEBUG : Internxt root 'rclone-test-savuzac9fuvi': Purge dir "" 2026/10/04 03:29:02 DEBUG : Internxt root 'rclone-test-vulepij8huso': Purge object "HELLO, WORLD!" 2026/10/04 03:29:02 DEBUG : Internxt root 'rclone-test-vulepij8huso': Purge dir "" 2026/10/04 03:29:03 DEBUG : pacer: Reducing sleep to 72.081298ms 2026/10/04 03:29:03 DEBUG : pacer: Reducing sleep to 54.060973ms 2026/10/04 03:29:03 DEBUG : Internxt root 'rclone-test-zacejus7vunu': Purge object "HeLlO, wOrLd!" 2026/10/04 03:29:03 DEBUG : pacer: Reducing sleep to 40.545729ms 2026/10/04 03:29:03 DEBUG : Internxt root 'rclone-test-zacejus7vunu': Purge dir "" 2026/10/04 03:29:03 DEBUG : pacer: Reducing sleep to 30.409296ms 2026/10/04 03:29:04 DEBUG : pacer: Reducing sleep to 22.806972ms 2026/10/04 03:29:04 DEBUG : pacer: Reducing sleep to 17.105229ms 2026/10/04 03:29:04 DEBUG : Internxt root 'rclone-test-suzapum5yoce': Purge object "HELLO, WORLD!" 2026/10/04 03:29:04 DEBUG : Internxt root 'rclone-test-suzapum5yoce': Purge dir "" 2026/10/04 03:29:05 DEBUG : Internxt root 'rclone-test-nayaroc3ceya': Purge object "hello, world!" 2026/10/04 03:29:05 DEBUG : Internxt root 'rclone-test-nayaroc3ceya': Purge dir "" --- PASS: TestApplyTransforms (52.18s) === RUN TestTruncateString --- PASS: TestTruncateString (0.00s) === RUN TestCopyFile run.go:198: Remote "Internxt root 'rclone-test-xivasil4fali'", Local "Local file system at /tmp/rclone1821118965", Modify Window "876000h0m0s" 2026/10/04 03:29:06 DEBUG : file1: Need to transfer - File not found at Destination 2026/10/04 03:29:07 DEBUG : sub/file2: size = 14 OK 2026/10/04 03:29:07 INFO : file1: Copied (new) to: sub/file2 fstest.go:299: Sleeping for 1s for list eventual consistency: 1/5 fstest.go:302: Flushing the directory cache fstest.go:293: Sleeping for 6s just to make sure 2026/10/04 03:29:15 DEBUG : sub/file2: size = 14 OK 2026/10/04 03:29:15 DEBUG : file1: Sizes identical 2026/10/04 03:29:15 DEBUG : file1: Unchanged skipping 2026/10/04 03:29:16 DEBUG : Internxt root 'rclone-test-xivasil4fali': don't need to copy/move sub/file2, it is already at target location --- PASS: TestCopyFile (11.93s) === RUN TestCopyFileImmutable run.go:198: Remote "Internxt root 'rclone-test-xivasil4fali'", Local "Local file system at /tmp/rclone1821118965", Modify Window "876000h0m0s" 2026/10/04 03:29:18 DEBUG : existing: Need to transfer - File not found at Destination 2026/10/04 03:29:18 DEBUG : existing: size = 6 OK 2026/10/04 03:29:18 INFO : existing: Copied (new) 2026/10/04 03:29:19 DEBUG : existing: size = 6 OK 2026/10/04 03:29:19 DEBUG : existing: Sizes identical 2026/10/04 03:29:19 DEBUG : existing: Unchanged skipping 2026/10/04 03:29:19 DEBUG : existing: size = 8 (Local file system at /tmp/rclone1821118965) 2026/10/04 03:29:19 DEBUG : existing: size = 6 (Internxt root 'rclone-test-xivasil4fali') 2026/10/04 03:29:19 DEBUG : existing: Sizes differ 2026/10/04 03:29:19 ERROR : existing: Source and destination exist but do not match: immutable file modified --- PASS: TestCopyFileImmutable (2.60s) === RUN TestCopyLongFile run.go:198: Remote "Internxt root 'rclone-test-xivasil4fali'", Local "Local file system at /tmp/rclone1821118965", Modify Window "876000h0m0s" copy_test.go:188: Test only runs on local --- SKIP: TestCopyLongFile (0.38s) === RUN TestCopyFileBackupDir run.go:198: Remote "Internxt root 'rclone-test-xivasil4fali'", Local "Local file system at /tmp/rclone1821118965", Modify Window "876000h0m0s" 2026/10/04 03:29:22 DEBUG : Creating backend with remote "TestInternxt:rclone-test-xivasil4fali/backup" 2026/10/04 03:29:22 DEBUG : User info: rootFolderId=2661cf64-e104-478b-b737-48c3ac8984d2, bucket=697358bf16ceabcf39af85f2 2026/10/04 03:29:22 DEBUG : Saving config "token" in section "TestInternxt" of the config file 2026/10/04 03:29:22 DEBUG : TestInternxt: Saved new token in config file 2026/10/04 03:29:22 DEBUG : Internxt root 'rclone-test-xivasil4fali/backup': Persisted rotated token from user info, expiry: 2026-10-11 03:29:22 +0000 UTC 2026/10/04 03:29:23 DEBUG : dst/file1: size = 14 (Local file system at /tmp/rclone1821118965) 2026/10/04 03:29:23 DEBUG : dst/file1: size = 18 (Internxt root 'rclone-test-xivasil4fali') 2026/10/04 03:29:23 DEBUG : dst/file1: Sizes differ 2026/10/04 03:29:24 INFO : dst/file1: Moved (server-side) 2026/10/04 03:29:25 DEBUG : dst/file1: size = 14 OK 2026/10/04 03:29:25 INFO : dst/file1: Copied (new) --- PASS: TestCopyFileBackupDir (9.33s) === RUN TestCopyFileCompareDest run.go:198: Remote "Internxt root 'rclone-test-xivasil4fali'", Local "Local file system at /tmp/rclone1821118965", Modify Window "876000h0m0s" 2026/10/04 03:29:30 DEBUG : Creating backend with remote "TestInternxt:rclone-test-xivasil4fali/dst" 2026/10/04 03:29:30 DEBUG : User info: rootFolderId=2661cf64-e104-478b-b737-48c3ac8984d2, bucket=697358bf16ceabcf39af85f2 2026/10/04 03:29:30 DEBUG : Saving config "token" in section "TestInternxt" of the config file 2026/10/04 03:29:30 DEBUG : TestInternxt: Saved new token in config file 2026/10/04 03:29:30 DEBUG : Internxt root 'rclone-test-xivasil4fali/dst': Persisted rotated token from user info, expiry: 2026-10-11 03:29:30 +0000 UTC 2026/10/04 03:29:32 DEBUG : Creating backend with remote "TestInternxt:rclone-test-xivasil4fali/CompareDest" 2026/10/04 03:29:32 DEBUG : User info: rootFolderId=2661cf64-e104-478b-b737-48c3ac8984d2, bucket=697358bf16ceabcf39af85f2 2026/10/04 03:29:32 DEBUG : Saving config "token" in section "TestInternxt" of the config file 2026/10/04 03:29:32 DEBUG : TestInternxt: Saved new token in config file 2026/10/04 03:29:32 DEBUG : Internxt root 'rclone-test-xivasil4fali/CompareDest': Persisted rotated token from user info, expiry: 2026-10-11 03:29:32 +0000 UTC 2026/10/04 03:29:32 DEBUG : one: Need to transfer - File not found at Destination FileLimitsResponse { "maxUploadFileSize": 107374182400, "versioning": { "enabled": true, "maxFileSize": 20971520, "retentionDays": 30, "maxVersions": 20 } } 2026/10/04 03:29:34 DEBUG : one: size = 3 OK 2026/10/04 03:29:34 INFO : one: Copied (new) 2026/10/04 03:29:36 DEBUG : one: size = 5 (Local file system at /tmp/rclone1821118965) 2026/10/04 03:29:36 DEBUG : one: size = 3 (Internxt root 'rclone-test-xivasil4fali/dst') 2026/10/04 03:29:36 DEBUG : one: Sizes differ 2026/10/04 03:29:36 DEBUG : Internxt root 'rclone-test-xivasil4fali/dst': Renamed existing file one to backup one.rclone-backup-zohizer7. (UUID: 01a104f5-b602-72e7-9c4e-1a3ef9a1d07c) 2026/10/04 03:29:37 DEBUG : Internxt root 'rclone-test-xivasil4fali/dst': Upload succeeded, deleting backup file one.rclone-backup-zohizer7. (UUID: 01a104f5-b602-72e7-9c4e-1a3ef9a1d07c) 2026/10/04 03:29:37 DEBUG : Internxt root 'rclone-test-xivasil4fali/dst': Successfully deleted backup file 2026/10/04 03:29:37 DEBUG : one: size = 5 OK 2026/10/04 03:29:37 INFO : one: Copied (replaced existing) 2026/10/04 03:29:38 DEBUG : Internxt root 'rclone-test-xivasil4fali': Renamed existing file dst/one to backup one.rclone-backup-fopidax6. (UUID: 01a104f5-c2de-701b-accc-c9277b601d94) 2026/10/04 03:29:39 DEBUG : Internxt root 'rclone-test-xivasil4fali': Upload succeeded, deleting backup file one.rclone-backup-fopidax6. (UUID: 01a104f5-c2de-701b-accc-c9277b601d94) 2026/10/04 03:29:39 DEBUG : Internxt root 'rclone-test-xivasil4fali': Successfully deleted backup file fstest.go:299: Sleeping for 1s for list eventual consistency: 1/5 fstest.go:302: Flushing the directory cache fstest.go:299: Sleeping for 2s for list eventual consistency: 2/5 fstest.go:302: Flushing the directory cache fstest.go:299: Sleeping for 4s for list eventual consistency: 3/5 fstest.go:302: Flushing the directory cache fstest.go:293: Sleeping for 9s just to make sure 2026/10/04 03:30:00 DEBUG : one: size = 5 (Local file system at /tmp/rclone1821118965) 2026/10/04 03:30:00 DEBUG : one: size = 3 (Internxt root 'rclone-test-xivasil4fali/dst') 2026/10/04 03:30:00 DEBUG : one: Sizes differ 2026/10/04 03:30:01 DEBUG : one: size = 5 OK 2026/10/04 03:30:01 DEBUG : one: Sizes identical 2026/10/04 03:30:01 DEBUG : one: Destination found in --compare-dest, skipping 2026/10/04 03:30:03 DEBUG : two: Need to transfer - File not found at Destination 2026/10/04 03:30:03 DEBUG : two: size = 3 OK 2026/10/04 03:30:03 DEBUG : two: Sizes identical 2026/10/04 03:30:03 DEBUG : two: Destination found in --compare-dest, skipping 2026/10/04 03:30:04 DEBUG : two: Need to transfer - File not found at Destination 2026/10/04 03:30:04 DEBUG : two: size = 3 OK 2026/10/04 03:30:04 DEBUG : two: Sizes identical 2026/10/04 03:30:04 DEBUG : two: Destination found in --compare-dest, skipping 2026/10/04 03:30:05 DEBUG : two: Need to transfer - File not found at Destination 2026/10/04 03:30:06 DEBUG : two: size = 5 (Local file system at /tmp/rclone1821118965) 2026/10/04 03:30:06 DEBUG : two: size = 3 (Internxt root 'rclone-test-xivasil4fali/CompareDest') 2026/10/04 03:30:06 DEBUG : two: Sizes differ 2026/10/04 03:30:06 DEBUG : two: size = 5 OK 2026/10/04 03:30:06 INFO : two: Copied (new) fstest.go:299: Sleeping for 1s for list eventual consistency: 1/5 fstest.go:302: Flushing the directory cache fstest.go:293: Sleeping for 6s just to make sure --- PASS: TestCopyFileCompareDest (48.79s) === RUN TestCopyFileCopyDestImmutable run.go:198: Remote "Internxt root 'rclone-test-xivasil4fali'", Local "Local file system at /tmp/rclone1821118965", Modify Window "876000h0m0s" copy_test.go:312: Skipping test as remote does not support server-side copy --- SKIP: TestCopyFileCopyDestImmutable (0.68s) === RUN TestCopyFileCopyDest run.go:198: Remote "Internxt root 'rclone-test-xivasil4fali'", Local "Local file system at /tmp/rclone1821118965", Modify Window "876000h0m0s" copy_test.go:340: Skipping test as remote does not support server-side copy --- SKIP: TestCopyFileCopyDest (0.46s) === RUN TestCopyInplace run.go:198: Remote "Internxt root 'rclone-test-xivasil4fali'", Local "Local file system at /tmp/rclone1821118965", Modify Window "876000h0m0s" copy_test.go:434: Partial uploads not supported --- SKIP: TestCopyInplace (0.41s) === RUN TestCopyLongFileName run.go:198: Remote "Internxt root 'rclone-test-xivasil4fali'", Local "Local file system at /tmp/rclone1821118965", Modify Window "876000h0m0s" copy_test.go:467: Partial uploads not supported --- SKIP: TestCopyLongFileName (0.49s) === RUN TestCopyLongFileNameCollision run.go:198: Remote "Internxt root 'rclone-test-xivasil4fali'", Local "Local file system at /tmp/rclone1821118965", Modify Window "876000h0m0s" copy_test.go:500: Partial uploads not supported --- SKIP: TestCopyLongFileNameCollision (0.43s) === RUN TestCopyFileMaxTransfer run.go:198: Remote "Internxt root 'rclone-test-xivasil4fali'", Local "Local file system at /tmp/rclone1821118965", Modify Window "876000h0m0s" 2026/10/04 03:30:21 DEBUG : TestCopyFileMaxTransfer/file1: Need to transfer - File not found at Destination 2026/10/04 03:30:22 DEBUG : TestCopyFileMaxTransfer/file1: size = 14 OK 2026/10/04 03:30:22 INFO : TestCopyFileMaxTransfer/file1: Copied (new) 2026/10/04 03:30:23 DEBUG : TestCopyFileMaxTransfer/file2: Need to transfer - File not found at Destination 2026/10/04 03:30:23 ERROR : TestCopyFileMaxTransfer/file2: Failed to copy: failed to pre-read data: max transfer limit reached as set by --max-transfer 2026/10/04 03:30:23 DEBUG : TestCopyFileMaxTransfer/file3: Need to transfer - File not found at Destination 2026/10/04 03:30:24 DEBUG : TestCopyFileMaxTransfer/file4: Need to transfer - File not found at Destination 2026/10/04 03:30:25 DEBUG : TestCopyFileMaxTransfer/file4: size = 2062 OK 2026/10/04 03:30:25 INFO : TestCopyFileMaxTransfer/file4: Copied (new) --- PASS: TestCopyFileMaxTransfer (5.66s) === RUN TestDeduplicateInteractive run.go:198: Remote "Internxt root 'rclone-test-xivasil4fali'", Local "Local file system at /tmp/rclone1821118965", Modify Window "876000h0m0s" dedupe_test.go:25: Can't test deduplicate - no duplicate files possible --- SKIP: TestDeduplicateInteractive (0.44s) === RUN TestDeduplicateSkip run.go:198: Remote "Internxt root 'rclone-test-xivasil4fali'", Local "Local file system at /tmp/rclone1821118965", Modify Window "876000h0m0s" dedupe_test.go:25: Can't test deduplicate - no duplicate files possible --- SKIP: TestDeduplicateSkip (0.46s) === RUN TestDeduplicateSizeOnly run.go:198: Remote "Internxt root 'rclone-test-xivasil4fali'", Local "Local file system at /tmp/rclone1821118965", Modify Window "876000h0m0s" dedupe_test.go:25: Can't test deduplicate - no duplicate files possible --- SKIP: TestDeduplicateSizeOnly (0.39s) === RUN TestDeduplicateFirst run.go:198: Remote "Internxt root 'rclone-test-xivasil4fali'", Local "Local file system at /tmp/rclone1821118965", Modify Window "876000h0m0s" dedupe_test.go:25: Can't test deduplicate - no duplicate files possible --- SKIP: TestDeduplicateFirst (0.39s) === RUN TestDeduplicateNewest run.go:198: Remote "Internxt root 'rclone-test-xivasil4fali'", Local "Local file system at /tmp/rclone1821118965", Modify Window "876000h0m0s" dedupe_test.go:25: Can't test deduplicate - no duplicate files possible --- SKIP: TestDeduplicateNewest (0.77s) === RUN TestDeduplicateNewestByHash run.go:198: Remote "Internxt root 'rclone-test-xivasil4fali'", Local "Local file system at /tmp/rclone1821118965", Modify Window "876000h0m0s" dedupe_test.go:37: Can't run this test without a hash --- SKIP: TestDeduplicateNewestByHash (0.41s) === RUN TestDeduplicateOldest run.go:198: Remote "Internxt root 'rclone-test-xivasil4fali'", Local "Local file system at /tmp/rclone1821118965", Modify Window "876000h0m0s" dedupe_test.go:25: Can't test deduplicate - no duplicate files possible --- SKIP: TestDeduplicateOldest (0.44s) === RUN TestDeduplicateLargest run.go:198: Remote "Internxt root 'rclone-test-xivasil4fali'", Local "Local file system at /tmp/rclone1821118965", Modify Window "876000h0m0s" dedupe_test.go:25: Can't test deduplicate - no duplicate files possible --- SKIP: TestDeduplicateLargest (0.45s) === RUN TestDeduplicateSmallest run.go:198: Remote "Internxt root 'rclone-test-xivasil4fali'", Local "Local file system at /tmp/rclone1821118965", Modify Window "876000h0m0s" dedupe_test.go:25: Can't test deduplicate - no duplicate files possible --- SKIP: TestDeduplicateSmallest (0.46s) === RUN TestDeduplicateRename run.go:198: Remote "Internxt root 'rclone-test-xivasil4fali'", Local "Local file system at /tmp/rclone1821118965", Modify Window "876000h0m0s" dedupe_test.go:25: Can't test deduplicate - no duplicate files possible --- SKIP: TestDeduplicateRename (0.39s) === RUN TestDeduplicateRenameManyExisting run.go:198: Remote "Internxt root 'rclone-test-xivasil4fali'", Local "Local file system at /tmp/rclone1821118965", Modify Window "876000h0m0s" dedupe_test.go:25: Can't test deduplicate - no duplicate files possible --- SKIP: TestDeduplicateRenameManyExisting (0.57s) === RUN TestMergeDirs run.go:198: Remote "Internxt root 'rclone-test-xivasil4fali'", Local "Local file system at /tmp/rclone1821118965", Modify Window "876000h0m0s" dedupe_test.go:294: Can't merge directories --- SKIP: TestMergeDirs (0.47s) === RUN TestIndex run.go:198: Remote "Internxt root 'rclone-test-xivasil4fali'", Local "Local file system at /tmp/rclone1821118965", Modify Window "876000h0m0s" 2026/10/04 03:30:37 DEBUG : caddy.json: size = 259 OK 2026/10/04 03:30:37 INFO : caddy.json: Copied (new) 2026/10/04 03:30:37 DEBUG : sub/deep/index.html: size = 12087 OK 2026/10/04 03:30:37 INFO : sub/deep/index.html: Copied (new) 2026/10/04 03:30:37 DEBUG : index.html: size = 12147 OK 2026/10/04 03:30:37 INFO : index.html: Copied (new) 2026/10/04 03:30:37 DEBUG : index.json: size = 213 OK 2026/10/04 03:30:37 INFO : index.json: Copied (new) 2026/10/04 03:30:37 DEBUG : sub/deep/index.json: size = 119 OK 2026/10/04 03:30:37 INFO : sub/deep/index.json: Copied (new) 2026/10/04 03:30:37 DEBUG : sub/index.html: size = 12306 OK 2026/10/04 03:30:37 INFO : sub/index.html: Copied (new) 2026/10/04 03:30:37 DEBUG : sub/deep/caddy.json: size = 131 OK 2026/10/04 03:30:37 INFO : sub/deep/caddy.json: Copied (new) 2026/10/04 03:30:38 DEBUG : sub/caddy.json: size = 261 OK 2026/10/04 03:30:38 INFO : sub/caddy.json: Copied (new) 2026/10/04 03:30:38 DEBUG : sub/index.json: size = 215 OK 2026/10/04 03:30:38 INFO : sub/index.json: Copied (new) index_test.go:99: Error Trace: /home/rclone/go/src/github.com/rclone/rclone/fs/operations/index_test.go:99 /home/rclone/go/src/github.com/rclone/rclone/fs/operations/index_test.go:109 Error: Not equal: expected: []string{"caddy.json", "file1.txt", "index.html", "index.json", "sub/caddy.json", "sub/deep/caddy.json", "sub/deep/file3.txt", "sub/deep/index.html", "sub/deep/index.json", "sub/file2.txt", "sub/index.html", "sub/index.json"} actual : []string{"caddy.json", "file1.txt", "index.html", "index.json", "sub/deep/file3.txt", "sub/deep/index.html", "sub/file2.txt"} Diff: --- Expected +++ Actual @@ -1,2 +1,2 @@ -([]string) (len=12) { +([]string) (len=7) { (string) (len=10) "caddy.json", @@ -5,10 +5,5 @@ (string) (len=10) "index.json", - (string) (len=14) "sub/caddy.json", - (string) (len=19) "sub/deep/caddy.json", (string) (len=18) "sub/deep/file3.txt", (string) (len=19) "sub/deep/index.html", - (string) (len=19) "sub/deep/index.json", - (string) (len=13) "sub/file2.txt", - (string) (len=14) "sub/index.html", - (string) (len=14) "sub/index.json" + (string) (len=13) "sub/file2.txt" } Test: TestIndex 2026/10/04 03:30:43 DEBUG : sub/index.html: Unchanged skipping 2026/10/04 03:30:43 DEBUG : sub/deep/index.html: Unchanged skipping 2026/10/04 03:30:43 DEBUG : index.html: Unchanged skipping 2026/10/04 03:30:43 DEBUG : sub/deep/index.json: Unchanged skipping 2026/10/04 03:30:43 DEBUG : index.json: Unchanged skipping 2026/10/04 03:30:43 DEBUG : sub/deep/caddy.json: Unchanged skipping 2026/10/04 03:30:43 DEBUG : sub/caddy.json: size = 261 OK 2026/10/04 03:30:43 INFO : sub/caddy.json: Copied (new) 2026/10/04 03:30:44 DEBUG : caddy.json: Unchanged skipping 2026/10/04 03:30:44 DEBUG : Internxt root 'rclone-test-xivasil4fali': Renamed existing file sub/index.json to backup index.rclone-backup-gigejam9.json (UUID: 01a104f6-b0fd-7098-8220-88b2164e8cf8) 2026/10/04 03:30:45 DEBUG : Internxt root 'rclone-test-xivasil4fali': Upload succeeded, deleting backup file index.rclone-backup-gigejam9.json (UUID: 01a104f6-b0fd-7098-8220-88b2164e8cf8) 2026/10/04 03:30:47 DEBUG : Internxt root 'rclone-test-xivasil4fali': Successfully deleted backup file 2026/10/04 03:30:47 DEBUG : sub/index.json: size = 215 OK 2026/10/04 03:30:47 INFO : sub/index.json: Copied (new) index_test.go:142: Error Trace: /home/rclone/go/src/github.com/rclone/rclone/fs/operations/index_test.go:142 Error: Not equal: expected: 0 actual : 2 Test: TestIndex 2026/10/04 03:30:48 DEBUG : Internxt root 'rclone-test-xivasil4fali': Renamed existing file caddy.json to backup caddy.rclone-backup-cacixoz0.json (UUID: 01a104f6-abd2-70cc-bf1c-d266485f92c8) 2026/10/04 03:30:48 DEBUG : Internxt root 'rclone-test-xivasil4fali': Renamed existing file sub/index.html to backup index.rclone-backup-zonulob2.html (UUID: 01a104f6-ae66-7637-af33-accdc51a7270) 2026/10/04 03:30:48 DEBUG : Internxt root 'rclone-test-xivasil4fali': Renamed existing file index.html to backup index.rclone-backup-terocog8.html (UUID: 01a104f6-ac2c-728f-ab58-c811efe1bb2d) 2026/10/04 03:30:48 DEBUG : Internxt root 'rclone-test-xivasil4fali': Renamed existing file index.json to backup index.rclone-backup-cucefib9.json (UUID: 01a104f6-ac35-7278-ae2a-d159a92e19c5) 2026/10/04 03:30:49 DEBUG : Internxt root 'rclone-test-xivasil4fali': Upload succeeded, deleting backup file index.rclone-backup-zonulob2.html (UUID: 01a104f6-ae66-7637-af33-accdc51a7270) 2026/10/04 03:30:49 DEBUG : Internxt root 'rclone-test-xivasil4fali': Upload succeeded, deleting backup file caddy.rclone-backup-cacixoz0.json (UUID: 01a104f6-abd2-70cc-bf1c-d266485f92c8) 2026/10/04 03:30:49 DEBUG : Internxt root 'rclone-test-xivasil4fali': Upload succeeded, deleting backup file index.rclone-backup-terocog8.html (UUID: 01a104f6-ac2c-728f-ab58-c811efe1bb2d) 2026/10/04 03:30:49 DEBUG : Internxt root 'rclone-test-xivasil4fali': Upload succeeded, deleting backup file index.rclone-backup-cucefib9.json (UUID: 01a104f6-ac35-7278-ae2a-d159a92e19c5) 2026/10/04 03:30:49 DEBUG : Internxt root 'rclone-test-xivasil4fali': Successfully deleted backup file 2026/10/04 03:30:49 DEBUG : sub/index.html: size = 12306 OK 2026/10/04 03:30:49 INFO : sub/index.html: Copied (replaced existing) 2026/10/04 03:30:49 DEBUG : Internxt root 'rclone-test-xivasil4fali': Successfully deleted backup file 2026/10/04 03:30:49 DEBUG : caddy.json: size = 259 OK 2026/10/04 03:30:49 INFO : caddy.json: Copied (replaced existing) 2026/10/04 03:30:49 DEBUG : Internxt root 'rclone-test-xivasil4fali': Successfully deleted backup file 2026/10/04 03:30:49 DEBUG : index.html: size = 12147 OK 2026/10/04 03:30:49 INFO : index.html: Copied (replaced existing) 2026/10/04 03:30:49 DEBUG : Internxt root 'rclone-test-xivasil4fali': Renamed existing file sub/index.json to backup index.rclone-backup-vekiqow5.json (UUID: 01a104f6-cb88-75de-b8e9-2f539312af90) 2026/10/04 03:30:49 DEBUG : Internxt root 'rclone-test-xivasil4fali': Renamed existing file sub/deep/index.html to backup index.rclone-backup-rimenej0.html (UUID: 01a104f6-abea-759a-925a-da9829fb7ce3) 2026/10/04 03:30:49 DEBUG : Internxt root 'rclone-test-xivasil4fali': Renamed existing file sub/caddy.json to backup caddy.rclone-backup-neweced4.json (UUID: 01a104f6-b09b-74a4-80ff-043e0c12cfdd) 2026/10/04 03:30:49 DEBUG : Internxt root 'rclone-test-xivasil4fali': Successfully deleted backup file 2026/10/04 03:30:49 DEBUG : index.json: size = 213 OK 2026/10/04 03:30:49 INFO : index.json: Copied (replaced existing) 2026/10/04 03:30:49 DEBUG : Internxt root 'rclone-test-xivasil4fali': Renamed existing file sub/deep/index.json to backup index.rclone-backup-cozoxof5.json (UUID: 01a104f6-ae41-746a-b8c5-d59aaacf6d7c) 2026/10/04 03:30:50 DEBUG : Internxt root 'rclone-test-xivasil4fali': Upload succeeded, deleting backup file index.rclone-backup-rimenej0.html (UUID: 01a104f6-abea-759a-925a-da9829fb7ce3) 2026/10/04 03:30:50 DEBUG : Internxt root 'rclone-test-xivasil4fali': Upload succeeded, deleting backup file caddy.rclone-backup-neweced4.json (UUID: 01a104f6-b09b-74a4-80ff-043e0c12cfdd) 2026/10/04 03:30:50 DEBUG : Internxt root 'rclone-test-xivasil4fali': Successfully deleted backup file 2026/10/04 03:30:50 DEBUG : sub/deep/index.html: size = 12087 OK 2026/10/04 03:30:50 INFO : sub/deep/index.html: Copied (replaced existing) 2026/10/04 03:30:50 DEBUG : Internxt root 'rclone-test-xivasil4fali': Upload succeeded, deleting backup file index.rclone-backup-cozoxof5.json (UUID: 01a104f6-ae41-746a-b8c5-d59aaacf6d7c) 2026/10/04 03:30:50 DEBUG : Internxt root 'rclone-test-xivasil4fali': Renamed existing file sub/deep/caddy.json to backup caddy.rclone-backup-covuyut1.json (UUID: 01a104f6-aea1-767e-ac3a-1bf250ca2dd8) 2026/10/04 03:30:50 DEBUG : Internxt root 'rclone-test-xivasil4fali': Successfully deleted backup file 2026/10/04 03:30:50 DEBUG : sub/caddy.json: size = 261 OK 2026/10/04 03:30:50 INFO : sub/caddy.json: Copied (replaced existing) 2026/10/04 03:30:50 DEBUG : Internxt root 'rclone-test-xivasil4fali': Upload succeeded, deleting backup file index.rclone-backup-vekiqow5.json (UUID: 01a104f6-cb88-75de-b8e9-2f539312af90) 2026/10/04 03:30:50 DEBUG : Internxt root 'rclone-test-xivasil4fali': Successfully deleted backup file 2026/10/04 03:30:50 DEBUG : sub/deep/index.json: size = 119 OK 2026/10/04 03:30:50 INFO : sub/deep/index.json: Copied (replaced existing) 2026/10/04 03:30:50 DEBUG : Internxt root 'rclone-test-xivasil4fali': Successfully deleted backup file 2026/10/04 03:30:50 DEBUG : sub/index.json: size = 215 OK 2026/10/04 03:30:50 INFO : sub/index.json: Copied (replaced existing) 2026/10/04 03:30:50 DEBUG : Internxt root 'rclone-test-xivasil4fali': Upload succeeded, deleting backup file caddy.rclone-backup-covuyut1.json (UUID: 01a104f6-aea1-767e-ac3a-1bf250ca2dd8) 2026/10/04 03:30:51 DEBUG : Internxt root 'rclone-test-xivasil4fali': Successfully deleted backup file 2026/10/04 03:30:51 DEBUG : sub/deep/caddy.json: size = 131 OK 2026/10/04 03:30:51 INFO : sub/deep/caddy.json: Copied (replaced existing) 2026/10/04 03:30:53 DEBUG : Internxt root 'rclone-test-xivasil4fali': Renamed existing file sub/deep/caddy.json to backup caddy.rclone-backup-sokezex0.json (UUID: 01a104f6-e1d1-74bf-8cec-b4b704047bfb) 2026/10/04 03:30:53 DEBUG : Internxt root 'rclone-test-xivasil4fali': Renamed existing file sub/deep/index.html to backup index.rclone-backup-holozuq9.html (UUID: 01a104f6-de3e-74dd-891f-a28ec0f18260) 2026/10/04 03:30:53 DEBUG : Internxt root 'rclone-test-xivasil4fali': Renamed existing file sub/deep/index.json to backup index.rclone-backup-fafaton6.json (UUID: 01a104f6-df6b-749f-a389-509a43f6fe8d) 2026/10/04 03:30:53 DEBUG : index.html: Unchanged skipping 2026/10/04 03:30:53 DEBUG : sub/index.html: Unchanged skipping 2026/10/04 03:30:53 DEBUG : Internxt root 'rclone-test-xivasil4fali': Upload succeeded, deleting backup file index.rclone-backup-holozuq9.html (UUID: 01a104f6-de3e-74dd-891f-a28ec0f18260) 2026/10/04 03:30:53 DEBUG : index.json: Unchanged skipping 2026/10/04 03:30:53 DEBUG : sub/index.json: Unchanged skipping 2026/10/04 03:30:53 DEBUG : Internxt root 'rclone-test-xivasil4fali': Upload succeeded, deleting backup file index.rclone-backup-fafaton6.json (UUID: 01a104f6-df6b-749f-a389-509a43f6fe8d) 2026/10/04 03:30:53 DEBUG : Internxt root 'rclone-test-xivasil4fali': Successfully deleted backup file 2026/10/04 03:30:53 DEBUG : sub/deep/index.html: size = 12346 OK 2026/10/04 03:30:53 INFO : sub/deep/index.html: Copied (replaced existing) 2026/10/04 03:30:53 DEBUG : Internxt root 'rclone-test-xivasil4fali': Successfully deleted backup file 2026/10/04 03:30:53 DEBUG : sub/deep/index.json: size = 235 OK 2026/10/04 03:30:53 INFO : sub/deep/index.json: Copied (replaced existing) 2026/10/04 03:30:53 DEBUG : Internxt root 'rclone-test-xivasil4fali': Upload succeeded, deleting backup file caddy.rclone-backup-sokezex0.json (UUID: 01a104f6-e1d1-74bf-8cec-b4b704047bfb) 2026/10/04 03:30:53 DEBUG : caddy.json: Unchanged skipping 2026/10/04 03:30:54 DEBUG : sub/caddy.json: Unchanged skipping 2026/10/04 03:30:54 DEBUG : Internxt root 'rclone-test-xivasil4fali': Successfully deleted backup file 2026/10/04 03:30:54 DEBUG : sub/deep/caddy.json: size = 260 OK 2026/10/04 03:30:54 INFO : sub/deep/caddy.json: Copied (replaced existing) 2026/10/04 03:30:56 NOTICE: sub/deep/caddy.json: Skipped copy as --dry-run is set (size 389) 2026/10/04 03:30:56 NOTICE: sub/deep/index.html: Skipped copy as --dry-run is set (size 12.309Ki) 2026/10/04 03:30:56 NOTICE: sub/deep/index.json: Skipped copy as --dry-run is set (size 351) 2026/10/04 03:30:56 DEBUG : index.html: Unchanged skipping 2026/10/04 03:30:56 DEBUG : sub/index.html: Unchanged skipping 2026/10/04 03:30:56 DEBUG : index.json: Unchanged skipping 2026/10/04 03:30:56 DEBUG : sub/index.json: Unchanged skipping 2026/10/04 03:30:57 DEBUG : caddy.json: Unchanged skipping 2026/10/04 03:30:57 DEBUG : sub/caddy.json: Unchanged skipping --- FAIL: TestIndex (30.50s) === RUN TestIndexDelete run.go:198: Remote "Internxt root 'rclone-test-xivasil4fali'", Local "Local file system at /tmp/rclone1821118965", Modify Window "876000h0m0s" run.go:303: Failed to put "sub/file2.txt" to "Internxt root 'rclone-test-xivasil4fali'": failed to make directory: can't create folder, create folder: Folder with the same name already exists in this location (status 409) --- FAIL: TestIndexDelete (1.50s) === RUN TestIndexFilter run.go:198: Remote "Internxt root 'rclone-test-xivasil4fali'", Local "Local file system at /tmp/rclone1821118965", Modify Window "876000h0m0s" run.go:303: Failed to put "file1.txt" to "Internxt root 'rclone-test-xivasil4fali'": failed to create file metadata: create meta: A file with this name already exists in this location (status 409) --- FAIL: TestIndexFilter (1.22s) === RUN TestIndexRules run.go:198: Remote "Internxt root 'rclone-test-xivasil4fali'", Local "Local file system at /tmp/rclone1821118965", Modify Window "876000h0m0s" 2026/10/04 03:31:08 DEBUG : Internxt root 'rclone-test-xivasil4fali': Renamed existing file file1.txt to backup file1.rclone-backup-wisucay7.txt (UUID: 01a104f7-1452-72e7-9b3b-205481ce9871) 2026/10/04 03:31:08 DEBUG : Internxt root 'rclone-test-xivasil4fali': Upload succeeded, deleting backup file file1.rclone-backup-wisucay7.txt (UUID: 01a104f7-1452-72e7-9b3b-205481ce9871) 2026/10/04 03:31:09 DEBUG : Internxt root 'rclone-test-xivasil4fali': Successfully deleted backup file 2026/10/04 03:31:13 DEBUG : sub/index.html: size = 12306 OK 2026/10/04 03:31:13 INFO : sub/index.html: Copied (new) 2026/10/04 03:31:13 DEBUG : index.html: size = 12147 OK 2026/10/04 03:31:13 INFO : index.html: Copied (new) 2026/10/04 03:31:21 DEBUG : Internxt root 'rclone-test-xivasil4fali': Renamed existing file sub/deep/index.html to backup index.rclone-backup-tunovax8.html (UUID: 01a104f7-337e-7759-88cd-a8e96d09175b) 2026/10/04 03:31:22 DEBUG : sub/index.html: Unchanged skipping 2026/10/04 03:31:22 DEBUG : Internxt root 'rclone-test-xivasil4fali': Upload succeeded, deleting backup file index.rclone-backup-tunovax8.html (UUID: 01a104f7-337e-7759-88cd-a8e96d09175b) 2026/10/04 03:31:22 DEBUG : Internxt root 'rclone-test-xivasil4fali': Successfully deleted backup file 2026/10/04 03:31:22 DEBUG : sub/deep/index.html: size = 12087 OK 2026/10/04 03:31:22 INFO : sub/deep/index.html: Copied (replaced existing) --- PASS: TestIndexRules (23.15s) === RUN TestIndexMaxDepth run.go:198: Remote "Internxt root 'rclone-test-xivasil4fali'", Local "Local file system at /tmp/rclone1821118965", Modify Window "876000h0m0s" 2026/10/04 03:31:33 DEBUG : index.html: size = 12147 OK 2026/10/04 03:31:33 INFO : index.html: Copied (new) --- PASS: TestIndexMaxDepth (10.23s) === RUN TestIndexLinkIndex run.go:198: Remote "Internxt root 'rclone-test-xivasil4fali'", Local "Local file system at /tmp/rclone1821118965", Modify Window "876000h0m0s" 2026/10/04 03:31:51 DEBUG : index.html: size = 12167 OK 2026/10/04 03:31:51 INFO : index.html: Copied (new) 2026/10/04 03:31:51 DEBUG : sub/deep/index.html: size = 12128 OK 2026/10/04 03:31:51 INFO : sub/deep/index.html: Copied (new) 2026/10/04 03:31:51 DEBUG : sub/index.html: size = 12347 OK 2026/10/04 03:31:51 INFO : sub/index.html: Copied (new) --- PASS: TestIndexLinkIndex (16.80s) === RUN TestIndexDirTime run.go:198: Remote "Internxt root 'rclone-test-xivasil4fali'", Local "Local file system at /tmp/rclone1821118965", Modify Window "876000h0m0s" 2026/10/04 03:32:00 DEBUG : sub/index.json: size = 255 OK 2026/10/04 03:32:00 INFO : sub/index.json: Copied (new) 2026/10/04 03:32:00 DEBUG : sub/deep/index.json: size = 139 OK 2026/10/04 03:32:00 INFO : sub/deep/index.json: Copied (new) 2026/10/04 03:32:01 DEBUG : index.json: size = 253 OK 2026/10/04 03:32:01 INFO : index.json: Copied (new) 2026/10/04 03:32:02 DEBUG : Internxt root 'rclone-test-xivasil4fali': Renamed existing file index.json to backup index.rclone-backup-miwadim1.json (UUID: 01a104f7-f34e-72ee-badf-a74efbb7b6d7) 2026/10/04 03:32:02 DEBUG : Internxt root 'rclone-test-xivasil4fali': Renamed existing file sub/index.json to backup index.rclone-backup-bonahul8.json (UUID: 01a104f7-f190-732a-b2c5-fc1cb91470a8) 2026/10/04 03:32:02 DEBUG : sub/deep/index.json: Unchanged skipping 2026/10/04 03:32:03 DEBUG : Internxt root 'rclone-test-xivasil4fali': Upload succeeded, deleting backup file index.rclone-backup-bonahul8.json (UUID: 01a104f7-f190-732a-b2c5-fc1cb91470a8) 2026/10/04 03:32:03 DEBUG : Internxt root 'rclone-test-xivasil4fali': Upload succeeded, deleting backup file index.rclone-backup-miwadim1.json (UUID: 01a104f7-f34e-72ee-badf-a74efbb7b6d7) 2026/10/04 03:32:03 DEBUG : Internxt root 'rclone-test-xivasil4fali': Successfully deleted backup file 2026/10/04 03:32:03 DEBUG : sub/index.json: size = 235 OK 2026/10/04 03:32:03 INFO : sub/index.json: Copied (replaced existing) 2026/10/04 03:32:03 DEBUG : Internxt root 'rclone-test-xivasil4fali': Successfully deleted backup file 2026/10/04 03:32:03 DEBUG : index.json: size = 233 OK 2026/10/04 03:32:03 INFO : index.json: Copied (replaced existing) 2026/10/04 03:32:06 DEBUG : Internxt root 'rclone-test-xivasil4fali': Renamed existing file sub/deep/index.json to backup index.rclone-backup-giwudoj1.json (UUID: 01a104f7-f229-7269-9651-3f69e2c423a1) 2026/10/04 03:32:06 DEBUG : Internxt root 'rclone-test-xivasil4fali': Renamed existing file sub/index.json to backup index.rclone-backup-tayapem2.json (UUID: 01a104f7-fc12-77cd-b9c1-1289f1dff3bb) 2026/10/04 03:32:06 DEBUG : Internxt root 'rclone-test-xivasil4fali': Renamed existing file index.json to backup index.rclone-backup-sivulof5.json (UUID: 01a104f7-fc33-74af-86ec-69479c53d816) 2026/10/04 03:32:06 DEBUG : Internxt root 'rclone-test-xivasil4fali': Upload succeeded, deleting backup file index.rclone-backup-tayapem2.json (UUID: 01a104f7-fc12-77cd-b9c1-1289f1dff3bb) 2026/10/04 03:32:06 DEBUG : Internxt root 'rclone-test-xivasil4fali': Upload succeeded, deleting backup file index.rclone-backup-sivulof5.json (UUID: 01a104f7-fc33-74af-86ec-69479c53d816) 2026/10/04 03:32:06 DEBUG : Internxt root 'rclone-test-xivasil4fali': Successfully deleted backup file 2026/10/04 03:32:06 DEBUG : sub/index.json: size = 215 OK 2026/10/04 03:32:06 INFO : sub/index.json: Copied (replaced existing) 2026/10/04 03:32:06 DEBUG : Internxt root 'rclone-test-xivasil4fali': Successfully deleted backup file 2026/10/04 03:32:06 DEBUG : index.json: size = 213 OK 2026/10/04 03:32:06 INFO : index.json: Copied (replaced existing) 2026/10/04 03:32:07 DEBUG : Internxt root 'rclone-test-xivasil4fali': Upload succeeded, deleting backup file index.rclone-backup-giwudoj1.json (UUID: 01a104f7-f229-7269-9651-3f69e2c423a1) 2026/10/04 03:32:07 DEBUG : Internxt root 'rclone-test-xivasil4fali': Successfully deleted backup file 2026/10/04 03:32:07 DEBUG : sub/deep/index.json: size = 119 OK 2026/10/04 03:32:07 INFO : sub/deep/index.json: Copied (replaced existing) --- PASS: TestIndexDirTime (16.99s) === RUN TestIndexTemplate run.go:198: Remote "Internxt root 'rclone-test-xivasil4fali'", Local "Local file system at /tmp/rclone1821118965", Modify Window "876000h0m0s" run.go:299: Retry Put of "sub/file2.txt" to Internxt root 'rclone-test-xivasil4fali': 1/10 (failed to create file metadata: create meta: Folder not found (status 404)) 2026/10/04 03:32:19 DEBUG : sub/deep/list.txt: size = 47 OK 2026/10/04 03:32:19 INFO : sub/deep/list.txt: Copied (new) 2026/10/04 03:32:20 DEBUG : list.txt: size = 59 OK 2026/10/04 03:32:20 INFO : list.txt: Copied (new) 2026/10/04 03:32:22 DEBUG : sub/list.txt: size = 64 OK 2026/10/04 03:32:22 INFO : sub/list.txt: Copied (new) --- PASS: TestIndexTemplate (16.48s) === RUN TestIndexTemplateBuiltin --- PASS: TestIndexTemplateBuiltin (0.00s) === RUN TestRcIndex rc_test.go:31: Skipping test on non local remote --- SKIP: TestRcIndex (0.00s) === RUN TestIndexNoHash index_test.go:371: Skipping test on non local remote --- SKIP: TestIndexNoHash (0.00s) === RUN TestIndexChanged run.go:198: Remote "Internxt root 'rclone-test-xivasil4fali'", Local "Local file system at /tmp/rclone1821118965", Modify Window "876000h0m0s" 2026/10/04 03:32:34 DEBUG : other/index.html: size = 12058 OK 2026/10/04 03:32:34 INFO : other/index.html: Copied (new) 2026/10/04 03:32:34 DEBUG : sub/index.html: size = 12306 OK 2026/10/04 03:32:34 INFO : sub/index.html: Copied (new) 2026/10/04 03:32:34 DEBUG : sub/deep/index.html: size = 12087 OK 2026/10/04 03:32:34 INFO : sub/deep/index.html: Copied (new) 2026/10/04 03:32:35 DEBUG : index.html: size = 12399 OK 2026/10/04 03:32:35 INFO : index.html: Copied (new) 2026/10/04 03:32:36 INFO : Internxt root 'rclone-test-xivasil4fali': Partial index: listing 3 directories and walking 0 changed directories 2026/10/04 03:32:37 DEBUG : Internxt root 'rclone-test-xivasil4fali': Renamed existing file sub/deep/index.html to backup index.rclone-backup-yuyudof8.html (UUID: 01a104f8-779d-74ca-b37c-2dfbdf29eb9b) 2026/10/04 03:32:37 DEBUG : index.html: Unchanged skipping 2026/10/04 03:32:37 DEBUG : sub/index.html: Unchanged skipping 2026/10/04 03:32:38 DEBUG : Internxt root 'rclone-test-xivasil4fali': Upload succeeded, deleting backup file index.rclone-backup-yuyudof8.html (UUID: 01a104f8-779d-74ca-b37c-2dfbdf29eb9b) 2026/10/04 03:32:38 DEBUG : Internxt root 'rclone-test-xivasil4fali': Successfully deleted backup file 2026/10/04 03:32:38 DEBUG : sub/deep/index.html: size = 12346 OK 2026/10/04 03:32:38 INFO : sub/deep/index.html: Copied (replaced existing) 2026/10/04 03:32:40 INFO : Internxt root 'rclone-test-xivasil4fali': Partial index: listing 3 directories and walking 0 changed directories 2026/10/04 03:32:42 DEBUG : Internxt root 'rclone-test-xivasil4fali': Renamed existing file sub/index.html to backup index.rclone-backup-yodikuj6.html (UUID: 01a104f8-778d-7515-84ac-99922cd35f4e) 2026/10/04 03:32:42 DEBUG : index.html: Unchanged skipping 2026/10/04 03:32:42 DEBUG : Internxt root 'rclone-test-xivasil4fali': Upload succeeded, deleting backup file index.rclone-backup-yodikuj6.html (UUID: 01a104f8-778d-7515-84ac-99922cd35f4e) 2026/10/04 03:32:42 DEBUG : sub/new/index.html: size = 12085 OK 2026/10/04 03:32:42 INFO : sub/new/index.html: Copied (new) 2026/10/04 03:32:43 DEBUG : Internxt root 'rclone-test-xivasil4fali': Successfully deleted backup file 2026/10/04 03:32:43 DEBUG : sub/index.html: size = 12554 OK 2026/10/04 03:32:43 INFO : sub/index.html: Copied (replaced existing) 2026/10/04 03:32:44 INFO : Internxt root 'rclone-test-xivasil4fali': Partial index: listing 1 directories and walking 1 changed directories 2026/10/04 03:32:45 DEBUG : index.html: Unchanged skipping 2026/10/04 03:32:47 DEBUG : Internxt root 'rclone-test-xivasil4fali': Renamed existing file other/index.html to backup index.rclone-backup-saqewad4.html (UUID: 01a104f8-7742-770b-b2db-8cfe7f8e3ec2) 2026/10/04 03:32:47 DEBUG : Internxt root 'rclone-test-xivasil4fali': Upload succeeded, deleting backup file index.rclone-backup-saqewad4.html (UUID: 01a104f8-7742-770b-b2db-8cfe7f8e3ec2) 2026/10/04 03:32:48 DEBUG : Internxt root 'rclone-test-xivasil4fali': Successfully deleted backup file 2026/10/04 03:32:48 DEBUG : other/index.html: size = 12327 OK 2026/10/04 03:32:48 INFO : other/index.html: Copied (replaced existing) index_test.go:421: Error Trace: /home/rclone/go/src/github.com/rclone/rclone/fs/operations/index_test.go:421 Error: "\n\n\n\n\t\n\t\t/other\n\t\t\n\t\t\n\t\t\n\n\t\n\t\n\t\t\n\t\t\t\n\t\t\t\t\n\t\t\t\t\n\t\t\t\t\n\t\t\t\t\n\t\t\t\n\t\t\n\t\t
\n\t\t\t
Folder path
\n\t\t\t

/other/\n\t\t\t

\n\t\t
\n\t\t
\n\t\t\t
\n\t\t\t\t
\n\t\t\t\t\t\n\t\t\t\t\t\n\t\t\t\t\t10 total\n\t\t\t\t
\n\t\t\t\t
\n\t\t\t\t\t\n\t\t\t\t\t\t\n\t\t\t\t\t\t\t\n\t\t\t\t\t\t\t\t\n\t\t\t\t\t\t\t\t\n\t\t\t\t\t\t\t\t\n\t\t\t\t\t\t\t\n\t\t\t\t\t\t\n\t\t\t\t\t\t\n\t\t\t\t\t\t\t\n\t\t\t\t\t\t\t\n\t\t\t\t\t\t\t\t\n\t\t\t\t\t\t\t\t\n\t\t\t\t\t\t\t\t\n\t\t\t\t\t\t\t\n\t\t\t\t\t\t\t\n\t\t\t\t\t\t\t\t\n\t\t\t\t\t\t\t\t\n\t\t\t\t\t\t\t\t\n\t\t\t\t\t\t\t\n\t\t\t\t\t\t\t\n\t\t\t\t\t\t\n\t\t\t\t\t
\n\t\t\t\t\t\t\t\t\tName\n\t\t\t\t\t\t\t\t\t\n\t\t\t\t\t\t\t\tSizeModified
Go up——
notes.md\n\t\t\t\t\t\t\t\t5—
undeclared.txt\n\t\t\t\t\t\t\t\t5—
\n\t\t\t\t
\n\t\t\t
\n\t\t
\n\t\t\n\t\n\n" does not contain "undeclared0.txt" Test: TestIndexChanged 2026/10/04 03:32:49 INFO : Internxt root 'rclone-test-xivasil4fali': Partial index: listing 1 directories and walking 0 changed directories 2026/10/04 03:32:50 DEBUG : Internxt root 'rclone-test-xivasil4fali': Renamed existing file other/index.html to backup index.rclone-backup-dozixek6.html (UUID: 01a104f8-a950-72dc-b562-065945302b76) 2026/10/04 03:32:50 DEBUG : index.html: Unchanged skipping 2026/10/04 03:32:50 DEBUG : Internxt root 'rclone-test-xivasil4fali': Upload succeeded, deleting backup file index.rclone-backup-dozixek6.html (UUID: 01a104f8-a950-72dc-b562-065945302b76) 2026/10/04 03:32:50 DEBUG : Internxt root 'rclone-test-xivasil4fali': Successfully deleted backup file 2026/10/04 03:32:50 DEBUG : other/index.html: size = 12867 OK 2026/10/04 03:32:50 INFO : other/index.html: Copied (replaced existing) 2026/10/04 03:32:52 INFO : Internxt root 'rclone-test-xivasil4fali': Nothing changed so nothing to index 2026/10/04 03:32:52 INFO : Internxt root 'rclone-test-xivasil4fali': Root changed so doing a full index 2026/10/04 03:32:53 DEBUG : Internxt root 'rclone-test-xivasil4fali': Renamed existing file sub/index.html to backup index.rclone-backup-hehapix3.html (UUID: 01a104f8-96f4-7456-a016-92d59d246a6a) 2026/10/04 03:32:53 DEBUG : sub/new/index.html: Unchanged skipping 2026/10/04 03:32:53 DEBUG : index.html: Unchanged skipping 2026/10/04 03:32:53 DEBUG : other/index.html: Unchanged skipping 2026/10/04 03:32:53 DEBUG : sub/deep/index.html: Unchanged skipping 2026/10/04 03:32:54 DEBUG : Internxt root 'rclone-test-xivasil4fali': Upload succeeded, deleting backup file index.rclone-backup-hehapix3.html (UUID: 01a104f8-96f4-7456-a016-92d59d246a6a) 2026/10/04 03:32:54 DEBUG : Internxt root 'rclone-test-xivasil4fali': Successfully deleted backup file 2026/10/04 03:32:54 DEBUG : sub/index.html: size = 12813 OK 2026/10/04 03:32:54 INFO : sub/index.html: Copied (replaced existing) 2026/10/04 03:32:55 INFO : Internxt root 'rclone-test-xivasil4fali': Partial index would list 2 directories, more than 1, so doing a full index 2026/10/04 03:32:56 DEBUG : Internxt root 'rclone-test-xivasil4fali': Renamed existing file sub/index.html to backup index.rclone-backup-mukosuj9.html (UUID: 01a104f8-c25e-769e-832e-3395486a4da1) 2026/10/04 03:32:56 DEBUG : sub/new/index.html: Unchanged skipping 2026/10/04 03:32:57 DEBUG : sub/deep/index.html: Unchanged skipping 2026/10/04 03:32:57 DEBUG : index.html: Unchanged skipping 2026/10/04 03:32:57 DEBUG : other/index.html: Unchanged skipping 2026/10/04 03:32:57 DEBUG : Internxt root 'rclone-test-xivasil4fali': Upload succeeded, deleting backup file index.rclone-backup-mukosuj9.html (UUID: 01a104f8-c25e-769e-832e-3395486a4da1) 2026/10/04 03:32:57 DEBUG : Internxt root 'rclone-test-xivasil4fali': Successfully deleted backup file 2026/10/04 03:32:57 DEBUG : sub/index.html: size = 13071 OK 2026/10/04 03:32:57 INFO : sub/index.html: Copied (replaced existing) 2026/10/04 03:32:58 INFO : Internxt root 'rclone-test-xivasil4fali': Partial index: listing 1 directories and walking 1 changed directories 2026/10/04 03:32:59 DEBUG : Internxt root 'rclone-test-xivasil4fali': Renamed existing file sub/deep/index.html to backup index.rclone-backup-qosiyuz8.html (UUID: 01a104f8-83e3-7695-9ddb-46e9664387af) 2026/10/04 03:33:00 DEBUG : sub/index.html: Unchanged skipping 2026/10/04 03:33:00 DEBUG : index.html: Unchanged skipping 2026/10/04 03:33:00 DEBUG : sub/new/index.html: Unchanged skipping 2026/10/04 03:33:00 DEBUG : Internxt root 'rclone-test-xivasil4fali': Upload succeeded, deleting backup file index.rclone-backup-qosiyuz8.html (UUID: 01a104f8-83e3-7695-9ddb-46e9664387af) 2026/10/04 03:33:00 DEBUG : Internxt root 'rclone-test-xivasil4fali': Successfully deleted backup file 2026/10/04 03:33:00 DEBUG : sub/deep/index.html: size = 12604 OK 2026/10/04 03:33:00 INFO : sub/deep/index.html: Copied (replaced existing) 2026/10/04 03:33:02 INFO : Internxt root 'rclone-test-xivasil4fali': Partial index: listing 2 directories and walking 0 changed directories 2026/10/04 03:33:03 DEBUG : Internxt root 'rclone-test-xivasil4fali': Renamed existing file sub/index.html to backup index.rclone-backup-potoboy4.html (UUID: 01a104f8-d057-75df-b60b-adf320f0c2d7) 2026/10/04 03:33:03 DEBUG : index.html: Unchanged skipping 2026/10/04 03:33:04 DEBUG : Internxt root 'rclone-test-xivasil4fali': Upload succeeded, deleting backup file index.rclone-backup-potoboy4.html (UUID: 01a104f8-d057-75df-b60b-adf320f0c2d7) 2026/10/04 03:33:04 DEBUG : Internxt root 'rclone-test-xivasil4fali': Successfully deleted backup file 2026/10/04 03:33:04 DEBUG : sub/index.html: size = 13331 OK 2026/10/04 03:33:04 INFO : sub/index.html: Copied (replaced existing) --- FAIL: TestIndexChanged (43.03s) === RUN TestIndexChangedDelete run.go:198: Remote "Internxt root 'rclone-test-xivasil4fali'", Local "Local file system at /tmp/rclone1821118965", Modify Window "876000h0m0s" run.go:299: Retry Put of "sub/file2.txt" to Internxt root 'rclone-test-xivasil4fali': 1/10 (failed to create file metadata: create meta: Folder not found (status 404)) 2026/10/04 03:33:16 DEBUG : pacer: low level retry 1/10 (error check files existence: Not Found (status 404)) 2026/10/04 03:33:16 DEBUG : pacer: Rate limited, increasing sleep to 20ms 2026/10/04 03:33:16 DEBUG : pacer: low level retry 2/10 (error check files existence: Not Found (status 404)) 2026/10/04 03:33:16 DEBUG : pacer: Rate limited, increasing sleep to 40ms 2026/10/04 03:33:16 DEBUG : pacer: low level retry 3/10 (error check files existence: Not Found (status 404)) 2026/10/04 03:33:16 DEBUG : pacer: Rate limited, increasing sleep to 80ms 2026/10/04 03:33:16 DEBUG : pacer: low level retry 4/10 (error check files existence: Not Found (status 404)) 2026/10/04 03:33:16 DEBUG : pacer: Rate limited, increasing sleep to 160ms 2026/10/04 03:33:16 DEBUG : pacer: low level retry 5/10 (error check files existence: Not Found (status 404)) 2026/10/04 03:33:16 DEBUG : pacer: Rate limited, increasing sleep to 320ms 2026/10/04 03:33:16 DEBUG : pacer: low level retry 6/10 (error check files existence: Not Found (status 404)) 2026/10/04 03:33:16 DEBUG : pacer: Rate limited, increasing sleep to 640ms 2026/10/04 03:33:17 DEBUG : pacer: low level retry 7/10 (error check files existence: Not Found (status 404)) 2026/10/04 03:33:17 DEBUG : pacer: Rate limited, increasing sleep to 1.28s 2026/10/04 03:33:17 DEBUG : pacer: Reducing sleep to 960ms 2026/10/04 03:33:19 DEBUG : pacer: Reducing sleep to 720ms 2026/10/04 03:33:20 DEBUG : pacer: Reducing sleep to 540ms 2026/10/04 03:33:20 DEBUG : pacer: Reducing sleep to 405ms 2026/10/04 03:33:21 DEBUG : pacer: Reducing sleep to 303.75ms 2026/10/04 03:33:22 DEBUG : pacer: Reducing sleep to 227.8125ms 2026/10/04 03:33:22 DEBUG : pacer: Reducing sleep to 170.859375ms 2026/10/04 03:33:22 DEBUG : pacer: Reducing sleep to 128.144531ms 2026/10/04 03:33:22 DEBUG : pacer: Reducing sleep to 96.108398ms 2026/10/04 03:33:22 DEBUG : pacer: Reducing sleep to 72.081298ms 2026/10/04 03:33:23 DEBUG : pacer: Reducing sleep to 54.060973ms 2026/10/04 03:33:23 DEBUG : pacer: Reducing sleep to 40.545729ms 2026/10/04 03:33:23 DEBUG : pacer: Reducing sleep to 30.409296ms 2026/10/04 03:33:23 DEBUG : pacer: Reducing sleep to 22.806972ms 2026/10/04 03:33:23 DEBUG : pacer: Reducing sleep to 17.105229ms 2026/10/04 03:33:23 DEBUG : pacer: Reducing sleep to 12.828921ms 2026/10/04 03:33:23 DEBUG : index.html: size = 12147 OK 2026/10/04 03:33:23 INFO : index.html: Copied (new) 2026/10/04 03:33:23 DEBUG : pacer: Reducing sleep to 10ms 2026/10/04 03:33:23 DEBUG : sub/deep/index.html: size = 12087 OK 2026/10/04 03:33:23 INFO : sub/deep/index.html: Copied (new) 2026/10/04 03:33:23 DEBUG : sub/index.html: size = 12306 OK 2026/10/04 03:33:23 INFO : sub/index.html: Copied (new) 2026/10/04 03:33:24 INFO : Internxt root 'rclone-test-xivasil4fali': Partial index: listing 3 directories and walking 0 changed directories 2026/10/04 03:33:25 DEBUG : Internxt root 'rclone-test-xivasil4fali': Renamed existing file sub/deep/index.html to backup index.rclone-backup-lebarog4.html (UUID: 01a104f9-371b-717a-a782-733555432294) 2026/10/04 03:33:25 DEBUG : index.html: Unchanged skipping 2026/10/04 03:33:25 DEBUG : sub/index.html: Unchanged skipping 2026/10/04 03:33:25 DEBUG : Internxt root 'rclone-test-xivasil4fali': Upload succeeded, deleting backup file index.rclone-backup-lebarog4.html (UUID: 01a104f9-371b-717a-a782-733555432294) 2026/10/04 03:33:26 DEBUG : Internxt root 'rclone-test-xivasil4fali': Successfully deleted backup file 2026/10/04 03:33:26 DEBUG : sub/deep/index.html: size = 11829 OK 2026/10/04 03:33:26 INFO : sub/deep/index.html: Copied (replaced existing) --- PASS: TestIndexChangedDelete (18.52s) === RUN TestIndexChangedFiles run.go:198: Remote "Internxt root 'rclone-test-xivasil4fali'", Local "Local file system at /tmp/rclone1821118965", Modify Window "876000h0m0s" 2026/10/04 03:33:37 DEBUG : index.html: size = 12401 OK 2026/10/04 03:33:37 INFO : index.html: Copied (new) 2026/10/04 03:33:37 DEBUG : sub/deep/index.html: size = 12087 OK 2026/10/04 03:33:37 INFO : sub/deep/index.html: Copied (new) 2026/10/04 03:33:37 DEBUG : sub/index.html: size = 12306 OK 2026/10/04 03:33:37 INFO : sub/index.html: Copied (new) 2026/10/04 03:33:38 DEBUG : - odd/index.html: size = 12058 OK 2026/10/04 03:33:38 INFO : - odd/index.html: Copied (new) 2026/10/04 03:33:39 INFO : Internxt root 'rclone-test-xivasil4fali': Partial index: listing 2 directories and walking 0 changed directories 2026/10/04 03:33:40 DEBUG : Internxt root 'rclone-test-xivasil4fali': Renamed existing file - odd/index.html to backup index.rclone-backup-quvadil0.html (UUID: 01a104f9-70fd-73ec-8c97-50356f76fc07) 2026/10/04 03:33:40 DEBUG : index.html: Unchanged skipping 2026/10/04 03:33:41 DEBUG : Internxt root 'rclone-test-xivasil4fali': Upload succeeded, deleting backup file index.rclone-backup-quvadil0.html (UUID: 01a104f9-70fd-73ec-8c97-50356f76fc07) 2026/10/04 03:33:41 DEBUG : Internxt root 'rclone-test-xivasil4fali': Successfully deleted backup file 2026/10/04 03:33:41 DEBUG : - odd/index.html: size = 12316 OK 2026/10/04 03:33:41 INFO : - odd/index.html: Copied (replaced existing) 2026/10/04 03:33:42 INFO : Internxt root 'rclone-test-xivasil4fali': Partial index: listing 4 directories and walking 0 changed directories 2026/10/04 03:33:43 DEBUG : Internxt root 'rclone-test-xivasil4fali': Renamed existing file sub/index.html to backup index.rclone-backup-ruroval0.html (UUID: 01a104f9-6c96-76f0-9bca-9dbf454c04bc) 2026/10/04 03:33:43 DEBUG : sub/deep/index.html: Unchanged skipping 2026/10/04 03:33:43 DEBUG : index.html: Unchanged skipping 2026/10/04 03:33:43 DEBUG : - odd/index.html: Unchanged skipping 2026/10/04 03:33:44 DEBUG : Internxt root 'rclone-test-xivasil4fali': Upload succeeded, deleting backup file index.rclone-backup-ruroval0.html (UUID: 01a104f9-6c96-76f0-9bca-9dbf454c04bc) 2026/10/04 03:33:44 DEBUG : Internxt root 'rclone-test-xivasil4fali': Successfully deleted backup file 2026/10/04 03:33:44 DEBUG : sub/index.html: size = 12565 OK 2026/10/04 03:33:44 INFO : sub/index.html: Copied (replaced existing) --- PASS: TestIndexChangedFiles (19.04s) === RUN TestIndexChangedDirTime run.go:198: Remote "Internxt root 'rclone-test-xivasil4fali'", Local "Local file system at /tmp/rclone1821118965", Modify Window "876000h0m0s" 2026/10/04 03:33:55 DEBUG : sub/deep/index.json: size = 139 OK 2026/10/04 03:33:55 INFO : sub/deep/index.json: Copied (new) 2026/10/04 03:33:55 DEBUG : index.json: size = 371 OK 2026/10/04 03:33:55 INFO : index.json: Copied (new) 2026/10/04 03:33:55 DEBUG : sub/index.json: size = 255 OK 2026/10/04 03:33:55 INFO : sub/index.json: Copied (new) 2026/10/04 03:33:55 DEBUG : other/index.json: size = 140 OK 2026/10/04 03:33:55 INFO : other/index.json: Copied (new) 2026/10/04 03:33:56 INFO : Internxt root 'rclone-test-xivasil4fali': Partial index: listing 3 directories and walking 0 changed directories 2026/10/04 03:33:57 DEBUG : index.json: Unchanged skipping 2026/10/04 03:33:57 DEBUG : sub/index.json: Unchanged skipping 2026/10/04 03:33:57 DEBUG : sub/deep/index.json: Unchanged skipping index_test.go:540: Error Trace: /home/rclone/go/src/github.com/rclone/rclone/fs/operations/index_test.go:540 Error: Not equal: expected: 3 actual : 0 Test: TestIndexChangedDirTime --- FAIL: TestIndexChangedDirTime (12.47s) === RUN TestListDirSorted run.go:198: Remote "Internxt root 'rclone-test-xivasil4fali'", Local "Local file system at /tmp/rclone1821118965", Modify Window "876000h0m0s" run.go:299: Retry Put of "sub dir/sub sub dir/hello world3" to Internxt root 'rclone-test-xivasil4fali': 1/10 (failed to create file metadata: create meta: Folder not found (status 404)) 2026/10/04 03:34:13 DEBUG : a.txt: Excluded (Size Filter) 2026/10/04 03:34:13 DEBUG : a.txt: Excluded 2026/10/04 03:34:13 DEBUG : sub dir/hello world: Excluded (Size Filter) 2026/10/04 03:34:13 DEBUG : sub dir/hello world: Excluded 2026/10/04 03:34:13 DEBUG : sub dir/hello world2: Excluded (Size Filter) 2026/10/04 03:34:13 DEBUG : sub dir/hello world2: Excluded 2026/10/04 03:34:14 DEBUG : sub dir/ignore dir: Excluded 2026/10/04 03:34:14 DEBUG : sub dir/hello world: Excluded (Size Filter) 2026/10/04 03:34:14 DEBUG : sub dir/hello world: Excluded 2026/10/04 03:34:14 DEBUG : sub dir/hello world2: Excluded (Size Filter) 2026/10/04 03:34:14 DEBUG : sub dir/hello world2: Excluded 2026/10/04 03:34:14 DEBUG : sub dir/ignore dir: Excluded --- PASS: TestListDirSorted (16.86s) === RUN TestListDirSortedFn run.go:198: Remote "Internxt root 'rclone-test-xivasil4fali'", Local "Local file system at /tmp/rclone1821118965", Modify Window "876000h0m0s" 2026/10/04 03:34:21 DEBUG : pacer: low level retry 1/1 (error create folder: error code: 502 (status 502)) 2026/10/04 03:34:21 DEBUG : pacer: Rate limited, increasing sleep to 20ms run.go:299: Retry Put of "sub dir/hello world" to Internxt root 'rclone-test-xivasil4fali': 1/10 (failed to make directory: can't create folder, create folder: error code: 502 (status 502)) 2026/10/04 03:34:23 DEBUG : pacer: Reducing sleep to 15ms 2026/10/04 03:34:23 DEBUG : pacer: Reducing sleep to 11.25ms 2026/10/04 03:34:23 DEBUG : pacer: Reducing sleep to 10ms run.go:299: Retry Put of "sub dir/sub sub dir/hello world3" to Internxt root 'rclone-test-xivasil4fali': 1/10 (failed to create file metadata: create meta: Folder not found (status 404)) 2026/10/04 03:34:34 DEBUG : a.txt: Excluded (Size Filter) 2026/10/04 03:34:34 DEBUG : a.txt: Excluded 2026/10/04 03:34:35 DEBUG : sub dir/hello world: Excluded (Size Filter) 2026/10/04 03:34:35 DEBUG : sub dir/hello world: Excluded 2026/10/04 03:34:35 DEBUG : sub dir/hello world2: Excluded (Size Filter) 2026/10/04 03:34:35 DEBUG : sub dir/hello world2: Excluded 2026/10/04 03:34:35 DEBUG : sub dir/ignore dir: Excluded 2026/10/04 03:34:35 DEBUG : sub dir/hello world: Excluded (Size Filter) 2026/10/04 03:34:35 DEBUG : sub dir/hello world: Excluded 2026/10/04 03:34:35 DEBUG : sub dir/hello world2: Excluded (Size Filter) 2026/10/04 03:34:35 DEBUG : sub dir/hello world2: Excluded 2026/10/04 03:34:36 DEBUG : sub dir/ignore dir: Excluded --- PASS: TestListDirSortedFn (20.74s) === RUN TestListJSON run.go:198: Remote "Internxt root 'rclone-test-xivasil4fali'", Local "Local file system at /tmp/rclone1821118965", Modify Window "876000h0m0s" === RUN TestListJSON/Default === RUN TestListJSON/FilesOnly === RUN TestListJSON/DirsOnly === RUN TestListJSON/Recurse === RUN TestListJSON/SubDir === RUN TestListJSON/NoModTime === RUN TestListJSON/NoMimeType === RUN TestListJSON/ShowHash === RUN TestListJSON/HashTypes 2026/10/04 03:34:46 ERROR : file1: Failed to read hash: hash type not supported === RUN TestListJSON/Metadata --- PASS: TestListJSON (9.69s) --- PASS: TestListJSON/Default (0.26s) --- PASS: TestListJSON/FilesOnly (0.23s) --- PASS: TestListJSON/DirsOnly (0.23s) --- PASS: TestListJSON/Recurse (0.51s) --- PASS: TestListJSON/SubDir (0.26s) --- PASS: TestListJSON/NoModTime (0.23s) --- PASS: TestListJSON/NoMimeType (0.22s) --- PASS: TestListJSON/ShowHash (0.22s) --- PASS: TestListJSON/HashTypes (0.29s) --- PASS: TestListJSON/Metadata (0.23s) === RUN TestStatJSON run.go:198: Remote "Internxt root 'rclone-test-xivasil4fali'", Local "Local file system at /tmp/rclone1821118965", Modify Window "876000h0m0s" === RUN TestStatJSON/Root === RUN TestStatJSON/RootFilesOnly === RUN TestStatJSON/RootDirsOnly === RUN TestStatJSON/Dir === RUN TestStatJSON/DirWithTrailingSlash === RUN TestStatJSON/File === RUN TestStatJSON/NotFound === RUN TestStatJSON/DirFilesOnly === RUN TestStatJSON/FileFilesOnly === RUN TestStatJSON/NotFoundFilesOnly === RUN TestStatJSON/DirDirsOnly === RUN TestStatJSON/FileDirsOnly === RUN TestStatJSON/NotFoundDirsOnly === RUN TestStatJSON/RootNotFound 2026/10/04 03:34:54 DEBUG : Creating backend with remote "TestInternxt:rclone-test-xivasil4fali/notfound" 2026/10/04 03:34:55 DEBUG : User info: rootFolderId=2661cf64-e104-478b-b737-48c3ac8984d2, bucket=697358bf16ceabcf39af85f2 2026/10/04 03:34:55 DEBUG : Saving config "token" in section "TestInternxt" of the config file 2026/10/04 03:34:55 DEBUG : TestInternxt: Saved new token in config file 2026/10/04 03:34:55 DEBUG : Internxt root 'rclone-test-xivasil4fali/notfound': Persisted rotated token from user info, expiry: 2026-10-11 03:34:55 +0000 UTC --- PASS: TestStatJSON (7.53s) --- PASS: TestStatJSON/Root (0.23s) --- PASS: TestStatJSON/RootFilesOnly (0.00s) --- PASS: TestStatJSON/RootDirsOnly (0.29s) --- PASS: TestStatJSON/Dir (0.39s) --- PASS: TestStatJSON/DirWithTrailingSlash (0.22s) --- PASS: TestStatJSON/File (0.27s) --- PASS: TestStatJSON/NotFound (0.33s) --- PASS: TestStatJSON/DirFilesOnly (0.13s) --- PASS: TestStatJSON/FileFilesOnly (0.22s) --- PASS: TestStatJSON/NotFoundFilesOnly (0.11s) --- PASS: TestStatJSON/DirDirsOnly (0.21s) --- PASS: TestStatJSON/FileDirsOnly (0.25s) --- PASS: TestStatJSON/NotFoundDirsOnly (0.23s) --- PASS: TestStatJSON/RootNotFound (1.10s) === RUN TestStatJSONMemory 2026/10/04 03:34:57 DEBUG : Creating backend with remote ":memory:" 2026/10/04 03:34:57 DEBUG : Memory root '': File to upload is small (5 bytes), uploading instead of streaming 2026/10/04 03:34:57 DEBUG : sub/file1: size = 5 OK 2026/10/04 03:34:57 DEBUG : sub/file1: md5 = 5d41402abc4b2a76b9719d911017c592 OK 2026/10/04 03:34:57 DEBUG : sub/file1: Size and md5 of src and dst objects identical === RUN TestStatJSONMemory/Dir === RUN TestStatJSONMemory/DirWithTrailingSlash === RUN TestStatJSONMemory/File === RUN TestStatJSONMemory/NotFound --- PASS: TestStatJSONMemory (0.00s) --- PASS: TestStatJSONMemory/Dir (0.00s) --- PASS: TestStatJSONMemory/DirWithTrailingSlash (0.00s) --- PASS: TestStatJSONMemory/File (0.00s) --- PASS: TestStatJSONMemory/NotFound (0.00s) === RUN TestStatJSONConfinement --- PASS: TestStatJSONConfinement (0.00s) === RUN TestMkdir run.go:198: Remote "Internxt root 'rclone-test-xivasil4fali'", Local "Local file system at /tmp/rclone1821118965", Modify Window "876000h0m0s" 2026/10/04 03:34:57 INFO : Internxt root 'rclone-test-xivasil4fali': Making directory 2026/10/04 03:34:58 INFO : Internxt root 'rclone-test-xivasil4fali': Making directory --- PASS: TestMkdir (1.59s) === RUN TestLsd run.go:198: Remote "Internxt root 'rclone-test-xivasil4fali'", Local "Local file system at /tmp/rclone1821118965", Modify Window "876000h0m0s" --- PASS: TestLsd (5.29s) === RUN TestLs run.go:198: Remote "Internxt root 'rclone-test-xivasil4fali'", Local "Local file system at /tmp/rclone1821118965", Modify Window "876000h0m0s" --- PASS: TestLs (3.23s) === RUN TestLsWithFilesFrom run.go:198: Remote "Internxt root 'rclone-test-xivasil4fali'", Local "Local file system at /tmp/rclone1821118965", Modify Window "876000h0m0s" 2026/10/04 03:35:07 DEBUG : Internxt root 'rclone-test-xivasil4fali': Ignoring stale lookup of "potato2" (UUID: 01a104fa-c32f-774b-adb5-6ef01f21a42b) which was moved or deleted 2026/10/04 03:35:09 DEBUG : empty space: Excluded (FilesFrom Filter) 2026/10/04 03:35:09 DEBUG : empty space: Excluded --- PASS: TestLsWithFilesFrom (3.23s) === RUN TestLsLong run.go:198: Remote "Internxt root 'rclone-test-xivasil4fali'", Local "Local file system at /tmp/rclone1821118965", Modify Window "876000h0m0s" --- PASS: TestLsLong (4.45s) === RUN TestHashSums run.go:198: Remote "Internxt root 'rclone-test-xivasil4fali'", Local "Local file system at /tmp/rclone1821118965", Modify Window "876000h0m0s" --- PASS: TestHashSums (2.46s) === RUN TestHashSumsWithErrors 2026/10/04 03:35:17 DEBUG : Creating backend with remote ":memory:" 2026/10/04 03:35:17 ERROR : file1: hash unsupported: hash type not supported 2026/10/04 03:35:17 ERROR : sub/file1: hash unsupported: hash type not supported 2026/10/04 03:35:17 ERROR : sub/file1: hash unsupported: hash type not supported --- PASS: TestHashSumsWithErrors (0.00s) === RUN TestHashStream 2026/10/04 03:35:17 DEBUG : Creating md5 hash of 0 bytes read from input stream 2026/10/04 03:35:17 DEBUG : Creating md5 hash of 0 bytes read from input stream 2026/10/04 03:35:17 DEBUG : Creating sha1 hash of 0 bytes read from input stream 2026/10/04 03:35:17 DEBUG : Creating sha1 hash of 0 bytes read from input stream 2026/10/04 03:35:17 DEBUG : Creating md5 hash of 12 bytes read from input stream 2026/10/04 03:35:17 DEBUG : Creating md5 hash of 12 bytes read from input stream 2026/10/04 03:35:17 DEBUG : Creating sha1 hash of 12 bytes read from input stream 2026/10/04 03:35:17 DEBUG : Creating sha1 hash of 12 bytes read from input stream --- PASS: TestHashStream (0.00s) === RUN TestSuffixName --- PASS: TestSuffixName (0.00s) === RUN TestCount run.go:198: Remote "Internxt root 'rclone-test-xivasil4fali'", Local "Local file system at /tmp/rclone1821118965", Modify Window "876000h0m0s" --- PASS: TestCount (5.03s) === RUN TestDelete run.go:198: Remote "Internxt root 'rclone-test-xivasil4fali'", Local "Local file system at /tmp/rclone1821118965", Modify Window "876000h0m0s" 2026/10/04 03:35:25 DEBUG : Waiting for deletions to finish 2026/10/04 03:35:25 DEBUG : large: Excluded (Size Filter) 2026/10/04 03:35:25 DEBUG : large: Excluded 2026/10/04 03:35:25 INFO : small: Deleted 2026/10/04 03:35:25 INFO : medium: Deleted --- PASS: TestDelete (4.03s) === RUN TestDeleteFatalError run.go:198: Remote "Internxt root 'rclone-test-xivasil4fali'", Local "Local file system at /tmp/rclone1821118965", Modify Window "876000h0m0s" 2026/10/04 03:35:43 DEBUG : Waiting for deletions to finish 2026/10/04 03:35:43 ERROR : file1: Got fatal error on delete: --max-delete threshold reached 2026/10/04 03:35:43 ERROR : file10: Got fatal error on delete: --max-delete threshold reached 2026/10/04 03:35:43 ERROR : file11: Got fatal error on delete: --max-delete threshold reached 2026/10/04 03:35:43 ERROR : file12: Got fatal error on delete: --max-delete threshold reached 2026/10/04 03:35:43 ERROR : file13: Got fatal error on delete: --max-delete threshold reached 2026/10/04 03:35:43 ERROR : file14: Got fatal error on delete: --max-delete threshold reached 2026/10/04 03:35:43 ERROR : file15: Got fatal error on delete: --max-delete threshold reached 2026/10/04 03:35:43 ERROR : file16: Got fatal error on delete: --max-delete threshold reached 2026/10/04 03:35:43 ERROR : file17: Got fatal error on delete: --max-delete threshold reached 2026/10/04 03:35:43 ERROR : file18: Got fatal error on delete: --max-delete threshold reached 2026/10/04 03:35:43 ERROR : file2: Got fatal error on delete: --max-delete threshold reached 2026/10/04 03:35:43 ERROR : file0: Got fatal error on delete: --max-delete threshold reached 2026/10/04 03:35:43 ERROR : file3: Got fatal error on delete: --max-delete threshold reached 2026/10/04 03:35:43 ERROR : file5: Got fatal error on delete: --max-delete threshold reached 2026/10/04 03:35:43 ERROR : file6: Got fatal error on delete: --max-delete threshold reached 2026/10/04 03:35:43 ERROR : file7: Got fatal error on delete: --max-delete threshold reached 2026/10/04 03:35:43 ERROR : file4: Got fatal error on delete: --max-delete threshold reached 2026/10/04 03:35:43 ERROR : file9: Got fatal error on delete: --max-delete threshold reached 2026/10/04 03:35:43 ERROR : file8: Got fatal error on delete: --max-delete threshold reached --- PASS: TestDeleteFatalError (21.80s) === RUN TestMaxDelete run.go:198: Remote "Internxt root 'rclone-test-xivasil4fali'", Local "Local file system at /tmp/rclone1821118965", Modify Window "876000h0m0s" fstest.go:299: Sleeping for 1s for list eventual consistency: 1/5 fstest.go:302: Flushing the directory cache fstest.go:293: Sleeping for 6s just to make sure 2026/10/04 03:35:58 DEBUG : Waiting for deletions to finish 2026/10/04 03:35:59 ERROR : small: Got fatal error on delete: --max-delete threshold reached 2026/10/04 03:35:59 INFO : large: Deleted 2026/10/04 03:35:59 INFO : medium: Deleted --- PASS: TestMaxDelete (11.96s) === RUN TestMaxDeleteSizeLargeFile run.go:198: Remote "Internxt root 'rclone-test-xivasil4fali'", Local "Local file system at /tmp/rclone1821118965", Modify Window "876000h0m0s" 2026/10/04 03:36:03 DEBUG : Waiting for deletions to finish 2026/10/04 03:36:03 ERROR : large: Got fatal error on delete: --max-delete-size threshold reached 2026/10/04 03:36:03 INFO : medium: Deleted 2026/10/04 03:36:03 INFO : small: Deleted --- PASS: TestMaxDeleteSizeLargeFile (4.51s) === RUN TestMaxDeleteSize run.go:198: Remote "Internxt root 'rclone-test-xivasil4fali'", Local "Local file system at /tmp/rclone1821118965", Modify Window "876000h0m0s" 2026/10/04 03:36:07 DEBUG : Waiting for deletions to finish 2026/10/04 03:36:07 ERROR : small: Got fatal error on delete: --max-delete-size threshold reached 2026/10/04 03:36:08 INFO : medium: Deleted 2026/10/04 03:36:08 INFO : large: Deleted --- PASS: TestMaxDeleteSize (5.43s) === RUN TestReadFile run.go:198: Remote "Internxt root 'rclone-test-xivasil4fali'", Local "Local file system at /tmp/rclone1821118965", Modify Window "876000h0m0s" --- PASS: TestReadFile (3.33s) === RUN TestRetry 2026/10/04 03:36:13 DEBUG : Received error: Wrapped EOF is retriable: EOF - low level retry 1/5 2026/10/04 03:36:13 DEBUG : Received error: Wrapped EOF is retriable: EOF - low level retry 2/5 2026/10/04 03:36:13 DEBUG : Sleeping for 10ms (as indicated by the server) to obey Retry-After error: BANG: trying again in 10ms 2026/10/04 03:36:13 DEBUG : Sleeping for 10ms (as indicated by the server) to obey Retry-After error: BANG: trying again in 10ms 2026/10/04 03:36:13 DEBUG : Sleeping for 10ms (as indicated by the server) to obey Retry-After error: BANG: trying again in 10ms 2026/10/04 03:36:13 DEBUG : Sleeping for 10ms (as indicated by the server) to obey Retry-After error: BANG: trying again in 10ms --- PASS: TestRetry (0.04s) === RUN TestRetryAfterContextCancel 2026/10/04 03:36:13 DEBUG : Sleeping for 1h0m0s (as indicated by the server) to obey Retry-After error: BANG: trying again in 1h0m0s --- PASS: TestRetryAfterContextCancel (0.00s) === RUN TestRetryAfterLastTry --- PASS: TestRetryAfterLastTry (0.00s) === RUN TestCat run.go:198: Remote "Internxt root 'rclone-test-xivasil4fali'", Local "Local file system at /tmp/rclone1821118965", Modify Window "876000h0m0s" --- PASS: TestCat (10.58s) === RUN TestPurge 2026/10/04 03:36:24 DEBUG : Creating backend with remote "TestInternxt:rclone-test-nugokec3bucu" 2026/10/04 03:36:24 DEBUG : Using config file from "/home/rclone/.rclone.conf" 2026/10/04 03:36:24 DEBUG : User info: rootFolderId=2661cf64-e104-478b-b737-48c3ac8984d2, bucket=697358bf16ceabcf39af85f2 2026/10/04 03:36:24 DEBUG : Saving config "token" in section "TestInternxt" of the config file 2026/10/04 03:36:24 DEBUG : TestInternxt: Saved new token in config file 2026/10/04 03:36:24 DEBUG : Internxt root 'rclone-test-nugokec3bucu': Persisted rotated token from user info, expiry: 2026-10-11 03:36:24 +0000 UTC 2026/10/04 03:36:25 DEBUG : Creating backend with remote "/tmp/rclone1930362966" run.go:198: Remote "Internxt root 'rclone-test-nugokec3bucu'", Local "Local file system at /tmp/rclone1930362966", Modify Window "876000h0m0s" FileLimitsResponse { "maxUploadFileSize": 107374182400, "versioning": { "enabled": true, "maxFileSize": 20971520, "retentionDays": 30, "maxVersions": 20 } } 2026/10/04 03:36:28 INFO : A2: Making directory 2026/10/04 03:36:28 INFO : A1/B2: Making directory 2026/10/04 03:36:29 INFO : A1/B2/C2: Making directory 2026/10/04 03:36:29 INFO : A1/B1/C3: Making directory 2026/10/04 03:36:30 INFO : A3: Making directory 2026/10/04 03:36:30 INFO : A3/B3: Making directory 2026/10/04 03:36:31 INFO : A3/B3/C4: Making directory fstest.go:299: Sleeping for 1s for list eventual consistency: 1/5 fstest.go:302: Flushing the directory cache fstest.go:293: Sleeping for 6s just to make sure 2026/10/04 03:36:44 DEBUG : Waiting for deletions to finish 2026/10/04 03:36:45 INFO : A1/B1/C1/one: Deleted 2026/10/04 03:36:46 DEBUG : removing 2 level 3 directories 2026/10/04 03:36:46 INFO : A1/B1/C3: Removing directory 2026/10/04 03:36:46 INFO : A1/B1/C1: Removing directory 2026/10/04 03:36:46 DEBUG : removing 1 level 2 directories 2026/10/04 03:36:46 INFO : A1/B1: Removing directory 2026/10/04 03:36:48 DEBUG : Waiting for deletions to finish 2026/10/04 03:36:49 INFO : A1/two: Deleted 2026/10/04 03:36:51 DEBUG : removing 2 level 3 directories 2026/10/04 03:36:51 INFO : A3/B3/C4: Removing directory 2026/10/04 03:36:51 INFO : A1/B2/C2: Removing directory 2026/10/04 03:36:51 DEBUG : removing 2 level 2 directories 2026/10/04 03:36:51 INFO : A3/B3: Removing directory 2026/10/04 03:36:51 INFO : A1/B2: Removing directory 2026/10/04 03:36:51 DEBUG : removing 3 level 1 directories 2026/10/04 03:36:51 INFO : A3: Removing directory 2026/10/04 03:36:51 INFO : A1: Removing directory 2026/10/04 03:36:51 INFO : A2: Removing directory 2026/10/04 03:36:52 DEBUG : removing 1 level 0 directories 2026/10/04 03:36:52 INFO : Internxt root 'rclone-test-nugokec3bucu': Removing directory 2026/10/04 03:36:52 ERROR : error listing: directory not found 2026/10/04 03:36:52 ERROR : error listing: directory not found 2026/10/04 03:36:52 DEBUG : Internxt root 'rclone-test-nugokec3bucu': Purge dir "" 2026/10/04 03:36:53 NOTICE: purge failed to rmdir "": directory not found 2026/10/04 03:36:53 NOTICE: purge failed: directory not found --- PASS: TestPurge (28.50s) === RUN TestRmdirsNoLeaveRoot run.go:198: Remote "Internxt root 'rclone-test-xivasil4fali'", Local "Local file system at /tmp/rclone1821118965", Modify Window "876000h0m0s" 2026/10/04 03:36:55 INFO : A2: Making directory 2026/10/04 03:36:55 INFO : A1/B2: Making directory 2026/10/04 03:36:56 INFO : A1/B2/C2: Making directory 2026/10/04 03:36:56 INFO : A1/B1/C3: Making directory 2026/10/04 03:36:57 INFO : A3: Making directory 2026/10/04 03:36:57 INFO : A3/B3: Making directory 2026/10/04 03:36:59 INFO : A3/B3/C4: Making directory 2026/10/04 03:37:02 DEBUG : removing 1 level 3 directories 2026/10/04 03:37:02 INFO : A3/B3/C4: Removing directory 2026/10/04 03:37:06 DEBUG : removing 2 level 3 directories 2026/10/04 03:37:06 INFO : A1/B2/C2: Removing directory 2026/10/04 03:37:06 INFO : A1/B1/C3: Removing directory 2026/10/04 03:37:07 DEBUG : removing 2 level 2 directories 2026/10/04 03:37:07 INFO : A3/B3: Removing directory 2026/10/04 03:37:07 INFO : A1/B2: Removing directory 2026/10/04 03:37:07 DEBUG : removing 2 level 1 directories 2026/10/04 03:37:07 INFO : A3: Removing directory 2026/10/04 03:37:07 INFO : A2: Removing directory 2026/10/04 03:37:16 DEBUG : removing 1 level 3 directories 2026/10/04 03:37:16 INFO : A1/B1/C1: Removing directory 2026/10/04 03:37:18 DEBUG : removing 1 level 2 directories 2026/10/04 03:37:18 INFO : A1/B1: Removing directory 2026/10/04 03:37:19 DEBUG : removing 1 level 1 directories 2026/10/04 03:37:19 INFO : A1: Removing directory 2026/10/04 03:37:20 DEBUG : removing 1 level 0 directories 2026/10/04 03:37:20 INFO : Internxt root 'rclone-test-xivasil4fali': Removing directory 2026/10/04 03:37:20 ERROR : error listing: directory not found 2026/10/04 03:37:20 ERROR : error listing: directory not found --- PASS: TestRmdirsNoLeaveRoot (27.56s) === RUN TestRmdirsLeaveRoot run.go:198: Remote "Internxt root 'rclone-test-xivasil4fali'", Local "Local file system at /tmp/rclone1821118965", Modify Window "876000h0m0s" 2026/10/04 03:37:20 INFO : A1: Making directory 2026/10/04 03:37:21 INFO : A1/B1: Making directory 2026/10/04 03:37:22 INFO : A1/B1/C1: Making directory 2026/10/04 03:37:26 DEBUG : removing 1 level 3 directories 2026/10/04 03:37:26 INFO : A1/B1/C1: Removing directory 2026/10/04 03:37:26 DEBUG : removing 1 level 2 directories 2026/10/04 03:37:26 INFO : A1/B1: Removing directory --- PASS: TestRmdirsLeaveRoot (9.71s) === RUN TestRmdirsWithFilter run.go:198: Remote "Internxt root 'rclone-test-xivasil4fali'", Local "Local file system at /tmp/rclone1821118965", Modify Window "876000h0m0s" 2026/10/04 03:37:30 INFO : A1: Making directory 2026/10/04 03:37:30 INFO : A1/B1: Making directory 2026/10/04 03:37:31 INFO : A1/B1/C1: Making directory 2026/10/04 03:37:34 DEBUG : removing 1 level 3 directories 2026/10/04 03:37:34 INFO : A1/B1/C1: Removing directory 2026/10/04 03:37:35 DEBUG : removing 1 level 2 directories 2026/10/04 03:37:35 INFO : A1/B1: Removing directory --- PASS: TestRmdirsWithFilter (6.62s) === RUN TestCopyURL run.go:198: Remote "Internxt root 'rclone-test-xivasil4fali'", Local "Local file system at /tmp/rclone1821118965", Modify Window "876000h0m0s" 2026/10/04 03:37:37 DEBUG : file1: size = 14 OK fstest.go:299: Sleeping for 1s for list eventual consistency: 1/5 fstest.go:302: Flushing the directory cache fstest.go:293: Sleeping for 6s just to make sure 2026/10/04 03:37:45 DEBUG : filename.txt: File name found in url 2026/10/04 03:37:46 DEBUG : filename.txt: size = 14 OK 2026/10/04 03:37:46 DEBUG : headerfilename.txt: filename found in Content-Disposition header. 2026/10/04 03:37:46 DEBUG : headerfilename.txt: size = 14 OK 2026/10/04 03:37:47 DEBUG : file2: size = 14 OK --- PASS: TestCopyURL (12.35s) === RUN TestCopyURLDownloadHeaders run.go:198: Remote "Internxt root 'rclone-test-xivasil4fali'", Local "Local file system at /tmp/rclone1821118965", Modify Window "876000h0m0s" 2026/10/04 03:37:49 DEBUG : file1: size = 14 OK --- PASS: TestCopyURLDownloadHeaders (1.32s) === RUN TestCopyURLToWriter --- PASS: TestCopyURLToWriter (0.00s) === RUN TestMoveFile run.go:198: Remote "Internxt root 'rclone-test-xivasil4fali'", Local "Local file system at /tmp/rclone1821118965", Modify Window "876000h0m0s" 2026/10/04 03:37:50 DEBUG : file1: Need to transfer - File not found at Destination 2026/10/04 03:37:51 DEBUG : sub/file2: size = 14 OK 2026/10/04 03:37:51 INFO : file1: Copied (new) to: sub/file2 2026/10/04 03:37:51 INFO : file1: Deleted 2026/10/04 03:37:52 DEBUG : sub/file2: size = 14 OK 2026/10/04 03:37:52 DEBUG : file1: Sizes identical 2026/10/04 03:37:52 DEBUG : file1: Unchanged skipping 2026/10/04 03:37:52 INFO : file1: Deleted 2026/10/04 03:37:53 DEBUG : Internxt root 'rclone-test-xivasil4fali': don't need to copy/move sub/file2, it is already at target location --- PASS: TestMoveFile (4.42s) === RUN TestMoveFileWithIgnoreExisting run.go:198: Remote "Internxt root 'rclone-test-xivasil4fali'", Local "Local file system at /tmp/rclone1821118965", Modify Window "876000h0m0s" 2026/10/04 03:37:55 DEBUG : file1: Need to transfer - File not found at Destination 2026/10/04 03:37:55 DEBUG : file1: size = 14 OK 2026/10/04 03:37:55 INFO : file1: Copied (new) 2026/10/04 03:37:55 INFO : file1: Deleted 2026/10/04 03:37:56 DEBUG : file1: Destination exists, skipping 2026/10/04 03:37:56 DEBUG : file1: Not removing source file as destination file exists and --ignore-existing is set --- PASS: TestMoveFileWithIgnoreExisting (2.10s) === RUN TestMoveFileImmutable run.go:198: Remote "Internxt root 'rclone-test-xivasil4fali'", Local "Local file system at /tmp/rclone1821118965", Modify Window "876000h0m0s" 2026/10/04 03:37:58 DEBUG : existing: size = 8 (Local file system at /tmp/rclone1821118965) 2026/10/04 03:37:58 DEBUG : existing: size = 6 (Internxt root 'rclone-test-xivasil4fali') 2026/10/04 03:37:58 DEBUG : existing: Sizes differ 2026/10/04 03:37:58 ERROR : existing: Source and destination exist but do not match: immutable file modified --- PASS: TestMoveFileImmutable (2.56s) === RUN TestCaseInsensitiveMoveFile run.go:198: Remote "Internxt root 'rclone-test-xivasil4fali'", Local "Local file system at /tmp/rclone1821118965", Modify Window "876000h0m0s" --- PASS: TestCaseInsensitiveMoveFile (0.40s) === RUN TestCaseInsensitiveMoveFileDryRun run.go:198: Remote "Internxt root 'rclone-test-xivasil4fali'", Local "Local file system at /tmp/rclone1821118965", Modify Window "876000h0m0s" --- PASS: TestCaseInsensitiveMoveFileDryRun (0.47s) === RUN TestMoveFileBackupDir run.go:198: Remote "Internxt root 'rclone-test-xivasil4fali'", Local "Local file system at /tmp/rclone1821118965", Modify Window "876000h0m0s" 2026/10/04 03:38:02 DEBUG : Creating backend with remote "TestInternxt:rclone-test-xivasil4fali/backup" 2026/10/04 03:38:02 DEBUG : User info: rootFolderId=2661cf64-e104-478b-b737-48c3ac8984d2, bucket=697358bf16ceabcf39af85f2 2026/10/04 03:38:02 DEBUG : Saving config "token" in section "TestInternxt" of the config file 2026/10/04 03:38:02 DEBUG : TestInternxt: Saved new token in config file 2026/10/04 03:38:02 DEBUG : Internxt root 'rclone-test-xivasil4fali/backup': Persisted rotated token from user info, expiry: 2026-10-11 03:38:02 +0000 UTC 2026/10/04 03:38:03 DEBUG : dst/file1: size = 14 (Local file system at /tmp/rclone1821118965) 2026/10/04 03:38:03 DEBUG : dst/file1: size = 18 (Internxt root 'rclone-test-xivasil4fali') 2026/10/04 03:38:03 DEBUG : dst/file1: Sizes differ 2026/10/04 03:38:04 INFO : dst/file1: Moved (server-side) 2026/10/04 03:38:04 DEBUG : Internxt root 'rclone-test-xivasil4fali': Ignoring stale lookup of "file1" (UUID: 01a104fd-73a8-74a1-8cd0-83f9c55e0208) which was moved or deleted 2026/10/04 03:38:05 DEBUG : dst/file1: size = 14 OK 2026/10/04 03:38:05 INFO : dst/file1: Copied (new) 2026/10/04 03:38:05 INFO : dst/file1: Deleted --- PASS: TestMoveFileBackupDir (8.49s) === RUN TestSameConfig --- PASS: TestSameConfig (0.00s) === RUN TestSame --- PASS: TestSame (0.00s) === RUN TestOverlappingFilterCheckWithoutFilter --- PASS: TestOverlappingFilterCheckWithoutFilter (0.00s) === RUN TestOverlappingFilterCheckWithFilter --- PASS: TestOverlappingFilterCheckWithFilter (0.00s) === RUN TestListFormat --- PASS: TestListFormat (0.00s) === RUN TestDirMoveMoveError run.go:198: Remote "Internxt root 'rclone-test-xivasil4fali'", Local "Local file system at /tmp/rclone1821118965", Modify Window "876000h0m0s" operations_test.go:1490: Skipping test on non local remote --- SKIP: TestDirMoveMoveError (29.30s) === RUN TestDirMoveContext run.go:198: Remote "Internxt root 'rclone-test-xivasil4fali'", Local "Local file system at /tmp/rclone1821118965", Modify Window "876000h0m0s" operations_test.go:1490: Skipping test on non local remote --- SKIP: TestDirMoveContext (3.35s) === RUN TestDirMove run.go:198: Remote "Internxt root 'rclone-test-xivasil4fali'", Local "Local file system at /tmp/rclone1821118965", Modify Window "876000h0m0s" 2026/10/04 03:38:46 INFO : A1/B2: Making directory 2026/10/04 03:38:46 INFO : A1/B1/C3: Making directory fstest.go:299: Sleeping for 1s for list eventual consistency: 1/5 fstest.go:302: Flushing the directory cache fstest.go:293: Sleeping for 6s just to make sure 2026/10/04 03:39:03 INFO : A2/B1/C1/four: Moved (server-side) to: A3/B1/C1/four 2026/10/04 03:39:03 INFO : A2/one: Moved (server-side) to: A3/one 2026/10/04 03:39:03 INFO : A2/B1/three: Moved (server-side) to: A3/B1/three 2026/10/04 03:39:03 INFO : A2/two: Moved (server-side) to: A3/two 2026/10/04 03:39:03 INFO : A2/B1/C2/five: Moved (server-side) to: A3/B1/C2/five 2026/10/04 03:39:06 INFO : Internxt root 'rclone-test-xivasil4fali': Can't DirMove - falling back to file moves: can't move directory - incompatible remotes 2026/10/04 03:39:10 INFO : A3/one: Moved (server-side) to: A4/one 2026/10/04 03:39:10 INFO : A3/B1/three: Moved (server-side) to: A4/B1/three 2026/10/04 03:39:10 INFO : A3/B1/C2/five: Moved (server-side) to: A4/B1/C2/five 2026/10/04 03:39:10 INFO : A3/two: Moved (server-side) to: A4/two 2026/10/04 03:39:10 INFO : A3/B1/C1/four: Moved (server-side) to: A4/B1/C1/four --- PASS: TestDirMove (36.87s) === RUN TestGetFsInfo run.go:198: Remote "Internxt root 'rclone-test-xivasil4fali'", Local "Local file system at /tmp/rclone1821118965", Modify Window "876000h0m0s" --- PASS: TestGetFsInfo (0.39s) === RUN TestRcat === RUN TestRcat/withChecksum=false,ignoreChecksum=false run.go:198: Remote "Internxt root 'rclone-test-xivasil4fali'", Local "Local file system at /tmp/rclone1821118965", Modify Window "876000h0m0s" 2026/10/04 03:39:19 DEBUG : Internxt root 'rclone-test-xivasil4fali': File to upload is small (34 bytes), uploading instead of streaming 2026/10/04 03:39:19 DEBUG : no_checksum_small_file_from_pipe: size = 34 OK 2026/10/04 03:39:19 NOTICE: Internxt root 'rclone-test-xivasil4fali': --checksum is in use but the source and destination have no hashes in common; falling back to --size-only 2026/10/04 03:39:19 DEBUG : no_checksum_small_file_from_pipe: Size of src and dst objects identical 2026/10/04 03:39:19 DEBUG : Internxt root 'rclone-test-xivasil4fali': Target remote doesn't support streaming uploads, creating temporary local FS to spool file 2026/10/04 03:39:20 DEBUG : no_checksum_big_file_from_pipe: size = 102401 OK 2026/10/04 03:39:20 DEBUG : no_checksum_big_file_from_pipe: Size of src and dst objects identical === RUN TestRcat/withChecksum=true,ignoreChecksum=false run.go:198: Remote "Internxt root 'rclone-test-xivasil4fali'", Local "Local file system at /tmp/rclone1821118965", Modify Window "876000h0m0s" 2026/10/04 03:39:22 DEBUG : Internxt root 'rclone-test-xivasil4fali': File to upload is small (34 bytes), uploading instead of streaming 2026/10/04 03:39:22 DEBUG : with_checksum_small_file_from_pipe: size = 34 OK 2026/10/04 03:39:22 DEBUG : with_checksum_small_file_from_pipe: Size of src and dst objects identical 2026/10/04 03:39:22 DEBUG : Internxt root 'rclone-test-xivasil4fali': Target remote doesn't support streaming uploads, creating temporary local FS to spool file 2026/10/04 03:39:23 DEBUG : with_checksum_big_file_from_pipe: size = 102401 OK 2026/10/04 03:39:23 DEBUG : with_checksum_big_file_from_pipe: Size of src and dst objects identical === RUN TestRcat/withChecksum=false,ignoreChecksum=true run.go:198: Remote "Internxt root 'rclone-test-xivasil4fali'", Local "Local file system at /tmp/rclone1821118965", Modify Window "876000h0m0s" 2026/10/04 03:39:24 DEBUG : Internxt root 'rclone-test-xivasil4fali': File to upload is small (34 bytes), uploading instead of streaming 2026/10/04 03:39:25 DEBUG : ignore_checksum_small_file_from_pipe: size = 34 OK 2026/10/04 03:39:25 DEBUG : ignore_checksum_small_file_from_pipe: Sizes identical 2026/10/04 03:39:25 DEBUG : Internxt root 'rclone-test-xivasil4fali': Target remote doesn't support streaming uploads, creating temporary local FS to spool file 2026/10/04 03:39:26 DEBUG : ignore_checksum_big_file_from_pipe: size = 102401 OK 2026/10/04 03:39:26 DEBUG : ignore_checksum_big_file_from_pipe: Sizes identical === RUN TestRcat/withChecksum=true,ignoreChecksum=true run.go:198: Remote "Internxt root 'rclone-test-xivasil4fali'", Local "Local file system at /tmp/rclone1821118965", Modify Window "876000h0m0s" 2026/10/04 03:39:27 DEBUG : Internxt root 'rclone-test-xivasil4fali': File to upload is small (34 bytes), uploading instead of streaming 2026/10/04 03:39:28 DEBUG : ignore_checksum_small_file_from_pipe: size = 34 OK 2026/10/04 03:39:28 DEBUG : ignore_checksum_small_file_from_pipe: Size of src and dst objects identical 2026/10/04 03:39:28 DEBUG : Internxt root 'rclone-test-xivasil4fali': Target remote doesn't support streaming uploads, creating temporary local FS to spool file 2026/10/04 03:39:29 DEBUG : ignore_checksum_big_file_from_pipe: size = 102401 OK 2026/10/04 03:39:29 DEBUG : ignore_checksum_big_file_from_pipe: Size of src and dst objects identical --- PASS: TestRcat (11.57s) --- PASS: TestRcat/withChecksum=false,ignoreChecksum=false (2.70s) --- PASS: TestRcat/withChecksum=true,ignoreChecksum=false (3.06s) --- PASS: TestRcat/withChecksum=false,ignoreChecksum=true (2.89s) --- PASS: TestRcat/withChecksum=true,ignoreChecksum=true (2.92s) === RUN TestRcatMetadata run.go:198: Remote "Internxt root 'rclone-test-xivasil4fali'", Local "Local file system at /tmp/rclone1821118965", Modify Window "876000h0m0s" operations_test.go:1745: Skipping as destination doesn't support user metadata --- SKIP: TestRcatMetadata (0.38s) === RUN TestRcatSize run.go:198: Remote "Internxt root 'rclone-test-xivasil4fali'", Local "Local file system at /tmp/rclone1821118965", Modify Window "876000h0m0s" 2026/10/04 03:39:36 DEBUG : potato1: size = 60 OK 2026/10/04 03:39:36 DEBUG : Internxt root 'rclone-test-xivasil4fali': File to upload is small (60 bytes), uploading instead of streaming 2026/10/04 03:39:37 DEBUG : potato2: size = 60 OK 2026/10/04 03:39:37 DEBUG : potato2: Size of src and dst objects identical --- PASS: TestRcatSize (7.40s) === RUN TestRcatSizeShortEOF run.go:198: Remote "Internxt root 'rclone-test-xivasil4fali'", Local "Local file system at /tmp/rclone1821118965", Modify Window "876000h0m0s" 2026/10/04 03:39:38 DEBUG : pacer: low level retry 1/1 (error failed to transfer file data: failed to execute transfer request: Put "https://s3.eu-west-2.wasabisys.com/internxt-files/d74cf5f2-c345-4a75-8cfe-7b85d00c60a0?Content-Type=application%2Foctet-stream&X-Amz-Algorithm=AWS4-HMAC-SHA256&X-Amz-Credential=HZLT0JKM7MSJF24GMWG0%2F20261004%2Feu-west-2%2Fs3%2Faws4_request&X-Amz-Date=20261004T033938Z&X-Amz-Expires=28800&X-Amz-Signature=5d5056a47f8c47b1f2c18cd106375aff74c5580e5bc51a6cbeb1f66fb12c7c53&X-Amz-SignedHeaders=host": net/http: HTTP/1.x transport connection broken: http: ContentLength=120 with Body length 60) 2026/10/04 03:39:38 DEBUG : pacer: Rate limited, increasing sleep to 20ms 2026/10/04 03:39:38 ERROR : potato1: Post request put error: failed to transfer file data: failed to execute transfer request: Put "https://s3.eu-west-2.wasabisys.com/internxt-files/d74cf5f2-c345-4a75-8cfe-7b85d00c60a0?Content-Type=application%2Foctet-stream&X-Amz-Algorithm=AWS4-HMAC-SHA256&X-Amz-Credential=HZLT0JKM7MSJF24GMWG0%2F20261004%2Feu-west-2%2Fs3%2Faws4_request&X-Amz-Date=20261004T033938Z&X-Amz-Expires=28800&X-Amz-Signature=5d5056a47f8c47b1f2c18cd106375aff74c5580e5bc51a6cbeb1f66fb12c7c53&X-Amz-SignedHeaders=host": net/http: HTTP/1.x transport connection broken: http: ContentLength=120 with Body length 60 2026/10/04 03:39:38 DEBUG : pacer: Reducing sleep to 15ms 2026/10/04 03:39:38 DEBUG : pacer: Reducing sleep to 11.25ms 2026/10/04 03:39:38 DEBUG : pacer: Reducing sleep to 10ms --- PASS: TestRcatSizeShortEOF (0.63s) === RUN TestRcatSizeMetadata run.go:198: Remote "Internxt root 'rclone-test-xivasil4fali'", Local "Local file system at /tmp/rclone1821118965", Modify Window "876000h0m0s" operations_test.go:1838: Skipping as destination doesn't support user metadata --- SKIP: TestRcatSizeMetadata (0.38s) === RUN TestRcatSizeUploadHeaders run.go:198: Remote "Internxt root 'rclone-test-xivasil4fali'", Local "Local file system at /tmp/rclone1821118965", Modify Window "876000h0m0s" 2026/10/04 03:39:40 DEBUG : potato1: size = 60 OK --- PASS: TestRcatSizeUploadHeaders (1.47s) === RUN TestRcatSizeChecksum === RUN TestRcatSizeChecksum/Corrupted run.go:198: Remote "Internxt root 'rclone-test-xivasil4fali'", Local "Local file system at /tmp/rclone1821118965", Modify Window "876000h0m0s" operations_test.go:1975: Skipping as destination doesn't support hashes === RUN TestRcatSizeChecksum/SizeDiffers run.go:198: Remote "Internxt root 'rclone-test-xivasil4fali'", Local "Local file system at /tmp/rclone1821118965", Modify Window "876000h0m0s" 2026/10/04 03:39:41 DEBUG : potato4: size = 60 (Internxt root 'rclone-test-xivasil4fali') 2026/10/04 03:39:41 DEBUG : potato4: size = 59 (Internxt root 'rclone-test-xivasil4fali') 2026/10/04 03:39:41 ERROR : potato4: corrupted on transfer: sizes differ src 60 vs dst(Internxt root 'rclone-test-xivasil4fali') 59 2026/10/04 03:39:41 INFO : potato4: Removing failed copy === RUN TestRcatSizeChecksum/IgnoreChecksum run.go:198: Remote "Internxt root 'rclone-test-xivasil4fali'", Local "Local file system at /tmp/rclone1821118965", Modify Window "876000h0m0s" 2026/10/04 03:39:44 DEBUG : potato2: size = 60 OK === RUN TestRcatSizeChecksum/NoHashes run.go:198: Remote "Internxt root 'rclone-test-xivasil4fali'", Local "Local file system at /tmp/rclone1821118965", Modify Window "876000h0m0s" 2026/10/04 03:39:47 DEBUG : potato3: size = 60 OK --- PASS: TestRcatSizeChecksum (7.85s) --- SKIP: TestRcatSizeChecksum/Corrupted (0.41s) --- PASS: TestRcatSizeChecksum/SizeDiffers (3.06s) --- PASS: TestRcatSizeChecksum/IgnoreChecksum (3.13s) --- PASS: TestRcatSizeChecksum/NoHashes (1.25s) === RUN TestTouchDir run.go:198: Remote "Internxt root 'rclone-test-xivasil4fali'", Local "Local file system at /tmp/rclone1821118965", Modify Window "876000h0m0s" operations_test.go:2020: Skipping test as remote does not support modtime --- SKIP: TestTouchDir (0.38s) === RUN TestMkdirMetadata run.go:198: Remote "Internxt root 'rclone-test-xivasil4fali'", Local "Local file system at /tmp/rclone1821118965", Modify Window "876000h0m0s" operations_test.go:2058: Skipping test as remote does not support MkdirMetadata --- SKIP: TestMkdirMetadata (0.48s) === RUN TestMkdirModTime run.go:198: Remote "Internxt root 'rclone-test-xivasil4fali'", Local "Local file system at /tmp/rclone1821118965", Modify Window "876000h0m0s" operations_test.go:2079: Skipping test as remote does not support DirSetModTime or MkdirMetadata --- SKIP: TestMkdirModTime (0.56s) === RUN TestCopyDirMetadata run.go:198: Remote "Internxt root 'rclone-test-xivasil4fali'", Local "Local file system at /tmp/rclone1821118965", Modify Window "876000h0m0s" operations_test.go:2123: Skipping test as remote does not support WriteDirMetadata or MkdirMetadata --- SKIP: TestCopyDirMetadata (0.57s) === RUN TestSetDirModTime run.go:198: Remote "Internxt root 'rclone-test-xivasil4fali'", Local "Local file system at /tmp/rclone1821118965", Modify Window "876000h0m0s" operations_test.go:2161: Skipping test as remote does not support DirSetModTime or WriteDirSetModTime --- SKIP: TestSetDirModTime (0.55s) === RUN TestDirsEqual run.go:198: Remote "Internxt root 'rclone-test-xivasil4fali'", Local "Local file system at /tmp/rclone1821118965", Modify Window "876000h0m0s" operations_test.go:2212: Skipping test as remote does not support WriteDirMetadata or MkdirMetadata --- SKIP: TestDirsEqual (0.48s) === RUN TestRemoveExisting run.go:198: Remote "Internxt root 'rclone-test-xivasil4fali'", Local "Local file system at /tmp/rclone1821118965", Modify Window "876000h0m0s" 2026/10/04 03:39:55 DEBUG : sub dir/test remove existing: TEST: renaming existing object to "sub dir/test remove existing.sipupol1" before starting 2026/10/04 03:39:55 DEBUG : sub dir/test remove existing.sipupol1: TEST: removing renamed existing file after operation 2026/10/04 03:39:58 DEBUG : sub dir/test remove existing with long name 123456789012345678901234567890123456789012345678901234567890123456789: TEST: renaming existing object to "sub dir/test remove existing with long name 123456789012345678901234567890123456789012345678901234567890.qujiwab0" before starting 2026/10/04 03:39:59 DEBUG : sub dir/test remove existing with long name 123456789012345678901234567890123456789012345678901234567890.qujiwab0: TEST: renaming existing back after failed operation 2026/10/04 03:39:59 DEBUG : sub dir/test remove existing with long name 123456789012345678901234567890123456789012345678901234567890123456789: TEST: renaming existing object to "sub dir/test remove existing with long name 123456789012345678901234567890123456789012345678901234567890.biqabap2" before starting 2026/10/04 03:40:00 DEBUG : sub dir/test remove existing with long name 123456789012345678901234567890123456789012345678901234567890.biqabap2: TEST: removing renamed existing file after operation --- PASS: TestRemoveExisting (10.54s) === RUN TestRcatInputFailurePreservesDestination 2026/10/04 03:40:02 DEBUG : Creating backend with remote "/tmp/TestRcatInputFailurePreservesDestination2848168658/001" --- PASS: TestRcatInputFailurePreservesDestination (0.00s) === RUN TestRcAbout rc_test.go:31: Skipping test on non local remote --- SKIP: TestRcAbout (0.00s) === RUN TestRcCleanup rc_test.go:31: Skipping test on non local remote --- SKIP: TestRcCleanup (0.00s) === RUN TestRcCopyfile rc_test.go:31: Skipping test on non local remote --- SKIP: TestRcCopyfile (0.00s) === RUN TestRcCopyurl rc_test.go:31: Skipping test on non local remote --- SKIP: TestRcCopyurl (0.00s) === RUN TestRcDelete rc_test.go:31: Skipping test on non local remote --- SKIP: TestRcDelete (0.00s) === RUN TestRcDeletefile rc_test.go:31: Skipping test on non local remote --- SKIP: TestRcDeletefile (0.00s) === RUN TestRcList rc_test.go:31: Skipping test on non local remote --- SKIP: TestRcList (0.00s) === RUN TestRcStat rc_test.go:31: Skipping test on non local remote --- SKIP: TestRcStat (0.00s) === RUN TestRcSetTier rc_test.go:31: Skipping test on non local remote --- SKIP: TestRcSetTier (0.00s) === RUN TestRcSetTierFile rc_test.go:31: Skipping test on non local remote --- SKIP: TestRcSetTierFile (0.00s) === RUN TestRcMkdir rc_test.go:31: Skipping test on non local remote --- SKIP: TestRcMkdir (0.00s) === RUN TestRcMovefile rc_test.go:31: Skipping test on non local remote --- SKIP: TestRcMovefile (0.00s) === RUN TestRcPurge rc_test.go:31: Skipping test on non local remote --- SKIP: TestRcPurge (0.00s) === RUN TestRcRmdir rc_test.go:31: Skipping test on non local remote --- SKIP: TestRcRmdir (0.00s) === RUN TestRcRmdirs rc_test.go:31: Skipping test on non local remote --- SKIP: TestRcRmdirs (0.00s) === RUN TestRcSize rc_test.go:31: Skipping test on non local remote --- SKIP: TestRcSize (0.00s) === RUN TestRcPublicLink rc_test.go:31: Skipping test on non local remote --- SKIP: TestRcPublicLink (0.00s) === RUN TestRcFsInfo rc_test.go:31: Skipping test on non local remote --- SKIP: TestRcFsInfo (0.00s) === RUN TestUploadFile rc_test.go:31: Skipping test on non local remote --- SKIP: TestUploadFile (0.00s) === RUN TestRcCommand rc_test.go:31: Skipping test on non local remote --- SKIP: TestRcCommand (0.00s) === RUN TestRcDu rc_test.go:31: Skipping test on non local remote --- SKIP: TestRcDu (0.00s) === RUN TestRcCheck rc_test.go:31: Skipping test on non local remote --- SKIP: TestRcCheck (0.00s) === RUN TestRcHashsum rc_test.go:31: Skipping test on non local remote --- SKIP: TestRcHashsum (0.00s) === RUN TestRcHashsumSingleFile rc_test.go:31: Skipping test on non local remote --- SKIP: TestRcHashsumSingleFile (0.00s) === RUN TestRcHashsumFile rc_test.go:31: Skipping test on non local remote --- SKIP: TestRcHashsumFile (0.00s) === RUN TestRcGetFile rc_test.go:31: Skipping test on non local remote --- SKIP: TestRcGetFile (0.00s) FAIL 2026/10/04 03:40:02 DEBUG : Internxt root 'rclone-test-xivasil4fali': Purge dir "" "./operations.test -test.v -test.timeout 2h0m0s -remote TestInternxt: -list-retries 5 -verbose" - Finished ERROR in 14m7.761202365s (try 1/5): exit status 1: Failed [TestIndex TestIndexDelete TestIndexFilter TestIndexChanged TestIndexChangedDirTime]