"./operations.test -test.v -test.timeout 1h0m0s -remote TestCloudinary: -list-retries 5 -verbose" - Starting (try 1/5) 2026/10/02 06:30:28 DEBUG : Creating backend with remote "TestCloudinary:rclone-test-vacilat8foqu" 2026/10/02 06:30:28 DEBUG : Using config file from "/home/rclone/.rclone.conf" 2026/10/02 06:30:29 DEBUG : Creating backend with remote "/tmp/rclone1719434886" === RUN TestDoMultiThreadCopy --- PASS: TestDoMultiThreadCopy (0.00s) === RUN TestMultithreadCalculateNumChunks === RUN TestMultithreadCalculateNumChunks/{size:1_chunkSize:65536_wantNumChunks:1} === RUN TestMultithreadCalculateNumChunks/{size:1048576_chunkSize:1_wantNumChunks:1048576} === RUN TestMultithreadCalculateNumChunks/{size:1048576_chunkSize:2_wantNumChunks:524288} === RUN TestMultithreadCalculateNumChunks/{size:1048577_chunkSize:2_wantNumChunks:524289} === RUN TestMultithreadCalculateNumChunks/{size:1048575_chunkSize:2_wantNumChunks:524288} --- PASS: TestMultithreadCalculateNumChunks (0.00s) --- PASS: TestMultithreadCalculateNumChunks/{size:1_chunkSize:65536_wantNumChunks:1} (0.00s) --- PASS: TestMultithreadCalculateNumChunks/{size:1048576_chunkSize:1_wantNumChunks:1048576} (0.00s) --- PASS: TestMultithreadCalculateNumChunks/{size:1048576_chunkSize:2_wantNumChunks:524288} (0.00s) --- PASS: TestMultithreadCalculateNumChunks/{size:1048577_chunkSize:2_wantNumChunks:524289} (0.00s) --- PASS: TestMultithreadCalculateNumChunks/{size:1048575_chunkSize:2_wantNumChunks:524288} (0.00s) === RUN TestMultithreadCopy run.go:198: Remote "Cloudinary root 'rclone-test-vacilat8foqu'", Local "Local file system at /tmp/rclone1719434886", Modify Window "876000h0m0s" multithread_test.go:120: multithread writing not supported 2026/10/02 06:30:29 ERROR : error listing: directory not found --- SKIP: TestMultithreadCopy (0.12s) === RUN TestMultithreadCopyAbort run.go:198: Remote "Cloudinary root 'rclone-test-vacilat8foqu'", Local "Local file system at /tmp/rclone1719434886", Modify Window "876000h0m0s" multithread_test.go:120: multithread writing not supported 2026/10/02 06:30:29 ERROR : error listing: directory not found --- SKIP: TestMultithreadCopyAbort (0.12s) === RUN TestMultithreadCopyWriterAtErrors === RUN TestMultithreadCopyWriterAtErrors/open/fatal=false 2026/10/02 06:30:29 DEBUG : file.txt: multi-thread copy: disabling buffering because destination uses OpenWriterAt === RUN TestMultithreadCopyWriterAtErrors/open/fatal=true 2026/10/02 06:30:29 DEBUG : file.txt: multi-thread copy: disabling buffering because destination uses OpenWriterAt === RUN TestMultithreadCopyWriterAtErrors/write/fatal=false 2026/10/02 06:30:29 DEBUG : file.txt: multi-thread copy: disabling buffering because destination uses OpenWriterAt 2026/10/02 06:30:29 DEBUG : file.txt: Starting multi-thread copy with 4 chunks of size 4 with 2 parallel streams 2026/10/02 06:30:29 DEBUG : file.txt: multi-thread copy: chunk 2/4 (4-8) size 4 starting 2026/10/02 06:30:29 DEBUG : file.txt: writing chunk 1 2026/10/02 06:30:29 DEBUG : file.txt: multi-thread copy: chunk 1/4 (0-4) size 4 starting 2026/10/02 06:30:29 DEBUG : file.txt: writing chunk 0 2026/10/02 06:30:29 DEBUG : file.txt: multi-thread copy: chunk 1/4 failed: multi-thread copy: failed to write chunk: disk full 2026/10/02 06:30:29 DEBUG : file.txt: multi-thread copy: chunk 3/4 (8-12) size 4 starting 2026/10/02 06:30:29 DEBUG : file.txt: multi-thread copy: chunk 2/4 failed: multi-thread copy: failed to write chunk: disk full 2026/10/02 06:30:29 DEBUG : file.txt: writing chunk 2 2026/10/02 06:30:29 DEBUG : file.txt: multi-thread copy: chunk 3/4 failed: multi-thread copy: failed to write chunk: disk full 2026/10/02 06:30:29 DEBUG : file.txt: multi-thread copy: cancelling transfer on exit 2026/10/02 06:30:29 DEBUG : file.txt: multi-thread copy: abort failed: multi-thread copy: failed to find temp file when aborting chunk writer: object not found === RUN TestMultithreadCopyWriterAtErrors/write/fatal=true 2026/10/02 06:30:29 DEBUG : file.txt: multi-thread copy: disabling buffering because destination uses OpenWriterAt 2026/10/02 06:30:29 DEBUG : file.txt: Starting multi-thread copy with 4 chunks of size 4 with 2 parallel streams 2026/10/02 06:30:29 DEBUG : file.txt: multi-thread copy: chunk 2/4 (4-8) size 4 starting 2026/10/02 06:30:29 DEBUG : file.txt: writing chunk 1 2026/10/02 06:30:29 DEBUG : file.txt: multi-thread copy: chunk 2/4 failed: multi-thread copy: failed to write chunk: disk full 2026/10/02 06:30:29 DEBUG : file.txt: multi-thread copy: chunk 3/4 (8-12) size 4 starting 2026/10/02 06:30:29 DEBUG : file.txt: writing chunk 2 2026/10/02 06:30:29 DEBUG : file.txt: multi-thread copy: chunk 3/4 failed: multi-thread copy: failed to write chunk: disk full 2026/10/02 06:30:29 DEBUG : file.txt: multi-thread copy: chunk 1/4 (0-4) size 4 starting 2026/10/02 06:30:29 DEBUG : file.txt: writing chunk 0 2026/10/02 06:30:29 DEBUG : file.txt: multi-thread copy: chunk 1/4 failed: multi-thread copy: failed to write chunk: disk full 2026/10/02 06:30:29 DEBUG : file.txt: multi-thread copy: cancelling transfer on exit 2026/10/02 06:30:29 DEBUG : file.txt: multi-thread copy: abort failed: multi-thread copy: failed to find temp file when aborting chunk writer: object not found === RUN TestMultithreadCopyWriterAtErrors/close/fatal=false 2026/10/02 06:30:29 DEBUG : file.txt: multi-thread copy: disabling buffering because destination uses OpenWriterAt 2026/10/02 06:30:29 DEBUG : file.txt: Starting multi-thread copy with 4 chunks of size 4 with 2 parallel streams 2026/10/02 06:30:29 DEBUG : file.txt: multi-thread copy: chunk 2/4 (4-8) size 4 starting 2026/10/02 06:30:29 DEBUG : file.txt: writing chunk 1 2026/10/02 06:30:29 DEBUG : file.txt: multi-thread copy: chunk 2/4 (4-8) size 4 finished 2026/10/02 06:30:29 DEBUG : file.txt: multi-thread copy: chunk 3/4 (8-12) size 4 starting 2026/10/02 06:30:29 DEBUG : file.txt: writing chunk 2 2026/10/02 06:30:29 DEBUG : file.txt: multi-thread copy: chunk 3/4 (8-12) size 4 finished 2026/10/02 06:30:29 DEBUG : file.txt: multi-thread copy: chunk 4/4 (12-16) size 4 starting 2026/10/02 06:30:29 DEBUG : file.txt: writing chunk 3 2026/10/02 06:30:29 DEBUG : file.txt: multi-thread copy: chunk 4/4 (12-16) size 4 finished 2026/10/02 06:30:29 DEBUG : file.txt: multi-thread copy: chunk 1/4 (0-4) size 4 starting 2026/10/02 06:30:29 DEBUG : file.txt: writing chunk 0 2026/10/02 06:30:29 DEBUG : file.txt: multi-thread copy: chunk 1/4 (0-4) size 4 finished 2026/10/02 06:30:29 DEBUG : file.txt: multi-thread copy: cancelling transfer on exit 2026/10/02 06:30:29 DEBUG : file.txt: multi-thread copy: abort failed: multi-thread copy: failed to find temp file when aborting chunk writer: object not found === RUN TestMultithreadCopyWriterAtErrors/close/fatal=true 2026/10/02 06:30:29 DEBUG : file.txt: multi-thread copy: disabling buffering because destination uses OpenWriterAt 2026/10/02 06:30:29 DEBUG : file.txt: Starting multi-thread copy with 4 chunks of size 4 with 2 parallel streams 2026/10/02 06:30:29 DEBUG : file.txt: multi-thread copy: chunk 2/4 (4-8) size 4 starting 2026/10/02 06:30:29 DEBUG : file.txt: writing chunk 1 2026/10/02 06:30:29 DEBUG : file.txt: multi-thread copy: chunk 2/4 (4-8) size 4 finished 2026/10/02 06:30:29 DEBUG : file.txt: multi-thread copy: chunk 3/4 (8-12) size 4 starting 2026/10/02 06:30:29 DEBUG : file.txt: writing chunk 2 2026/10/02 06:30:29 DEBUG : file.txt: multi-thread copy: chunk 3/4 (8-12) size 4 finished 2026/10/02 06:30:29 DEBUG : file.txt: multi-thread copy: chunk 4/4 (12-16) size 4 starting 2026/10/02 06:30:29 DEBUG : file.txt: writing chunk 3 2026/10/02 06:30:29 DEBUG : file.txt: multi-thread copy: chunk 4/4 (12-16) size 4 finished 2026/10/02 06:30:29 DEBUG : file.txt: multi-thread copy: chunk 1/4 (0-4) size 4 starting 2026/10/02 06:30:29 DEBUG : file.txt: writing chunk 0 2026/10/02 06:30:29 DEBUG : file.txt: multi-thread copy: chunk 1/4 (0-4) size 4 finished 2026/10/02 06:30:29 DEBUG : file.txt: multi-thread copy: cancelling transfer on exit 2026/10/02 06:30:29 DEBUG : file.txt: multi-thread copy: abort failed: multi-thread copy: failed to find temp file when aborting chunk writer: object not found --- PASS: TestMultithreadCopyWriterAtErrors (0.00s) --- PASS: TestMultithreadCopyWriterAtErrors/open/fatal=false (0.00s) --- PASS: TestMultithreadCopyWriterAtErrors/open/fatal=true (0.00s) --- PASS: TestMultithreadCopyWriterAtErrors/write/fatal=false (0.00s) --- PASS: TestMultithreadCopyWriterAtErrors/write/fatal=true (0.00s) --- PASS: TestMultithreadCopyWriterAtErrors/close/fatal=false (0.00s) --- PASS: TestMultithreadCopyWriterAtErrors/close/fatal=true (0.00s) === RUN TestSizeDiffers 2026/10/02 06:30:29 DEBUG : a: size = 0 OK 2026/10/02 06:30:29 DEBUG : a: size = 1 (memory) 2026/10/02 06:30:29 DEBUG : a: size = 2 (memory) --- PASS: TestSizeDiffers (0.00s) === RUN TestDirTransferEntry --- PASS: TestDirTransferEntry (0.00s) === RUN TestReOpen === RUN TestReOpen/Normal === RUN TestReOpen/Normal/Basics 2026/10/02 06:30:29 DEBUG : potato: Seek from 10 to 0 === RUN TestReOpen/Normal/ErrorAtStart === RUN TestReOpen/Normal/WithErrors 2026/10/02 06:30:29 DEBUG : potato: Reopening on read failure after offset 2 bytes: retry 1/10: test error 2026/10/02 06:30:29 DEBUG : potato: Reopening on read failure after offset 3 bytes: retry 2/10: test error 2026/10/02 06:30:29 DEBUG : potato: Reopening on read failure after offset 6 bytes: retry 3/10: test error === RUN TestReOpen/Normal/TooManyErrors 2026/10/02 06:30:29 DEBUG : potato: Reopening on read failure after offset 2 bytes: retry 1/3: test error 2026/10/02 06:30:29 DEBUG : potato: Reopening on read failure after offset 3 bytes: retry 2/3: test error 2026/10/02 06:30:29 DEBUG : potato: Reopening on read failure after offset 6 bytes: retry 3/3: test error 2026/10/02 06:30:29 DEBUG : potato: Reopen failed after offset 6 bytes read: failed to reopen: too many retries === RUN TestReOpen/Normal/ReadAt 2026/10/02 06:30:29 DEBUG : potato: Reopening on read failure after offset 2 bytes: retry 0/10: test error 2026/10/02 06:30:29 DEBUG : potato: Reopening on read failure after offset 3 bytes: retry 1/10: test error 2026/10/02 06:30:29 DEBUG : potato: Seek from 5 to 1 === RUN TestReOpen/Normal/Seek 2026/10/02 06:30:29 DEBUG : potato: Reopening on read failure after offset 2 bytes: retry 0/10: test error 2026/10/02 06:30:29 DEBUG : potato: Reopening on read failure after offset 3 bytes: retry 1/10: test error 2026/10/02 06:30:29 DEBUG : potato: Seek from 5 to 2 === RUN TestReOpen/Normal/AccountRead === RUN TestReOpen/Normal/AccountReadDelay 2026/10/02 06:30:29 DEBUG : potato: Seek from 10 to 0 2026/10/02 06:30:29 DEBUG : potato: Seek from 10 to 0 2026/10/02 06:30:29 DEBUG : potato: Seek from 10 to 0 === RUN TestReOpen/Normal/AccountReadError === RUN TestReOpen/WithRangeOption === RUN TestReOpen/WithRangeOption/Basics 2026/10/02 06:30:29 DEBUG : potato: Seek from 7 to 0 === RUN TestReOpen/WithRangeOption/ErrorAtStart === RUN TestReOpen/WithRangeOption/WithErrors 2026/10/02 06:30:29 DEBUG : potato: Reopening on read failure after offset 2 bytes: retry 1/10: test error 2026/10/02 06:30:29 DEBUG : potato: Reopening on read failure after offset 3 bytes: retry 2/10: test error 2026/10/02 06:30:29 DEBUG : potato: Reopening on read failure after offset 6 bytes: retry 3/10: test error === RUN TestReOpen/WithRangeOption/TooManyErrors 2026/10/02 06:30:29 DEBUG : potato: Reopening on read failure after offset 2 bytes: retry 1/3: test error 2026/10/02 06:30:29 DEBUG : potato: Reopening on read failure after offset 3 bytes: retry 2/3: test error 2026/10/02 06:30:29 DEBUG : potato: Reopening on read failure after offset 6 bytes: retry 3/3: test error 2026/10/02 06:30:29 DEBUG : potato: Reopen failed after offset 6 bytes read: failed to reopen: too many retries === RUN TestReOpen/WithRangeOption/ReadAt 2026/10/02 06:30:29 DEBUG : potato: Reopening on read failure after offset 2 bytes: retry 0/10: test error 2026/10/02 06:30:29 DEBUG : potato: Reopening on read failure after offset 3 bytes: retry 1/10: test error 2026/10/02 06:30:29 DEBUG : potato: Seek from 5 to 1 === RUN TestReOpen/WithRangeOption/Seek 2026/10/02 06:30:29 DEBUG : potato: Reopening on read failure after offset 2 bytes: retry 0/10: test error 2026/10/02 06:30:29 DEBUG : potato: Reopening on read failure after offset 3 bytes: retry 1/10: test error 2026/10/02 06:30:29 DEBUG : potato: Seek from 5 to 2 2026/10/02 06:30:29 DEBUG : potato: Seek from 7 to 4 === RUN TestReOpen/WithRangeOption/AccountRead === RUN TestReOpen/WithRangeOption/AccountReadDelay 2026/10/02 06:30:29 DEBUG : potato: Seek from 7 to 0 2026/10/02 06:30:29 DEBUG : potato: Seek from 7 to 0 2026/10/02 06:30:29 DEBUG : potato: Seek from 7 to 0 === RUN TestReOpen/WithRangeOption/AccountReadError === RUN TestReOpen/WithSeekOption === RUN TestReOpen/WithSeekOption/Basics 2026/10/02 06:30:29 DEBUG : potato: Seek from 8 to 0 === RUN TestReOpen/WithSeekOption/ErrorAtStart === RUN TestReOpen/WithSeekOption/WithErrors 2026/10/02 06:30:29 DEBUG : potato: Reopening on read failure after offset 2 bytes: retry 1/10: test error 2026/10/02 06:30:29 DEBUG : potato: Reopening on read failure after offset 3 bytes: retry 2/10: test error 2026/10/02 06:30:29 DEBUG : potato: Reopening on read failure after offset 6 bytes: retry 3/10: test error === RUN TestReOpen/WithSeekOption/TooManyErrors 2026/10/02 06:30:29 DEBUG : potato: Reopening on read failure after offset 2 bytes: retry 1/3: test error 2026/10/02 06:30:29 DEBUG : potato: Reopening on read failure after offset 3 bytes: retry 2/3: test error 2026/10/02 06:30:29 DEBUG : potato: Reopening on read failure after offset 6 bytes: retry 3/3: test error 2026/10/02 06:30:29 DEBUG : potato: Reopen failed after offset 6 bytes read: failed to reopen: too many retries === RUN TestReOpen/WithSeekOption/ReadAt 2026/10/02 06:30:29 DEBUG : potato: Reopening on read failure after offset 2 bytes: retry 0/10: test error 2026/10/02 06:30:29 DEBUG : potato: Reopening on read failure after offset 3 bytes: retry 1/10: test error 2026/10/02 06:30:29 DEBUG : potato: Seek from 5 to 1 === RUN TestReOpen/WithSeekOption/Seek 2026/10/02 06:30:29 DEBUG : potato: Reopening on read failure after offset 2 bytes: retry 0/10: test error 2026/10/02 06:30:29 DEBUG : potato: Reopening on read failure after offset 3 bytes: retry 1/10: test error 2026/10/02 06:30:29 DEBUG : potato: Seek from 5 to 2 2026/10/02 06:30:29 DEBUG : potato: Seek from 7 to 5 === RUN TestReOpen/WithSeekOption/AccountRead === RUN TestReOpen/WithSeekOption/AccountReadDelay 2026/10/02 06:30:29 DEBUG : potato: Seek from 8 to 0 2026/10/02 06:30:29 DEBUG : potato: Seek from 8 to 0 2026/10/02 06:30:29 DEBUG : potato: Seek from 8 to 0 === RUN TestReOpen/WithSeekOption/AccountReadError === RUN TestReOpen/UnknownSize === RUN TestReOpen/UnknownSize/Basics 2026/10/02 06:30:29 DEBUG : potato: Seek from 9 to 0 === RUN TestReOpen/UnknownSize/ErrorAtStart === RUN TestReOpen/UnknownSize/WithErrors 2026/10/02 06:30:29 DEBUG : potato: Reopening on read failure after offset 2 bytes: retry 1/10: test error 2026/10/02 06:30:29 DEBUG : potato: Reopening on read failure after offset 3 bytes: retry 2/10: test error 2026/10/02 06:30:29 DEBUG : potato: Reopening on read failure after offset 6 bytes: retry 3/10: test error === RUN TestReOpen/UnknownSize/TooManyErrors 2026/10/02 06:30:29 DEBUG : potato: Reopening on read failure after offset 2 bytes: retry 1/3: test error 2026/10/02 06:30:29 DEBUG : potato: Reopening on read failure after offset 3 bytes: retry 2/3: test error 2026/10/02 06:30:29 DEBUG : potato: Reopening on read failure after offset 6 bytes: retry 3/3: test error 2026/10/02 06:30:29 DEBUG : potato: Reopen failed after offset 6 bytes read: failed to reopen: too many retries === RUN TestReOpen/UnknownSize/ReadAt 2026/10/02 06:30:29 DEBUG : potato: Reopening on read failure after offset 2 bytes: retry 0/10: test error 2026/10/02 06:30:29 DEBUG : potato: Reopening on read failure after offset 3 bytes: retry 1/10: test error 2026/10/02 06:30:29 DEBUG : potato: Seek from 5 to 1 === RUN TestReOpen/UnknownSize/Seek 2026/10/02 06:30:29 DEBUG : potato: Reopening on read failure after offset 2 bytes: retry 0/10: test error 2026/10/02 06:30:29 DEBUG : potato: Reopening on read failure after offset 3 bytes: retry 1/10: test error 2026/10/02 06:30:29 DEBUG : potato: Seek from 5 to 2 2026/10/02 06:30:29 DEBUG : potato: Seek from 7 to 6 === RUN TestReOpen/UnknownSize/AccountRead === RUN TestReOpen/UnknownSize/AccountReadDelay 2026/10/02 06:30:29 DEBUG : potato: Seek from 9 to 0 2026/10/02 06:30:29 DEBUG : potato: Seek from 9 to 0 2026/10/02 06:30:29 DEBUG : potato: Seek from 9 to 0 === RUN TestReOpen/UnknownSize/AccountReadError --- PASS: TestReOpen (0.00s) --- PASS: TestReOpen/Normal (0.00s) --- PASS: TestReOpen/Normal/Basics (0.00s) --- PASS: TestReOpen/Normal/ErrorAtStart (0.00s) --- PASS: TestReOpen/Normal/WithErrors (0.00s) --- PASS: TestReOpen/Normal/TooManyErrors (0.00s) --- PASS: TestReOpen/Normal/ReadAt (0.00s) --- PASS: TestReOpen/Normal/Seek (0.00s) --- PASS: TestReOpen/Normal/AccountRead (0.00s) --- PASS: TestReOpen/Normal/AccountReadDelay (0.00s) --- PASS: TestReOpen/Normal/AccountReadError (0.00s) --- PASS: TestReOpen/WithRangeOption (0.00s) --- PASS: TestReOpen/WithRangeOption/Basics (0.00s) --- PASS: TestReOpen/WithRangeOption/ErrorAtStart (0.00s) --- PASS: TestReOpen/WithRangeOption/WithErrors (0.00s) --- PASS: TestReOpen/WithRangeOption/TooManyErrors (0.00s) --- PASS: TestReOpen/WithRangeOption/ReadAt (0.00s) --- PASS: TestReOpen/WithRangeOption/Seek (0.00s) --- PASS: TestReOpen/WithRangeOption/AccountRead (0.00s) --- PASS: TestReOpen/WithRangeOption/AccountReadDelay (0.00s) --- PASS: TestReOpen/WithRangeOption/AccountReadError (0.00s) --- PASS: TestReOpen/WithSeekOption (0.00s) --- PASS: TestReOpen/WithSeekOption/Basics (0.00s) --- PASS: TestReOpen/WithSeekOption/ErrorAtStart (0.00s) --- PASS: TestReOpen/WithSeekOption/WithErrors (0.00s) --- PASS: TestReOpen/WithSeekOption/TooManyErrors (0.00s) --- PASS: TestReOpen/WithSeekOption/ReadAt (0.00s) --- PASS: TestReOpen/WithSeekOption/Seek (0.00s) --- PASS: TestReOpen/WithSeekOption/AccountRead (0.00s) --- PASS: TestReOpen/WithSeekOption/AccountReadDelay (0.00s) --- PASS: TestReOpen/WithSeekOption/AccountReadError (0.00s) --- PASS: TestReOpen/UnknownSize (0.00s) --- PASS: TestReOpen/UnknownSize/Basics (0.00s) --- PASS: TestReOpen/UnknownSize/ErrorAtStart (0.00s) --- PASS: TestReOpen/UnknownSize/WithErrors (0.00s) --- PASS: TestReOpen/UnknownSize/TooManyErrors (0.00s) --- PASS: TestReOpen/UnknownSize/ReadAt (0.00s) --- PASS: TestReOpen/UnknownSize/Seek (0.00s) --- PASS: TestReOpen/UnknownSize/AccountRead (0.00s) --- PASS: TestReOpen/UnknownSize/AccountReadDelay (0.00s) --- PASS: TestReOpen/UnknownSize/AccountReadError (0.00s) === RUN TestCheck run.go:198: Remote "Cloudinary root 'rclone-test-vacilat8foqu'", Local "Local file system at /tmp/rclone1719434886", Modify Window "876000h0m0s" === RUN TestCheck/1 === RUN TestCheck/2 === RUN TestCheck/3 === RUN TestCheck/4 === RUN TestCheck/5 === RUN TestCheck/6 === RUN TestCheck/7 --- PASS: TestCheck (9.86s) --- PASS: TestCheck/1 (0.33s) --- PASS: TestCheck/2 (0.43s) --- PASS: TestCheck/3 (0.45s) --- PASS: TestCheck/4 (0.37s) --- PASS: TestCheck/5 (0.49s) --- PASS: TestCheck/6 (0.33s) --- PASS: TestCheck/7 (0.35s) === RUN TestCheckFsError 2026/10/02 06:30:39 DEBUG : Creating backend with remote "nonexistent" 2026/10/02 06:30:39 DEBUG : Creating backend with remote "nonexistent" 2026/10/02 06:30:39 DEBUG : Local file system at nonexistent: Waiting for checks to finish 2026/10/02 06:30:39 ERROR : Local file system at nonexistent: error reading source root directory: directory not found 2026/10/02 06:30:39 NOTICE: Local file system at nonexistent: 0 differences found 2026/10/02 06:30:39 NOTICE: Local file system at nonexistent: 2 errors while checking --- PASS: TestCheckFsError (0.00s) === RUN TestCheckDownload run.go:198: Remote "Cloudinary root 'rclone-test-vacilat8foqu'", Local "Local file system at /tmp/rclone1719434886", Modify Window "876000h0m0s" === RUN TestCheckDownload/1 === RUN TestCheckDownload/2 === RUN TestCheckDownload/3 === RUN TestCheckDownload/4 === RUN TestCheckDownload/5 === RUN TestCheckDownload/6 === RUN TestCheckDownload/7 --- PASS: TestCheckDownload (8.34s) --- PASS: TestCheckDownload/1 (0.67s) --- PASS: TestCheckDownload/2 (0.35s) --- PASS: TestCheckDownload/3 (0.36s) --- PASS: TestCheckDownload/4 (0.79s) --- PASS: TestCheckDownload/5 (0.34s) --- PASS: TestCheckDownload/6 (0.35s) --- PASS: TestCheckDownload/7 (0.33s) === RUN TestCheckSizeOnly run.go:198: Remote "Cloudinary root 'rclone-test-vacilat8foqu'", Local "Local file system at /tmp/rclone1719434886", Modify Window "876000h0m0s" === RUN TestCheckSizeOnly/1 === RUN TestCheckSizeOnly/2 === RUN TestCheckSizeOnly/3 === RUN TestCheckSizeOnly/4 === RUN TestCheckSizeOnly/5 === RUN TestCheckSizeOnly/6 === RUN TestCheckSizeOnly/7 --- PASS: TestCheckSizeOnly (8.09s) --- PASS: TestCheckSizeOnly/1 (0.30s) --- PASS: TestCheckSizeOnly/2 (0.32s) --- PASS: TestCheckSizeOnly/3 (0.33s) --- PASS: TestCheckSizeOnly/4 (0.41s) --- PASS: TestCheckSizeOnly/5 (0.30s) --- PASS: TestCheckSizeOnly/6 (0.33s) --- PASS: TestCheckSizeOnly/7 (0.31s) === RUN TestCheckEqualReaders --- PASS: TestCheckEqualReaders (0.00s) === RUN TestParseSumFile run.go:198: Remote "Cloudinary root 'rclone-test-vacilat8foqu'", Local "Local file system at /tmp/rclone1719434886", Modify Window "876000h0m0s" fstest.go:542: Sleeping for 1s for findObject eventual consistency: 1/5 (object not found) fstest.go:542: Sleeping for 1.5s for findObject eventual consistency: 2/5 (object not found) 2026/10/02 06:30:59 NOTICE: test.sum: improperly formatted checksum line 4 2026/10/02 06:30:59 NOTICE: test.sum: improperly formatted checksum line 5 2026/10/02 06:30:59 NOTICE: test.sum: improperly formatted checksum line 6 2026/10/02 06:30:59 NOTICE: test.sum: 2 warning(s) suppressed... 2026/10/02 06:30:59 NOTICE: test.sum: improperly formatted checksum line 4 2026/10/02 06:30:59 NOTICE: test.sum: improperly formatted checksum line 5 2026/10/02 06:30:59 NOTICE: test.sum: improperly formatted checksum line 6 2026/10/02 06:30:59 NOTICE: test.sum: 2 warning(s) suppressed... --- PASS: TestParseSumFile (5.43s) === RUN TestCheckSum run.go:198: Remote "Cloudinary root 'rclone-test-vacilat8foqu'", Local "Local file system at /tmp/rclone1719434886", Modify Window "876000h0m0s" 2026/10/02 06:31:01 DEBUG : Creating backend with remote "TestCloudinary:rclone-test-vacilat8foqu/data" 2026/10/02 06:31:01 DEBUG : Config file has changed externally - reloading === RUN TestCheckSum/subtest1 === NAME TestCheckSum check_test.go:408: Error Trace: /home/rclone/go/src/github.com/rclone/rclone/fs/operations/check_test.go:408 /home/rclone/go/src/github.com/rclone/rclone/fs/operations/check_test.go:432 Error: Received unexpected error: cannot open sum file: object not found Test: TestCheckSum Messages: unexpected error in run 1 check_test.go:417: Error Trace: /home/rclone/go/src/github.com/rclone/rclone/fs/operations/check_test.go:417 /home/rclone/go/src/github.com/rclone/rclone/fs/operations/check_test.go:432 Error: "" does not contain "matching files" Test: TestCheckSum Messages: missing matching files in run 1 check_test.go:419: Error Trace: /home/rclone/go/src/github.com/rclone/rclone/fs/operations/check_test.go:419 /home/rclone/go/src/github.com/rclone/rclone/fs/operations/check_test.go:432 Error: Not equal: expected: 1 actual : 0 Test: TestCheckSum Messages: wrong number of checks in run 1 check_test.go:388: Error Trace: /home/rclone/go/src/github.com/rclone/rclone/fs/operations/check_test.go:388 /home/rclone/go/src/github.com/rclone/rclone/fs/operations/check_test.go:421 /home/rclone/go/src/github.com/rclone/rclone/fs/operations/check_test.go:432 Error: Not equal: expected: []string{"", "= banana"} actual : []string{} Diff: --- Expected +++ Actual @@ -1,4 +1,2 @@ -([]string) (len=2) { - (string) "", - (string) (len=8) "= banana" +([]string) { } Test: TestCheckSum Messages: wrong combined result in run 1 check_test.go:388: Error Trace: /home/rclone/go/src/github.com/rclone/rclone/fs/operations/check_test.go:388 /home/rclone/go/src/github.com/rclone/rclone/fs/operations/check_test.go:424 /home/rclone/go/src/github.com/rclone/rclone/fs/operations/check_test.go:432 Error: Not equal: expected: []string{"", "banana"} actual : []string{} Diff: --- Expected +++ Actual @@ -1,4 +1,2 @@ -([]string) (len=2) { - (string) "", - (string) (len=6) "banana" +([]string) { } Test: TestCheckSum Messages: wrong match result in run 1 === RUN TestCheckSum/subtest2 === RUN TestCheckSum/subtest3 === NAME TestCheckSum check_test.go:408: Error Trace: /home/rclone/go/src/github.com/rclone/rclone/fs/operations/check_test.go:408 /home/rclone/go/src/github.com/rclone/rclone/fs/operations/check_test.go:432 Error: Received unexpected error: 1 differences found Test: TestCheckSum Messages: unexpected error in run 3 check_test.go:413: Error Trace: /home/rclone/go/src/github.com/rclone/rclone/fs/operations/check_test.go:413 /home/rclone/go/src/github.com/rclone/rclone/fs/operations/check_test.go:432 Error: Not equal: expected: 0 actual : 1 Test: TestCheckSum Messages: wrong error count in run 3 check_test.go:388: Error Trace: /home/rclone/go/src/github.com/rclone/rclone/fs/operations/check_test.go:388 /home/rclone/go/src/github.com/rclone/rclone/fs/operations/check_test.go:421 /home/rclone/go/src/github.com/rclone/rclone/fs/operations/check_test.go:432 Error: Not equal: expected: []string{"", "= banana", "= potato"} actual : []string{"", "- potato", "= banana"} Diff: --- Expected +++ Actual @@ -2,4 +2,4 @@ (string) "", - (string) (len=8) "= banana", - (string) (len=8) "= potato" + (string) (len=8) "- potato", + (string) (len=8) "= banana" } Test: TestCheckSum Messages: wrong combined result in run 3 check_test.go:388: Error Trace: /home/rclone/go/src/github.com/rclone/rclone/fs/operations/check_test.go:388 /home/rclone/go/src/github.com/rclone/rclone/fs/operations/check_test.go:422 /home/rclone/go/src/github.com/rclone/rclone/fs/operations/check_test.go:432 Error: Not equal: expected: []string{} actual : []string{"", "potato"} Diff: --- Expected +++ Actual @@ -1,2 +1,4 @@ -([]string) { +([]string) (len=2) { + (string) "", + (string) (len=6) "potato" } Test: TestCheckSum Messages: wrong missingonsrc result in run 3 check_test.go:388: Error Trace: /home/rclone/go/src/github.com/rclone/rclone/fs/operations/check_test.go:388 /home/rclone/go/src/github.com/rclone/rclone/fs/operations/check_test.go:424 /home/rclone/go/src/github.com/rclone/rclone/fs/operations/check_test.go:432 Error: Not equal: expected: []string{"", "banana", "potato"} actual : []string{"", "banana"} Diff: --- Expected +++ Actual @@ -1,5 +1,4 @@ -([]string) (len=3) { +([]string) (len=2) { (string) "", - (string) (len=6) "banana", - (string) (len=6) "potato" + (string) (len=6) "banana" } Test: TestCheckSum Messages: wrong match result in run 3 === RUN TestCheckSum/subtest4 === NAME TestCheckSum check_test.go:411: Error Trace: /home/rclone/go/src/github.com/rclone/rclone/fs/operations/check_test.go:411 /home/rclone/go/src/github.com/rclone/rclone/fs/operations/check_test.go:432 Error: An error is expected but got nil. Test: TestCheckSum Messages: no expected error in run 4 check_test.go:413: Error Trace: /home/rclone/go/src/github.com/rclone/rclone/fs/operations/check_test.go:413 /home/rclone/go/src/github.com/rclone/rclone/fs/operations/check_test.go:432 Error: Not equal: expected: 1 actual : 0 Test: TestCheckSum Messages: wrong error count in run 4 check_test.go:388: Error Trace: /home/rclone/go/src/github.com/rclone/rclone/fs/operations/check_test.go:388 /home/rclone/go/src/github.com/rclone/rclone/fs/operations/check_test.go:421 /home/rclone/go/src/github.com/rclone/rclone/fs/operations/check_test.go:432 Error: Not equal: expected: []string{"", "* banana", "= potato"} actual : []string{"", "= banana", "= potato"} Diff: --- Expected +++ Actual @@ -2,3 +2,3 @@ (string) "", - (string) (len=8) "* banana", + (string) (len=8) "= banana", (string) (len=8) "= potato" Test: TestCheckSum Messages: wrong combined result in run 4 check_test.go:388: Error Trace: /home/rclone/go/src/github.com/rclone/rclone/fs/operations/check_test.go:388 /home/rclone/go/src/github.com/rclone/rclone/fs/operations/check_test.go:424 /home/rclone/go/src/github.com/rclone/rclone/fs/operations/check_test.go:432 Error: Not equal: expected: []string{"", "potato"} actual : []string{"", "banana", "potato"} Diff: --- Expected +++ Actual @@ -1,3 +1,4 @@ -([]string) (len=2) { +([]string) (len=3) { (string) "", + (string) (len=6) "banana", (string) (len=6) "potato" Test: TestCheckSum Messages: wrong match result in run 4 check_test.go:388: Error Trace: /home/rclone/go/src/github.com/rclone/rclone/fs/operations/check_test.go:388 /home/rclone/go/src/github.com/rclone/rclone/fs/operations/check_test.go:425 /home/rclone/go/src/github.com/rclone/rclone/fs/operations/check_test.go:432 Error: Not equal: expected: []string{"", "banana"} actual : []string{} Diff: --- Expected +++ Actual @@ -1,4 +1,2 @@ -([]string) (len=2) { - (string) "", - (string) (len=6) "banana" +([]string) { } Test: TestCheckSum Messages: wrong differ result in run 4 === RUN TestCheckSum/subtest5 === NAME TestCheckSum check_test.go:411: Error Trace: /home/rclone/go/src/github.com/rclone/rclone/fs/operations/check_test.go:411 /home/rclone/go/src/github.com/rclone/rclone/fs/operations/check_test.go:432 Error: An error is expected but got nil. Test: TestCheckSum Messages: no expected error in run 5 check_test.go:413: Error Trace: /home/rclone/go/src/github.com/rclone/rclone/fs/operations/check_test.go:413 /home/rclone/go/src/github.com/rclone/rclone/fs/operations/check_test.go:432 Error: Not equal: expected: 1 actual : 0 Test: TestCheckSum Messages: wrong error count in run 5 check_test.go:388: Error Trace: /home/rclone/go/src/github.com/rclone/rclone/fs/operations/check_test.go:388 /home/rclone/go/src/github.com/rclone/rclone/fs/operations/check_test.go:421 /home/rclone/go/src/github.com/rclone/rclone/fs/operations/check_test.go:432 Error: Not equal: expected: []string{"", "+ orange", "= banana", "= potato"} actual : []string{"", "= banana", "= potato"} Diff: --- Expected +++ Actual @@ -1,4 +1,3 @@ -([]string) (len=4) { +([]string) (len=3) { (string) "", - (string) (len=8) "+ orange", (string) (len=8) "= banana", Test: TestCheckSum Messages: wrong combined result in run 5 check_test.go:388: Error Trace: /home/rclone/go/src/github.com/rclone/rclone/fs/operations/check_test.go:388 /home/rclone/go/src/github.com/rclone/rclone/fs/operations/check_test.go:423 /home/rclone/go/src/github.com/rclone/rclone/fs/operations/check_test.go:432 Error: Not equal: expected: []string{"", "orange"} actual : []string{} Diff: --- Expected +++ Actual @@ -1,4 +1,2 @@ -([]string) (len=2) { - (string) "", - (string) (len=6) "orange" +([]string) { } Test: TestCheckSum Messages: wrong missingondst result in run 5 === RUN TestCheckSum/subtest6 === NAME TestCheckSum check_test.go:411: Error Trace: /home/rclone/go/src/github.com/rclone/rclone/fs/operations/check_test.go:411 /home/rclone/go/src/github.com/rclone/rclone/fs/operations/check_test.go:432 Error: An error is expected but got nil. Test: TestCheckSum Messages: no expected error in run 6 check_test.go:413: Error Trace: /home/rclone/go/src/github.com/rclone/rclone/fs/operations/check_test.go:413 /home/rclone/go/src/github.com/rclone/rclone/fs/operations/check_test.go:432 Error: Not equal: expected: 2 actual : 0 Test: TestCheckSum Messages: wrong error count in run 6 check_test.go:388: Error Trace: /home/rclone/go/src/github.com/rclone/rclone/fs/operations/check_test.go:388 /home/rclone/go/src/github.com/rclone/rclone/fs/operations/check_test.go:421 /home/rclone/go/src/github.com/rclone/rclone/fs/operations/check_test.go:432 Error: Not equal: expected: []string{"", "* potato", "+ orange", "= banana"} actual : []string{"", "= banana", "= potato"} Diff: --- Expected +++ Actual @@ -1,6 +1,5 @@ -([]string) (len=4) { +([]string) (len=3) { (string) "", - (string) (len=8) "* potato", - (string) (len=8) "+ orange", - (string) (len=8) "= banana" + (string) (len=8) "= banana", + (string) (len=8) "= potato" } Test: TestCheckSum Messages: wrong combined result in run 6 check_test.go:388: Error Trace: /home/rclone/go/src/github.com/rclone/rclone/fs/operations/check_test.go:388 /home/rclone/go/src/github.com/rclone/rclone/fs/operations/check_test.go:423 /home/rclone/go/src/github.com/rclone/rclone/fs/operations/check_test.go:432 Error: Not equal: expected: []string{"", "orange"} actual : []string{} Diff: --- Expected +++ Actual @@ -1,4 +1,2 @@ -([]string) (len=2) { - (string) "", - (string) (len=6) "orange" +([]string) { } Test: TestCheckSum Messages: wrong missingondst result in run 6 check_test.go:388: Error Trace: /home/rclone/go/src/github.com/rclone/rclone/fs/operations/check_test.go:388 /home/rclone/go/src/github.com/rclone/rclone/fs/operations/check_test.go:424 /home/rclone/go/src/github.com/rclone/rclone/fs/operations/check_test.go:432 Error: Not equal: expected: []string{"", "banana"} actual : []string{"", "banana", "potato"} Diff: --- Expected +++ Actual @@ -1,4 +1,5 @@ -([]string) (len=2) { +([]string) (len=3) { (string) "", - (string) (len=6) "banana" + (string) (len=6) "banana", + (string) (len=6) "potato" } Test: TestCheckSum Messages: wrong match result in run 6 check_test.go:388: Error Trace: /home/rclone/go/src/github.com/rclone/rclone/fs/operations/check_test.go:388 /home/rclone/go/src/github.com/rclone/rclone/fs/operations/check_test.go:425 /home/rclone/go/src/github.com/rclone/rclone/fs/operations/check_test.go:432 Error: Not equal: expected: []string{"", "potato"} actual : []string{} Diff: --- Expected +++ Actual @@ -1,4 +1,2 @@ -([]string) (len=2) { - (string) "", - (string) (len=6) "potato" +([]string) { } Test: TestCheckSum Messages: wrong differ result in run 6 === RUN TestCheckSum/subtest7 --- FAIL: TestCheckSum (18.59s) --- PASS: TestCheckSum/subtest1 (0.22s) --- PASS: TestCheckSum/subtest2 (0.84s) --- PASS: TestCheckSum/subtest3 (0.56s) --- PASS: TestCheckSum/subtest4 (0.96s) --- PASS: TestCheckSum/subtest5 (0.50s) --- PASS: TestCheckSum/subtest6 (0.67s) --- PASS: TestCheckSum/subtest7 (0.87s) === RUN TestCheckSumDownload run.go:198: Remote "Cloudinary root 'rclone-test-vacilat8foqu'", Local "Local file system at /tmp/rclone1719434886", Modify Window "876000h0m0s" 2026/10/02 06:31:19 DEBUG : Creating backend with remote "TestCloudinary:rclone-test-vacilat8foqu/data" === RUN TestCheckSumDownload/subtest1 === NAME TestCheckSumDownload check_test.go:408: Error Trace: /home/rclone/go/src/github.com/rclone/rclone/fs/operations/check_test.go:408 /home/rclone/go/src/github.com/rclone/rclone/fs/operations/check_test.go:432 Error: Received unexpected error: cannot open sum file: object not found Test: TestCheckSumDownload Messages: unexpected error in run 1 check_test.go:417: Error Trace: /home/rclone/go/src/github.com/rclone/rclone/fs/operations/check_test.go:417 /home/rclone/go/src/github.com/rclone/rclone/fs/operations/check_test.go:432 Error: "" does not contain "matching files" Test: TestCheckSumDownload Messages: missing matching files in run 1 check_test.go:419: Error Trace: /home/rclone/go/src/github.com/rclone/rclone/fs/operations/check_test.go:419 /home/rclone/go/src/github.com/rclone/rclone/fs/operations/check_test.go:432 Error: Not equal: expected: 1 actual : 0 Test: TestCheckSumDownload Messages: wrong number of checks in run 1 check_test.go:388: Error Trace: /home/rclone/go/src/github.com/rclone/rclone/fs/operations/check_test.go:388 /home/rclone/go/src/github.com/rclone/rclone/fs/operations/check_test.go:421 /home/rclone/go/src/github.com/rclone/rclone/fs/operations/check_test.go:432 Error: Not equal: expected: []string{"", "= banana"} actual : []string{} Diff: --- Expected +++ Actual @@ -1,4 +1,2 @@ -([]string) (len=2) { - (string) "", - (string) (len=8) "= banana" +([]string) { } Test: TestCheckSumDownload Messages: wrong combined result in run 1 check_test.go:388: Error Trace: /home/rclone/go/src/github.com/rclone/rclone/fs/operations/check_test.go:388 /home/rclone/go/src/github.com/rclone/rclone/fs/operations/check_test.go:424 /home/rclone/go/src/github.com/rclone/rclone/fs/operations/check_test.go:432 Error: Not equal: expected: []string{"", "banana"} actual : []string{} Diff: --- Expected +++ Actual @@ -1,4 +1,2 @@ -([]string) (len=2) { - (string) "", - (string) (len=6) "banana" +([]string) { } Test: TestCheckSumDownload Messages: wrong match result in run 1 === RUN TestCheckSumDownload/subtest2 === NAME TestCheckSumDownload check_test.go:413: Error Trace: /home/rclone/go/src/github.com/rclone/rclone/fs/operations/check_test.go:413 /home/rclone/go/src/github.com/rclone/rclone/fs/operations/check_test.go:432 Error: Not equal: expected: 1 actual : 0 Test: TestCheckSumDownload Messages: wrong error count in run 2 check_test.go:417: Error Trace: /home/rclone/go/src/github.com/rclone/rclone/fs/operations/check_test.go:417 /home/rclone/go/src/github.com/rclone/rclone/fs/operations/check_test.go:432 Error: "" does not contain "matching files" Test: TestCheckSumDownload Messages: missing matching files in run 2 check_test.go:419: Error Trace: /home/rclone/go/src/github.com/rclone/rclone/fs/operations/check_test.go:419 /home/rclone/go/src/github.com/rclone/rclone/fs/operations/check_test.go:432 Error: Not equal: expected: 2 actual : 0 Test: TestCheckSumDownload Messages: wrong number of checks in run 2 check_test.go:388: Error Trace: /home/rclone/go/src/github.com/rclone/rclone/fs/operations/check_test.go:388 /home/rclone/go/src/github.com/rclone/rclone/fs/operations/check_test.go:421 /home/rclone/go/src/github.com/rclone/rclone/fs/operations/check_test.go:432 Error: Not equal: expected: []string{"", "- potato", "= banana"} actual : []string{} Diff: --- Expected +++ Actual @@ -1,5 +1,2 @@ -([]string) (len=3) { - (string) "", - (string) (len=8) "- potato", - (string) (len=8) "= banana" +([]string) { } Test: TestCheckSumDownload Messages: wrong combined result in run 2 check_test.go:388: Error Trace: /home/rclone/go/src/github.com/rclone/rclone/fs/operations/check_test.go:388 /home/rclone/go/src/github.com/rclone/rclone/fs/operations/check_test.go:422 /home/rclone/go/src/github.com/rclone/rclone/fs/operations/check_test.go:432 Error: Not equal: expected: []string{"", "potato"} actual : []string{} Diff: --- Expected +++ Actual @@ -1,4 +1,2 @@ -([]string) (len=2) { - (string) "", - (string) (len=6) "potato" +([]string) { } Test: TestCheckSumDownload Messages: wrong missingonsrc result in run 2 check_test.go:388: Error Trace: /home/rclone/go/src/github.com/rclone/rclone/fs/operations/check_test.go:388 /home/rclone/go/src/github.com/rclone/rclone/fs/operations/check_test.go:424 /home/rclone/go/src/github.com/rclone/rclone/fs/operations/check_test.go:432 Error: Not equal: expected: []string{"", "banana"} actual : []string{} Diff: --- Expected +++ Actual @@ -1,4 +1,2 @@ -([]string) (len=2) { - (string) "", - (string) (len=6) "banana" +([]string) { } Test: TestCheckSumDownload Messages: wrong match result in run 2 === RUN TestCheckSumDownload/subtest3 === RUN TestCheckSumDownload/subtest4 === RUN TestCheckSumDownload/subtest5 === RUN TestCheckSumDownload/subtest6 === RUN TestCheckSumDownload/subtest7 --- FAIL: TestCheckSumDownload (18.83s) --- PASS: TestCheckSumDownload/subtest1 (0.16s) --- PASS: TestCheckSumDownload/subtest2 (0.17s) --- PASS: TestCheckSumDownload/subtest3 (1.06s) --- PASS: TestCheckSumDownload/subtest4 (0.75s) --- PASS: TestCheckSumDownload/subtest5 (0.91s) --- PASS: TestCheckSumDownload/subtest6 (0.89s) --- PASS: TestCheckSumDownload/subtest7 (0.93s) === RUN TestCheckSumConcurrency 2026/10/02 06:31:38 DEBUG : file0: md5 = 022eb0c0085c731f335df970fafa7446 OK 2026/10/02 06:31:38 DEBUG : file2: md5 = a58f09ae3db8ae4b943fdbaace096072 OK 2026/10/02 06:31:38 DEBUG : file1: md5 = 17fbabbccbdea0e6be9eb64c8c6fea41 OK 2026/10/02 06:31:38 DEBUG : file3: md5 = e0639b17e0744aca9a3ba29c049e59ee OK 2026/10/02 06:31:38 NOTICE: Mock file system at checkSum: 0 differences found 2026/10/02 06:31:38 NOTICE: Mock file system at checkSum: 4 matching files --- PASS: TestCheckSumConcurrency (0.00s) === RUN TestCheckSumDownloadConcurrency 2026/10/02 06:31:38 DEBUG : file0: md5 = 022eb0c0085c731f335df970fafa7446 OK 2026/10/02 06:31:38 DEBUG : file1: md5 = 17fbabbccbdea0e6be9eb64c8c6fea41 OK 2026/10/02 06:31:38 DEBUG : file2: md5 = a58f09ae3db8ae4b943fdbaace096072 OK 2026/10/02 06:31:38 DEBUG : file3: md5 = e0639b17e0744aca9a3ba29c049e59ee OK 2026/10/02 06:31:38 NOTICE: Mock file system at checkSum: 0 differences found 2026/10/02 06:31:38 NOTICE: Mock file system at checkSum: 4 matching files --- PASS: TestCheckSumDownloadConcurrency (0.00s) === RUN TestApplyTransforms 2026/10/02 06:31:38 DEBUG : Creating backend with remote "TestCloudinary:rclone-test-nigatoc1dihi" 2026/10/02 06:31:38 DEBUG : Using config file from "/home/rclone/.rclone.conf" 2026/10/02 06:31:38 DEBUG : Creating backend with remote "/tmp/rclone2565964301" run.go:198: Remote "Cloudinary root 'rclone-test-nigatoc1dihi'", Local "Local file system at /tmp/rclone2565964301", Modify Window "876000h0m0s" upper checkfile vs. lower remote (without normalization) 2026/10/02 06:31:40 ERROR : hello, world!: sum not found 2026/10/02 06:31:40 ERROR : HELLO, WORLD!: file not in Cloudinary root 'rclone-test-nigatoc1dihi' 2026/10/02 06:31:40 NOTICE: Cloudinary root 'rclone-test-nigatoc1dihi': 1 files missing 2026/10/02 06:31:40 NOTICE: 1 hashes missing 2026/10/02 06:31:40 NOTICE: Cloudinary root 'rclone-test-nigatoc1dihi': 1 differences found 2026/10/02 06:31:40 NOTICE: Cloudinary root 'rclone-test-nigatoc1dihi': 2 errors while checking upper checkfile vs. lower remote (with normalization) 2026/10/02 06:31:40 DEBUG : hello, world!: md5 = 65a8e27d8879283831b664bd8b7f0ad4 OK 2026/10/02 06:31:40 NOTICE: Cloudinary root 'rclone-test-nigatoc1dihi': 0 differences found 2026/10/02 06:31:40 NOTICE: Cloudinary root 'rclone-test-nigatoc1dihi': 1 matching files 2026/10/02 06:31:40 DEBUG : Creating backend with remote "TestCloudinary:rclone-test-xaheqam8leyu" 2026/10/02 06:31:40 DEBUG : Using config file from "/home/rclone/.rclone.conf" 2026/10/02 06:31:41 DEBUG : Creating backend with remote "/tmp/rclone1855528603" run.go:198: Remote "Cloudinary root 'rclone-test-xaheqam8leyu'", Local "Local file system at /tmp/rclone1855528603", Modify Window "876000h0m0s" lower checkfile vs. upper remote (without normalization) 2026/10/02 06:31:42 ERROR : HELLO, WORLD!: sum not found 2026/10/02 06:31:42 ERROR : hello, world!: file not in Cloudinary root 'rclone-test-xaheqam8leyu' 2026/10/02 06:31:42 NOTICE: Cloudinary root 'rclone-test-xaheqam8leyu': 1 files missing 2026/10/02 06:31:42 NOTICE: 1 hashes missing 2026/10/02 06:31:42 NOTICE: Cloudinary root 'rclone-test-xaheqam8leyu': 1 differences found 2026/10/02 06:31:42 NOTICE: Cloudinary root 'rclone-test-xaheqam8leyu': 2 errors while checking lower checkfile vs. upper remote (with normalization) 2026/10/02 06:31:43 DEBUG : HELLO, WORLD!: md5 = 65a8e27d8879283831b664bd8b7f0ad4 OK 2026/10/02 06:31:43 NOTICE: Cloudinary root 'rclone-test-xaheqam8leyu': 0 differences found 2026/10/02 06:31:43 NOTICE: Cloudinary root 'rclone-test-xaheqam8leyu': 1 matching files 2026/10/02 06:31:43 DEBUG : Creating backend with remote "TestCloudinary:rclone-test-leluxoc5laye" 2026/10/02 06:31:43 DEBUG : Using config file from "/home/rclone/.rclone.conf" 2026/10/02 06:31:43 DEBUG : Creating backend with remote "/tmp/rclone536211976" run.go:198: Remote "Cloudinary root 'rclone-test-leluxoc5laye'", Local "Local file system at /tmp/rclone536211976", Modify Window "876000h0m0s" lower checkfile vs. upperlowermixed remote (without normalization) 2026/10/02 06:31:45 ERROR : HeLlO, wOrLd!: sum not found 2026/10/02 06:31:45 ERROR : hello, world!: file not in Cloudinary root 'rclone-test-leluxoc5laye' 2026/10/02 06:31:45 NOTICE: Cloudinary root 'rclone-test-leluxoc5laye': 1 files missing 2026/10/02 06:31:45 NOTICE: 1 hashes missing 2026/10/02 06:31:45 NOTICE: Cloudinary root 'rclone-test-leluxoc5laye': 1 differences found 2026/10/02 06:31:45 NOTICE: Cloudinary root 'rclone-test-leluxoc5laye': 2 errors while checking lower checkfile vs. upperlowermixed remote (with normalization) 2026/10/02 06:31:45 DEBUG : HeLlO, wOrLd!: md5 = 65a8e27d8879283831b664bd8b7f0ad4 OK 2026/10/02 06:31:45 NOTICE: Cloudinary root 'rclone-test-leluxoc5laye': 0 differences found 2026/10/02 06:31:45 NOTICE: Cloudinary root 'rclone-test-leluxoc5laye': 1 matching files 2026/10/02 06:31:45 DEBUG : Creating backend with remote "TestCloudinary:rclone-test-kaxidir7jusu" 2026/10/02 06:31:45 DEBUG : Using config file from "/home/rclone/.rclone.conf" 2026/10/02 06:31:46 DEBUG : Creating backend with remote "/tmp/rclone468157642" run.go:198: Remote "Cloudinary root 'rclone-test-kaxidir7jusu'", Local "Local file system at /tmp/rclone468157642", Modify Window "876000h0m0s" upperlowermixed checkfile vs. upper remote (without normalization) 2026/10/02 06:31:47 ERROR : HELLO, WORLD!: sum not found 2026/10/02 06:31:47 ERROR : HeLlO, wOrLd!: file not in Cloudinary root 'rclone-test-kaxidir7jusu' 2026/10/02 06:31:47 NOTICE: Cloudinary root 'rclone-test-kaxidir7jusu': 1 files missing 2026/10/02 06:31:47 NOTICE: 1 hashes missing 2026/10/02 06:31:47 NOTICE: Cloudinary root 'rclone-test-kaxidir7jusu': 1 differences found 2026/10/02 06:31:47 NOTICE: Cloudinary root 'rclone-test-kaxidir7jusu': 2 errors while checking upperlowermixed checkfile vs. upper remote (with normalization) 2026/10/02 06:31:47 DEBUG : HELLO, WORLD!: md5 = 65a8e27d8879283831b664bd8b7f0ad4 OK 2026/10/02 06:31:47 NOTICE: Cloudinary root 'rclone-test-kaxidir7jusu': 0 differences found 2026/10/02 06:31:47 NOTICE: Cloudinary root 'rclone-test-kaxidir7jusu': 1 matching files 2026/10/02 06:31:47 DEBUG : Creating backend with remote "TestCloudinary:rclone-test-nenikat3wuku" 2026/10/02 06:31:47 DEBUG : Using config file from "/home/rclone/.rclone.conf" 2026/10/02 06:31:48 DEBUG : Creating backend with remote "/tmp/rclone1135804895" run.go:198: Remote "Cloudinary root 'rclone-test-nenikat3wuku'", Local "Local file system at /tmp/rclone1135804895", Modify Window "876000h0m0s" NFD checkfile vs. NFC remote (without normalization) 2026/10/02 06:31:50 ERROR : 測試_Русский___ě_áñ: sum not found 2026/10/02 06:31:50 ERROR : 測試_Русский___ě_áñ: file not in Cloudinary root 'rclone-test-nenikat3wuku' 2026/10/02 06:31:50 NOTICE: Cloudinary root 'rclone-test-nenikat3wuku': 1 files missing 2026/10/02 06:31:50 NOTICE: 1 hashes missing 2026/10/02 06:31:50 NOTICE: Cloudinary root 'rclone-test-nenikat3wuku': 1 differences found 2026/10/02 06:31:50 NOTICE: Cloudinary root 'rclone-test-nenikat3wuku': 2 errors while checking NFD checkfile vs. NFC remote (with normalization) 2026/10/02 06:31:50 DEBUG : 測試_Русский___ě_áñ: md5 = 65a8e27d8879283831b664bd8b7f0ad4 OK 2026/10/02 06:31:50 NOTICE: Cloudinary root 'rclone-test-nenikat3wuku': 0 differences found 2026/10/02 06:31:50 NOTICE: Cloudinary root 'rclone-test-nenikat3wuku': 1 matching files 2026/10/02 06:31:50 DEBUG : Creating backend with remote "TestCloudinary:rclone-test-nobitof9dasa" 2026/10/02 06:31:50 DEBUG : Using config file from "/home/rclone/.rclone.conf" 2026/10/02 06:31:50 DEBUG : Creating backend with remote "/tmp/rclone4117867899" run.go:198: Remote "Cloudinary root 'rclone-test-nobitof9dasa'", Local "Local file system at /tmp/rclone4117867899", Modify Window "876000h0m0s" NFC checkfile vs. NFD remote (without normalization) 2026/10/02 06:31:52 ERROR : 測試_Русский___ě_áñ: sum not found 2026/10/02 06:31:52 ERROR : 測試_Русский___ě_áñ: file not in Cloudinary root 'rclone-test-nobitof9dasa' 2026/10/02 06:31:52 NOTICE: Cloudinary root 'rclone-test-nobitof9dasa': 1 files missing 2026/10/02 06:31:52 NOTICE: 1 hashes missing 2026/10/02 06:31:52 NOTICE: Cloudinary root 'rclone-test-nobitof9dasa': 1 differences found 2026/10/02 06:31:52 NOTICE: Cloudinary root 'rclone-test-nobitof9dasa': 2 errors while checking NFC checkfile vs. NFD remote (with normalization) 2026/10/02 06:31:52 DEBUG : 測試_Русский___ě_áñ: md5 = 65a8e27d8879283831b664bd8b7f0ad4 OK 2026/10/02 06:31:52 NOTICE: Cloudinary root 'rclone-test-nobitof9dasa': 0 differences found 2026/10/02 06:31:52 NOTICE: Cloudinary root 'rclone-test-nobitof9dasa': 1 matching files 2026/10/02 06:31:52 DEBUG : Creating backend with remote "TestCloudinary:rclone-test-neladov1covi" 2026/10/02 06:31:52 DEBUG : Using config file from "/home/rclone/.rclone.conf" 2026/10/02 06:31:53 DEBUG : Creating backend with remote "/tmp/rclone1887840885" run.go:198: Remote "Cloudinary root 'rclone-test-neladov1covi'", Local "Local file system at /tmp/rclone1887840885", Modify Window "876000h0m0s" NFDx2 checkfile vs. both remote (without normalization) 2026/10/02 06:31:54 ERROR : 測試_Русский___ě_áñ測試_Русский___ě_áñ: sum not found 2026/10/02 06:31:54 ERROR : 測試_Русский___ě_áñ測試_Русский___ě_áñ: file not in Cloudinary root 'rclone-test-neladov1covi' 2026/10/02 06:31:54 NOTICE: Cloudinary root 'rclone-test-neladov1covi': 1 files missing 2026/10/02 06:31:54 NOTICE: 1 hashes missing 2026/10/02 06:31:54 NOTICE: Cloudinary root 'rclone-test-neladov1covi': 1 differences found 2026/10/02 06:31:54 NOTICE: Cloudinary root 'rclone-test-neladov1covi': 2 errors while checking NFDx2 checkfile vs. both remote (with normalization) 2026/10/02 06:31:55 DEBUG : 測試_Русский___ě_áñ測試_Русский___ě_áñ: md5 = 65a8e27d8879283831b664bd8b7f0ad4 OK 2026/10/02 06:31:55 NOTICE: Cloudinary root 'rclone-test-neladov1covi': 0 differences found 2026/10/02 06:31:55 NOTICE: Cloudinary root 'rclone-test-neladov1covi': 1 matching files 2026/10/02 06:31:55 DEBUG : Creating backend with remote "TestCloudinary:rclone-test-qifejul2bima" 2026/10/02 06:31:55 DEBUG : Using config file from "/home/rclone/.rclone.conf" 2026/10/02 06:31:55 DEBUG : Creating backend with remote "/tmp/rclone3549594618" run.go:198: Remote "Cloudinary root 'rclone-test-qifejul2bima'", Local "Local file system at /tmp/rclone3549594618", Modify Window "876000h0m0s" NFCx2 checkfile vs. both remote (without normalization) 2026/10/02 06:31:57 ERROR : 測試_Русский___ě_áñ測試_Русский___ě_áñ: sum not found 2026/10/02 06:31:57 ERROR : 測試_Русский___ě_áñ測試_Русский___ě_áñ: file not in Cloudinary root 'rclone-test-qifejul2bima' 2026/10/02 06:31:57 NOTICE: Cloudinary root 'rclone-test-qifejul2bima': 1 files missing 2026/10/02 06:31:57 NOTICE: 1 hashes missing 2026/10/02 06:31:57 NOTICE: Cloudinary root 'rclone-test-qifejul2bima': 1 differences found 2026/10/02 06:31:57 NOTICE: Cloudinary root 'rclone-test-qifejul2bima': 2 errors while checking NFCx2 checkfile vs. both remote (with normalization) 2026/10/02 06:31:57 DEBUG : 測試_Русский___ě_áñ測試_Русский___ě_áñ: md5 = 65a8e27d8879283831b664bd8b7f0ad4 OK 2026/10/02 06:31:57 NOTICE: Cloudinary root 'rclone-test-qifejul2bima': 0 differences found 2026/10/02 06:31:57 NOTICE: Cloudinary root 'rclone-test-qifejul2bima': 1 matching files 2026/10/02 06:31:57 DEBUG : Creating backend with remote "TestCloudinary:rclone-test-tuvezub5zoxu" 2026/10/02 06:31:57 DEBUG : Using config file from "/home/rclone/.rclone.conf" 2026/10/02 06:31:58 DEBUG : Creating backend with remote "/tmp/rclone1601756469" run.go:198: Remote "Cloudinary root 'rclone-test-tuvezub5zoxu'", Local "Local file system at /tmp/rclone1601756469", Modify Window "876000h0m0s" both checkfile vs. NFDx2 remote (without normalization) 2026/10/02 06:31:59 ERROR : 測試_Русский___ě_áñ測試_Русский___ě_áñ: sum not found 2026/10/02 06:31:59 ERROR : 測試_Русский___ě_áñ測試_Русский___ě_áñ: file not in Cloudinary root 'rclone-test-tuvezub5zoxu' 2026/10/02 06:31:59 NOTICE: Cloudinary root 'rclone-test-tuvezub5zoxu': 1 files missing 2026/10/02 06:31:59 NOTICE: 1 hashes missing 2026/10/02 06:31:59 NOTICE: Cloudinary root 'rclone-test-tuvezub5zoxu': 1 differences found 2026/10/02 06:31:59 NOTICE: Cloudinary root 'rclone-test-tuvezub5zoxu': 2 errors while checking both checkfile vs. NFDx2 remote (with normalization) 2026/10/02 06:32:00 DEBUG : 測試_Русский___ě_áñ測試_Русский___ě_áñ: md5 = 65a8e27d8879283831b664bd8b7f0ad4 OK 2026/10/02 06:32:00 NOTICE: Cloudinary root 'rclone-test-tuvezub5zoxu': 0 differences found 2026/10/02 06:32:00 NOTICE: Cloudinary root 'rclone-test-tuvezub5zoxu': 1 matching files 2026/10/02 06:32:00 DEBUG : Creating backend with remote "TestCloudinary:rclone-test-juleqid5xawo" 2026/10/02 06:32:00 DEBUG : Using config file from "/home/rclone/.rclone.conf" 2026/10/02 06:32:00 DEBUG : Creating backend with remote "/tmp/rclone729479980" run.go:198: Remote "Cloudinary root 'rclone-test-juleqid5xawo'", Local "Local file system at /tmp/rclone729479980", Modify Window "876000h0m0s" both checkfile vs. NFCx2 remote (without normalization) 2026/10/02 06:32:02 ERROR : 測試_Русский___ě_áñ測試_Русский___ě_áñ: sum not found 2026/10/02 06:32:02 ERROR : 測試_Русский___ě_áñ測試_Русский___ě_áñ: file not in Cloudinary root 'rclone-test-juleqid5xawo' 2026/10/02 06:32:02 NOTICE: Cloudinary root 'rclone-test-juleqid5xawo': 1 files missing 2026/10/02 06:32:02 NOTICE: 1 hashes missing 2026/10/02 06:32:02 NOTICE: Cloudinary root 'rclone-test-juleqid5xawo': 1 differences found 2026/10/02 06:32:02 NOTICE: Cloudinary root 'rclone-test-juleqid5xawo': 2 errors while checking both checkfile vs. NFCx2 remote (with normalization) 2026/10/02 06:32:02 DEBUG : 測試_Русский___ě_áñ測試_Русский___ě_áñ: md5 = 65a8e27d8879283831b664bd8b7f0ad4 OK 2026/10/02 06:32:02 NOTICE: Cloudinary root 'rclone-test-juleqid5xawo': 0 differences found 2026/10/02 06:32:02 NOTICE: Cloudinary root 'rclone-test-juleqid5xawo': 1 matching files 2026/10/02 06:32:03 DEBUG : Cloudinary root 'rclone-test-juleqid5xawo': Purge object "測試_Русский___ě_áñ測試_Русский___ě_áñ" 2026/10/02 06:32:03 DEBUG : Cloudinary root 'rclone-test-juleqid5xawo': Purge dir "" 2026/10/02 06:32:04 DEBUG : Cloudinary root 'rclone-test-tuvezub5zoxu': Purge object "測試_Русский___ě_áñ測試_Русский___ě_áñ" 2026/10/02 06:32:04 DEBUG : Cloudinary root 'rclone-test-tuvezub5zoxu': Purge dir "" 2026/10/02 06:32:05 DEBUG : Cloudinary root 'rclone-test-qifejul2bima': Purge object "測試_Русский___ě_áñ測試_Русский___ě_áñ" 2026/10/02 06:32:05 DEBUG : Cloudinary root 'rclone-test-qifejul2bima': Purge dir "" 2026/10/02 06:32:06 DEBUG : Cloudinary root 'rclone-test-neladov1covi': Purge object "測試_Русский___ě_áñ測試_Русский___ě_áñ" 2026/10/02 06:32:06 DEBUG : Cloudinary root 'rclone-test-neladov1covi': Purge dir "" 2026/10/02 06:32:07 DEBUG : Cloudinary root 'rclone-test-nobitof9dasa': Purge object "測試_Русский___ě_áñ" 2026/10/02 06:32:07 DEBUG : Cloudinary root 'rclone-test-nobitof9dasa': Purge dir "" 2026/10/02 06:32:08 DEBUG : Cloudinary root 'rclone-test-nenikat3wuku': Purge object "測試_Русский___ě_áñ" 2026/10/02 06:32:08 DEBUG : Cloudinary root 'rclone-test-nenikat3wuku': Purge dir "" 2026/10/02 06:32:09 DEBUG : Cloudinary root 'rclone-test-kaxidir7jusu': Purge object "HELLO, WORLD!" 2026/10/02 06:32:09 DEBUG : Cloudinary root 'rclone-test-kaxidir7jusu': Purge dir "" 2026/10/02 06:32:10 DEBUG : Cloudinary root 'rclone-test-leluxoc5laye': Purge object "HeLlO, wOrLd!" 2026/10/02 06:32:10 DEBUG : Cloudinary root 'rclone-test-leluxoc5laye': Purge dir "" 2026/10/02 06:32:11 DEBUG : Cloudinary root 'rclone-test-xaheqam8leyu': Purge object "HELLO, WORLD!" 2026/10/02 06:32:11 DEBUG : Cloudinary root 'rclone-test-xaheqam8leyu': Purge dir "" 2026/10/02 06:32:12 DEBUG : Cloudinary root 'rclone-test-nigatoc1dihi': Purge object "hello, world!" 2026/10/02 06:32:12 DEBUG : Cloudinary root 'rclone-test-nigatoc1dihi': Purge dir "" --- PASS: TestApplyTransforms (34.50s) === RUN TestTruncateString --- PASS: TestTruncateString (0.00s) === RUN TestCopyFile run.go:198: Remote "Cloudinary root 'rclone-test-vacilat8foqu'", Local "Local file system at /tmp/rclone1719434886", Modify Window "876000h0m0s" 2026/10/02 06:32:13 DEBUG : file1: Need to transfer - File not found at Destination 2026/10/02 06:32:13 DEBUG : sub/file2: size = 14 OK 2026/10/02 06:32:13 DEBUG : file1: md5 = 0ef726ce9b1a7692357ff70dd321d595 OK 2026/10/02 06:32:13 INFO : file1: Copied (new) to: sub/file2 2026/10/02 06:32:14 DEBUG : file1: Need to transfer - File not found at Destination 2026/10/02 06:32:14 DEBUG : sub/file2: size = 14 OK 2026/10/02 06:32:14 DEBUG : file1: md5 = 0ef726ce9b1a7692357ff70dd321d595 OK 2026/10/02 06:32:14 INFO : file1: Copied (new) to: sub/file2 2026/10/02 06:32:15 DEBUG : Cloudinary root 'rclone-test-vacilat8foqu': don't need to copy/move sub/file2, it is already at target location --- PASS: TestCopyFile (5.13s) === RUN TestCopyFileImmutable run.go:198: Remote "Cloudinary root 'rclone-test-vacilat8foqu'", Local "Local file system at /tmp/rclone1719434886", Modify Window "876000h0m0s" 2026/10/02 06:32:18 DEBUG : existing: Need to transfer - File not found at Destination 2026/10/02 06:32:18 DEBUG : existing: size = 6 OK 2026/10/02 06:32:18 DEBUG : existing: md5 = 8ee2027983915ec78acc45027d874316 OK 2026/10/02 06:32:18 INFO : existing: Copied (new) 2026/10/02 06:32:19 DEBUG : existing: Need to transfer - File not found at Destination 2026/10/02 06:32:19 DEBUG : existing: size = 6 OK 2026/10/02 06:32:19 DEBUG : existing: md5 = 8ee2027983915ec78acc45027d874316 OK 2026/10/02 06:32:19 INFO : existing: Copied (new) 2026/10/02 06:32:20 DEBUG : existing: Need to transfer - File not found at Destination 2026/10/02 06:32:20 DEBUG : existing: size = 8 OK 2026/10/02 06:32:20 DEBUG : existing: md5 = 53f8d64113036808686b056cc0b0f649 OK 2026/10/02 06:32:20 INFO : existing: Copied (new) copy_test.go:153: Error Trace: /home/rclone/go/src/github.com/rclone/rclone/fs/operations/copy_test.go:153 Error: Expected error with "immutable file modified" in chain but got nil. Test: TestCopyFileImmutable fstest.go:299: Sleeping for 1s for list eventual consistency: 1/5 fstest.go:299: Sleeping for 2s for list eventual consistency: 2/5 fstest.go:299: Sleeping for 4s for list eventual consistency: 3/5 fstest.go:299: Sleeping for 8s for list eventual consistency: 4/5 fstest.go:299: Sleeping for 16s for list eventual consistency: 5/5 fstest.go:306: Error Trace: /home/rclone/go/src/github.com/rclone/rclone/fstest/fstest.go:306 /home/rclone/go/src/github.com/rclone/rclone/fstest/fstest.go:339 /home/rclone/go/src/github.com/rclone/rclone/fstest/fstest.go:351 /home/rclone/go/src/github.com/rclone/rclone/fstest/run.go:358 /home/rclone/go/src/github.com/rclone/rclone/fs/operations/copy_test.go:155 Error: Should be true Test: TestCopyFileImmutable Messages: listing wrong, want existing (6) got existing (8) fstest.go:151: Error Trace: /home/rclone/go/src/github.com/rclone/rclone/fstest/fstest.go:151 /home/rclone/go/src/github.com/rclone/rclone/fstest/fstest.go:196 /home/rclone/go/src/github.com/rclone/rclone/fstest/fstest.go:309 /home/rclone/go/src/github.com/rclone/rclone/fstest/fstest.go:339 /home/rclone/go/src/github.com/rclone/rclone/fstest/fstest.go:351 /home/rclone/go/src/github.com/rclone/rclone/fstest/run.go:358 /home/rclone/go/src/github.com/rclone/rclone/fs/operations/copy_test.go:155 Error: Not equal: expected: 6 actual : 8 Test: TestCopyFileImmutable Messages: existing: size incorrect file=6 vs obj=8 fstest.go:299: Sleeping for 1s for list eventual consistency: 1/5 fstest.go:299: Sleeping for 2s for list eventual consistency: 2/5 fstest.go:299: Sleeping for 4s for list eventual consistency: 3/5 fstest.go:299: Sleeping for 8s for list eventual consistency: 4/5 fstest.go:299: Sleeping for 16s for list eventual consistency: 5/5 fstest.go:306: Error Trace: /home/rclone/go/src/github.com/rclone/rclone/fstest/fstest.go:306 /home/rclone/go/src/github.com/rclone/rclone/fstest/fstest.go:339 /home/rclone/go/src/github.com/rclone/rclone/fstest/fstest.go:351 /home/rclone/go/src/github.com/rclone/rclone/fstest/run.go:358 /home/rclone/go/src/github.com/rclone/rclone/fs/operations/copy_test.go:160 Error: Should be true Test: TestCopyFileImmutable Messages: listing wrong, want existing (6) got existing (8) fstest.go:151: Error Trace: /home/rclone/go/src/github.com/rclone/rclone/fstest/fstest.go:151 /home/rclone/go/src/github.com/rclone/rclone/fstest/fstest.go:196 /home/rclone/go/src/github.com/rclone/rclone/fstest/fstest.go:309 /home/rclone/go/src/github.com/rclone/rclone/fstest/fstest.go:339 /home/rclone/go/src/github.com/rclone/rclone/fstest/fstest.go:351 /home/rclone/go/src/github.com/rclone/rclone/fstest/run.go:358 /home/rclone/go/src/github.com/rclone/rclone/fs/operations/copy_test.go:160 Error: Not equal: expected: 6 actual : 8 Test: TestCopyFileImmutable Messages: existing: size incorrect file=6 vs obj=8 --- FAIL: TestCopyFileImmutable (69.10s) === RUN TestCopyLongFile run.go:198: Remote "Cloudinary root 'rclone-test-vacilat8foqu'", Local "Local file system at /tmp/rclone1719434886", Modify Window "876000h0m0s" copy_test.go:188: Test only runs on local --- SKIP: TestCopyLongFile (0.55s) === RUN TestCopyFileBackupDir run.go:198: Remote "Cloudinary root 'rclone-test-vacilat8foqu'", Local "Local file system at /tmp/rclone1719434886", Modify Window "876000h0m0s" copy_test.go:208: Skipping test as remote does not support server-side move or copy --- SKIP: TestCopyFileBackupDir (0.60s) === RUN TestCopyFileCompareDest run.go:198: Remote "Cloudinary root 'rclone-test-vacilat8foqu'", Local "Local file system at /tmp/rclone1719434886", Modify Window "876000h0m0s" 2026/10/02 06:33:28 DEBUG : Creating backend with remote "TestCloudinary:rclone-test-vacilat8foqu/dst" 2026/10/02 06:33:28 DEBUG : Creating backend with remote "TestCloudinary:rclone-test-vacilat8foqu/CompareDest" 2026/10/02 06:33:29 DEBUG : one: Need to transfer - File not found at Destination 2026/10/02 06:33:30 DEBUG : one: size = 3 OK 2026/10/02 06:33:30 DEBUG : one: md5 = f97c5d29941bfb1b2fdab0874906ab82 OK 2026/10/02 06:33:30 INFO : one: Copied (new) 2026/10/02 06:33:31 DEBUG : one: Need to transfer - File not found at Destination 2026/10/02 06:33:32 DEBUG : one: size = 5 OK 2026/10/02 06:33:32 DEBUG : one: md5 = 07912d142f5d63ee918b34796b5a2432 OK 2026/10/02 06:33:32 INFO : one: Copied (new) 2026/10/02 06:33:35 DEBUG : one: size = 5 OK 2026/10/02 06:33:35 DEBUG : one: Sizes identical 2026/10/02 06:33:35 DEBUG : one: Unchanged skipping 2026/10/02 06:33:37 DEBUG : two: Need to transfer - File not found at Destination 2026/10/02 06:33:37 DEBUG : two: size = 3 OK 2026/10/02 06:33:37 DEBUG : two: Sizes identical 2026/10/02 06:33:37 DEBUG : two: Destination found in --compare-dest, skipping 2026/10/02 06:33:38 DEBUG : two: Need to transfer - File not found at Destination 2026/10/02 06:33:38 DEBUG : two: size = 3 OK 2026/10/02 06:33:38 DEBUG : two: Sizes identical 2026/10/02 06:33:38 DEBUG : two: Destination found in --compare-dest, skipping 2026/10/02 06:33:39 DEBUG : two: Need to transfer - File not found at Destination 2026/10/02 06:33:40 DEBUG : two: size = 5 (Local file system at /tmp/rclone1719434886) 2026/10/02 06:33:40 DEBUG : two: size = 3 (Cloudinary root 'rclone-test-vacilat8foqu/CompareDest') 2026/10/02 06:33:40 DEBUG : two: Sizes differ 2026/10/02 06:33:40 DEBUG : two: size = 5 OK 2026/10/02 06:33:40 DEBUG : two: md5 = 2379e4ce8c3380e996ab0509f17069ad OK 2026/10/02 06:33:40 INFO : two: Copied (new) --- PASS: TestCopyFileCompareDest (16.49s) === RUN TestCopyFileCopyDestImmutable run.go:198: Remote "Cloudinary root 'rclone-test-vacilat8foqu'", Local "Local file system at /tmp/rclone1719434886", Modify Window "876000h0m0s" copy_test.go:312: Skipping test as remote does not support server-side copy --- SKIP: TestCopyFileCopyDestImmutable (0.67s) === RUN TestCopyFileCopyDest run.go:198: Remote "Cloudinary root 'rclone-test-vacilat8foqu'", Local "Local file system at /tmp/rclone1719434886", Modify Window "876000h0m0s" copy_test.go:340: Skipping test as remote does not support server-side copy --- SKIP: TestCopyFileCopyDest (0.65s) === RUN TestCopyInplace run.go:198: Remote "Cloudinary root 'rclone-test-vacilat8foqu'", Local "Local file system at /tmp/rclone1719434886", Modify Window "876000h0m0s" copy_test.go:434: Partial uploads not supported --- SKIP: TestCopyInplace (0.57s) === RUN TestCopyLongFileName run.go:198: Remote "Cloudinary root 'rclone-test-vacilat8foqu'", Local "Local file system at /tmp/rclone1719434886", Modify Window "876000h0m0s" copy_test.go:467: Partial uploads not supported --- SKIP: TestCopyLongFileName (0.62s) === RUN TestCopyLongFileNameCollision run.go:198: Remote "Cloudinary root 'rclone-test-vacilat8foqu'", Local "Local file system at /tmp/rclone1719434886", Modify Window "876000h0m0s" copy_test.go:500: Partial uploads not supported --- SKIP: TestCopyLongFileNameCollision (0.59s) === RUN TestCopyFileMaxTransfer run.go:198: Remote "Cloudinary root 'rclone-test-vacilat8foqu'", Local "Local file system at /tmp/rclone1719434886", Modify Window "876000h0m0s" 2026/10/02 06:33:48 DEBUG : TestCopyFileMaxTransfer/file1: Need to transfer - File not found at Destination 2026/10/02 06:33:48 DEBUG : TestCopyFileMaxTransfer/file1: size = 14 OK 2026/10/02 06:33:48 DEBUG : TestCopyFileMaxTransfer/file1: md5 = 0ef726ce9b1a7692357ff70dd321d595 OK 2026/10/02 06:33:48 INFO : TestCopyFileMaxTransfer/file1: Copied (new) 2026/10/02 06:33:49 DEBUG : TestCopyFileMaxTransfer/file2: Need to transfer - File not found at Destination 2026/10/02 06:33:49 NOTICE: io: read/write on closed pipe 2026/10/02 06:33:49 ERROR : TestCopyFileMaxTransfer/file2: Failed to copy: failed to upload to Cloudinary: Post "https://api.cloudinary.com/v1_1/durakvfdu/auto/upload": max transfer limit reached as set by --max-transfer 2026/10/02 06:33:50 DEBUG : TestCopyFileMaxTransfer/file3: Need to transfer - File not found at Destination 2026/10/02 06:33:51 DEBUG : TestCopyFileMaxTransfer/file4: Need to transfer - File not found at Destination 2026/10/02 06:33:51 DEBUG : TestCopyFileMaxTransfer/file4: size = 2062 OK 2026/10/02 06:33:51 DEBUG : TestCopyFileMaxTransfer/file4: md5 = bb25f4be8d5f1b8fe31dc844078f3090 OK 2026/10/02 06:33:51 INFO : TestCopyFileMaxTransfer/file4: Copied (new) --- PASS: TestCopyFileMaxTransfer (6.75s) === RUN TestDeduplicateInteractive run.go:198: Remote "Cloudinary root 'rclone-test-vacilat8foqu'", Local "Local file system at /tmp/rclone1719434886", Modify Window "876000h0m0s" dedupe_test.go:25: Can't test deduplicate - no duplicate files possible --- SKIP: TestDeduplicateInteractive (0.52s) === RUN TestDeduplicateSkip run.go:198: Remote "Cloudinary root 'rclone-test-vacilat8foqu'", Local "Local file system at /tmp/rclone1719434886", Modify Window "876000h0m0s" dedupe_test.go:25: Can't test deduplicate - no duplicate files possible --- SKIP: TestDeduplicateSkip (0.78s) === RUN TestDeduplicateSizeOnly run.go:198: Remote "Cloudinary root 'rclone-test-vacilat8foqu'", Local "Local file system at /tmp/rclone1719434886", Modify Window "876000h0m0s" dedupe_test.go:25: Can't test deduplicate - no duplicate files possible --- SKIP: TestDeduplicateSizeOnly (0.71s) === RUN TestDeduplicateFirst run.go:198: Remote "Cloudinary root 'rclone-test-vacilat8foqu'", Local "Local file system at /tmp/rclone1719434886", Modify Window "876000h0m0s" dedupe_test.go:25: Can't test deduplicate - no duplicate files possible --- SKIP: TestDeduplicateFirst (0.56s) === RUN TestDeduplicateNewest run.go:198: Remote "Cloudinary root 'rclone-test-vacilat8foqu'", Local "Local file system at /tmp/rclone1719434886", Modify Window "876000h0m0s" dedupe_test.go:25: Can't test deduplicate - no duplicate files possible --- SKIP: TestDeduplicateNewest (0.70s) === RUN TestDeduplicateNewestByHash run.go:198: Remote "Cloudinary root 'rclone-test-vacilat8foqu'", Local "Local file system at /tmp/rclone1719434886", Modify Window "876000h0m0s" dedupe_test.go:43: Can't run this test without modtimes --- SKIP: TestDeduplicateNewestByHash (0.60s) === RUN TestDeduplicateOldest run.go:198: Remote "Cloudinary root 'rclone-test-vacilat8foqu'", Local "Local file system at /tmp/rclone1719434886", Modify Window "876000h0m0s" dedupe_test.go:25: Can't test deduplicate - no duplicate files possible --- SKIP: TestDeduplicateOldest (0.74s) === RUN TestDeduplicateLargest run.go:198: Remote "Cloudinary root 'rclone-test-vacilat8foqu'", Local "Local file system at /tmp/rclone1719434886", Modify Window "876000h0m0s" dedupe_test.go:25: Can't test deduplicate - no duplicate files possible --- SKIP: TestDeduplicateLargest (0.59s) === RUN TestDeduplicateSmallest run.go:198: Remote "Cloudinary root 'rclone-test-vacilat8foqu'", Local "Local file system at /tmp/rclone1719434886", Modify Window "876000h0m0s" dedupe_test.go:25: Can't test deduplicate - no duplicate files possible --- SKIP: TestDeduplicateSmallest (0.57s) === RUN TestDeduplicateRename run.go:198: Remote "Cloudinary root 'rclone-test-vacilat8foqu'", Local "Local file system at /tmp/rclone1719434886", Modify Window "876000h0m0s" dedupe_test.go:25: Can't test deduplicate - no duplicate files possible --- SKIP: TestDeduplicateRename (0.56s) === RUN TestDeduplicateRenameManyExisting run.go:198: Remote "Cloudinary root 'rclone-test-vacilat8foqu'", Local "Local file system at /tmp/rclone1719434886", Modify Window "876000h0m0s" dedupe_test.go:25: Can't test deduplicate - no duplicate files possible --- SKIP: TestDeduplicateRenameManyExisting (0.63s) === RUN TestMergeDirs run.go:198: Remote "Cloudinary root 'rclone-test-vacilat8foqu'", Local "Local file system at /tmp/rclone1719434886", Modify Window "876000h0m0s" dedupe_test.go:294: Can't merge directories --- SKIP: TestMergeDirs (0.61s) === RUN TestIndex run.go:198: Remote "Cloudinary root 'rclone-test-vacilat8foqu'", Local "Local file system at /tmp/rclone1719434886", Modify Window "876000h0m0s" 2026/10/02 06:34:05 DEBUG : caddy.json: size = 259 OK 2026/10/02 06:34:05 DEBUG : caddy.json: md5 = dc6a0a75ac6ca4c5c4d67ce9cc07c967 OK 2026/10/02 06:34:05 INFO : caddy.json: Copied (new) 2026/10/02 06:34:05 DEBUG : index.html: size = 12147 OK 2026/10/02 06:34:05 DEBUG : index.html: md5 = 487729d18d94fdb0d658ea1c5f31c415 OK 2026/10/02 06:34:05 INFO : index.html: Copied (new) 2026/10/02 06:34:05 DEBUG : sub/index.html: size = 12306 OK 2026/10/02 06:34:05 DEBUG : sub/index.html: md5 = fca67a4486b3e873237a73c7229c1f5b OK 2026/10/02 06:34:05 INFO : sub/index.html: Copied (new) 2026/10/02 06:34:05 DEBUG : index.json: size = 213 OK 2026/10/02 06:34:05 DEBUG : index.json: md5 = 6d9005410c2c0151ea1f793aac08f065 OK 2026/10/02 06:34:05 INFO : index.json: Copied (new) 2026/10/02 06:34:05 DEBUG : sub/index.json: size = 215 OK 2026/10/02 06:34:05 DEBUG : sub/index.json: md5 = a2268aa29c5a00e765e4612e571decea OK 2026/10/02 06:34:05 INFO : sub/index.json: Copied (new) 2026/10/02 06:34:06 DEBUG : sub/caddy.json: size = 261 OK 2026/10/02 06:34:06 DEBUG : sub/caddy.json: md5 = 75c950ebaddffd546d2416be7d12398e OK 2026/10/02 06:34:06 INFO : sub/caddy.json: Copied (new) 2026/10/02 06:34:06 DEBUG : sub/deep/index.html: size = 12087 OK 2026/10/02 06:34:06 DEBUG : sub/deep/index.html: md5 = 15175b0c498f289721af34354d8e89fb OK 2026/10/02 06:34:06 INFO : sub/deep/index.html: Copied (new) 2026/10/02 06:34:06 DEBUG : sub/deep/index.json: size = 119 OK 2026/10/02 06:34:06 DEBUG : sub/deep/index.json: md5 = 7e871c8a7baa48027dd34c724a216943 OK 2026/10/02 06:34:06 INFO : sub/deep/index.json: Copied (new) 2026/10/02 06:34:06 DEBUG : sub/deep/caddy.json: size = 131 OK 2026/10/02 06:34:06 DEBUG : sub/deep/caddy.json: md5 = d85deaaa7d227b303a0247bb5c1690a8 OK 2026/10/02 06:34:06 INFO : sub/deep/caddy.json: Copied (new) 2026/10/02 06:34:10 DEBUG : index.html: Dst hash empty - aborting Src hash check 2026/10/02 06:34:10 DEBUG : sub/index.html: Dst hash empty - aborting Src hash check 2026/10/02 06:34:10 DEBUG : sub/deep/index.html: Dst hash empty - aborting Src hash check 2026/10/02 06:34:10 DEBUG : sub/index.html: Unchanged skipping 2026/10/02 06:34:10 DEBUG : sub/index.json: Dst hash empty - aborting Src hash check 2026/10/02 06:34:10 DEBUG : sub/deep/index.html: Unchanged skipping 2026/10/02 06:34:10 DEBUG : sub/deep/index.json: Dst hash empty - aborting Src hash check 2026/10/02 06:34:10 DEBUG : index.html: Unchanged skipping 2026/10/02 06:34:10 DEBUG : index.json: Dst hash empty - aborting Src hash check 2026/10/02 06:34:10 DEBUG : sub/index.json: Unchanged skipping 2026/10/02 06:34:10 DEBUG : sub/caddy.json: Dst hash empty - aborting Src hash check 2026/10/02 06:34:11 DEBUG : sub/deep/index.json: Unchanged skipping 2026/10/02 06:34:11 DEBUG : sub/deep/caddy.json: Dst hash empty - aborting Src hash check 2026/10/02 06:34:11 DEBUG : index.json: Unchanged skipping 2026/10/02 06:34:11 DEBUG : caddy.json: Dst hash empty - aborting Src hash check 2026/10/02 06:34:11 DEBUG : sub/caddy.json: Unchanged skipping 2026/10/02 06:34:11 DEBUG : sub/deep/caddy.json: Unchanged skipping 2026/10/02 06:34:11 DEBUG : caddy.json: Unchanged skipping 2026/10/02 06:34:12 DEBUG : index.json: size = 213 OK 2026/10/02 06:34:12 DEBUG : index.json: md5 = 6d9005410c2c0151ea1f793aac08f065 OK 2026/10/02 06:34:12 INFO : index.json: Copied (replaced existing) 2026/10/02 06:34:12 DEBUG : sub/deep/index.json: size = 119 OK 2026/10/02 06:34:12 DEBUG : sub/deep/index.json: md5 = 7e871c8a7baa48027dd34c724a216943 OK 2026/10/02 06:34:12 INFO : sub/deep/index.json: Copied (replaced existing) 2026/10/02 06:34:12 DEBUG : sub/deep/index.html: size = 12087 OK 2026/10/02 06:34:12 DEBUG : sub/deep/index.html: md5 = 15175b0c498f289721af34354d8e89fb OK 2026/10/02 06:34:12 INFO : sub/deep/index.html: Copied (replaced existing) 2026/10/02 06:34:12 DEBUG : index.html: size = 12147 OK 2026/10/02 06:34:12 DEBUG : index.html: md5 = 487729d18d94fdb0d658ea1c5f31c415 OK 2026/10/02 06:34:12 INFO : index.html: Copied (replaced existing) 2026/10/02 06:34:13 DEBUG : sub/deep/caddy.json: size = 131 OK 2026/10/02 06:34:13 DEBUG : sub/deep/caddy.json: md5 = d85deaaa7d227b303a0247bb5c1690a8 OK 2026/10/02 06:34:13 INFO : sub/deep/caddy.json: Copied (replaced existing) 2026/10/02 06:34:13 DEBUG : sub/index.json: size = 215 OK 2026/10/02 06:34:13 DEBUG : sub/index.json: md5 = a2268aa29c5a00e765e4612e571decea OK 2026/10/02 06:34:13 INFO : sub/index.json: Copied (replaced existing) 2026/10/02 06:34:13 DEBUG : sub/index.html: size = 12306 OK 2026/10/02 06:34:13 DEBUG : sub/index.html: md5 = fca67a4486b3e873237a73c7229c1f5b OK 2026/10/02 06:34:13 INFO : sub/index.html: Copied (replaced existing) 2026/10/02 06:34:13 DEBUG : caddy.json: size = 259 OK 2026/10/02 06:34:13 DEBUG : caddy.json: md5 = dc6a0a75ac6ca4c5c4d67ce9cc07c967 OK 2026/10/02 06:34:13 INFO : caddy.json: Copied (replaced existing) 2026/10/02 06:34:13 DEBUG : sub/caddy.json: size = 261 OK 2026/10/02 06:34:13 DEBUG : sub/caddy.json: md5 = 75c950ebaddffd546d2416be7d12398e OK 2026/10/02 06:34:13 INFO : sub/caddy.json: Copied (replaced existing) 2026/10/02 06:34:15 DEBUG : index.html: Dst hash empty - aborting Src hash check 2026/10/02 06:34:15 DEBUG : sub/index.html: Dst hash empty - aborting Src hash check 2026/10/02 06:34:15 DEBUG : index.html: Unchanged skipping 2026/10/02 06:34:15 DEBUG : index.json: Dst hash empty - aborting Src hash check 2026/10/02 06:34:15 DEBUG : sub/index.html: Unchanged skipping 2026/10/02 06:34:15 DEBUG : sub/index.json: Dst hash empty - aborting Src hash check 2026/10/02 06:34:15 DEBUG : index.json: Unchanged skipping 2026/10/02 06:34:15 DEBUG : caddy.json: Dst hash empty - aborting Src hash check 2026/10/02 06:34:15 DEBUG : sub/index.json: Unchanged skipping 2026/10/02 06:34:15 DEBUG : sub/caddy.json: Dst hash empty - aborting Src hash check 2026/10/02 06:34:16 DEBUG : caddy.json: Unchanged skipping 2026/10/02 06:34:16 DEBUG : sub/caddy.json: Unchanged skipping 2026/10/02 06:34:16 DEBUG : sub/deep/caddy.json: size = 260 OK 2026/10/02 06:34:16 DEBUG : sub/deep/caddy.json: md5 = 7d40922480f85532b0215606cd889177 OK 2026/10/02 06:34:16 INFO : sub/deep/caddy.json: Copied (replaced existing) 2026/10/02 06:34:16 DEBUG : sub/deep/index.html: size = 12346 OK 2026/10/02 06:34:16 DEBUG : sub/deep/index.html: md5 = 307acb292face49495080b1f65c2affb OK 2026/10/02 06:34:16 INFO : sub/deep/index.html: Copied (replaced existing) 2026/10/02 06:34:16 DEBUG : sub/deep/index.json: size = 235 OK 2026/10/02 06:34:16 DEBUG : sub/deep/index.json: md5 = d06cbda009ac7901132a43ebb95c8e8b OK 2026/10/02 06:34:16 INFO : sub/deep/index.json: Copied (replaced existing) index_test.go:156: Error Trace: /home/rclone/go/src/github.com/rclone/rclone/fs/operations/index_test.go:156 Error: "\n\n\n\n\t\n\t\t/sub/deep\n\t\t\n\t\t\n\t\t\n\n\t\n\t\n\t\t\n\t\t\t\n\t\t\t\t\n\t\t\t\t\n\t\t\t\t\n\t\t\t\t\n\t\t\t\n\t\t\n\t\t
\n\t\t\t
Folder path
\n\t\t\t

/sub/deep/\n\t\t\t

\n\t\t
\n\t\t
\n\t\t\t
\n\t\t\t\t
\n\t\t\t\t\t\n\t\t\t\t\t\n\t\t\t\t\t6 total\n\t\t\t\t
\n\t\t\t\t
\n\t\t\t\t\t\n\t\t\t\t\t\t\n\t\t\t\t\t\t\t\n\t\t\t\t\t\t\t\t\n\t\t\t\t\t\t\t\t\n\t\t\t\t\t\t\t\t\n\t\t\t\t\t\t\t\n\t\t\t\t\t\t\n\t\t\t\t\t\t\n\t\t\t\t\t\t\t\n\t\t\t\t\t\t\t\n\t\t\t\t\t\t\t\t\n\t\t\t\t\t\t\t\t\n\t\t\t\t\t\t\t\t\n\t\t\t\t\t\t\t\n\t\t\t\t\t\t\t\n\t\t\t\t\t\t\n\t\t\t\t\t
\n\t\t\t\t\t\t\t\t\tName\n\t\t\t\t\t\t\t\t\t\n\t\t\t\t\t\t\t\tSizeModified
Go up——
file3.txt\n\t\t\t\t\t\t\t\t6—
\n\t\t\t\t
\n\t\t\t
\n\t\t
\n\t\t\n\t\n\n" does not contain "file4.txt" Test: TestIndex 2026/10/02 06:34:18 DEBUG : index.html: Dst hash empty - aborting Src hash check 2026/10/02 06:34:18 NOTICE: sub/deep/caddy.json: Skipped copy as --dry-run is set (size 389) 2026/10/02 06:34:18 NOTICE: sub/deep/index.json: Skipped copy as --dry-run is set (size 351) 2026/10/02 06:34:18 DEBUG : sub/index.html: Dst hash empty - aborting Src hash check 2026/10/02 06:34:18 NOTICE: sub/deep/index.html: Skipped copy as --dry-run is set (size 12.309Ki) 2026/10/02 06:34:18 DEBUG : index.html: Unchanged skipping 2026/10/02 06:34:18 DEBUG : index.json: Dst hash empty - aborting Src hash check 2026/10/02 06:34:18 DEBUG : sub/index.html: Unchanged skipping 2026/10/02 06:34:18 DEBUG : sub/index.json: Dst hash empty - aborting Src hash check 2026/10/02 06:34:18 DEBUG : index.json: Unchanged skipping 2026/10/02 06:34:18 DEBUG : caddy.json: Dst hash empty - aborting Src hash check 2026/10/02 06:34:18 DEBUG : sub/index.json: Unchanged skipping 2026/10/02 06:34:18 DEBUG : sub/caddy.json: Dst hash empty - aborting Src hash check 2026/10/02 06:34:18 DEBUG : caddy.json: Unchanged skipping 2026/10/02 06:34:18 DEBUG : sub/caddy.json: Unchanged skipping --- FAIL: TestIndex (23.63s) === RUN TestIndexDelete run.go:198: Remote "Cloudinary root 'rclone-test-vacilat8foqu'", Local "Local file system at /tmp/rclone1719434886", Modify Window "876000h0m0s" 2026/10/02 06:34:28 DEBUG : sub/index.html: size = 12306 OK 2026/10/02 06:34:28 DEBUG : sub/index.html: md5 = fca67a4486b3e873237a73c7229c1f5b OK 2026/10/02 06:34:28 INFO : sub/index.html: Copied (new) 2026/10/02 06:34:28 DEBUG : index.html: size = 12147 OK 2026/10/02 06:34:28 DEBUG : index.html: md5 = 487729d18d94fdb0d658ea1c5f31c415 OK 2026/10/02 06:34:28 INFO : index.html: Copied (new) 2026/10/02 06:34:29 DEBUG : sub/deep/index.html: size = 12087 OK 2026/10/02 06:34:29 DEBUG : sub/deep/index.html: md5 = 15175b0c498f289721af34354d8e89fb OK 2026/10/02 06:34:29 INFO : sub/deep/index.html: Copied (new) 2026/10/02 06:34:30 DEBUG : sub/index.html: Dst hash empty - aborting Src hash check 2026/10/02 06:34:30 DEBUG : index.html: Dst hash empty - aborting Src hash check 2026/10/02 06:34:31 DEBUG : index.html: Unchanged skipping 2026/10/02 06:34:31 DEBUG : sub/index.html: Unchanged skipping 2026/10/02 06:34:31 DEBUG : sub/deep/index.html: size = 11829 OK 2026/10/02 06:34:31 DEBUG : sub/deep/index.html: md5 = d6b54f56fe3c56d0e46dc7cef27afea2 OK 2026/10/02 06:34:31 INFO : sub/deep/index.html: Copied (replaced existing) --- PASS: TestIndexDelete (10.92s) === RUN TestIndexFilter run.go:198: Remote "Cloudinary root 'rclone-test-vacilat8foqu'", Local "Local file system at /tmp/rclone1719434886", Modify Window "876000h0m0s" 2026/10/02 06:34:40 DEBUG : other/notes.md: Excluded (Path Filter) 2026/10/02 06:34:40 DEBUG : index.html: size = 12399 OK 2026/10/02 06:34:40 DEBUG : index.html: md5 = a97c873e1964b4e2c5ae1b8219db600d OK 2026/10/02 06:34:40 INFO : index.html: Copied (new) 2026/10/02 06:34:40 DEBUG : other/index.html: size = 11802 OK 2026/10/02 06:34:40 DEBUG : other/index.html: md5 = 1fbd534a06e1d3387ab22be5de393e5f OK 2026/10/02 06:34:40 INFO : other/index.html: Copied (new) 2026/10/02 06:34:40 DEBUG : sub/index.html: size = 12056 OK 2026/10/02 06:34:40 DEBUG : sub/index.html: md5 = f9ee9218c597a152aacbc7fa84b26e05 OK 2026/10/02 06:34:41 INFO : sub/index.html: Copied (new) 2026/10/02 06:34:44 DEBUG : other/notes.md: Excluded (Path Filter) 2026/10/02 06:34:44 DEBUG : index.html: Dst hash empty - aborting Src hash check 2026/10/02 06:34:44 DEBUG : other/index.html: Dst hash empty - aborting Src hash check 2026/10/02 06:34:44 DEBUG : sub/index.html: Dst hash empty - aborting Src hash check 2026/10/02 06:34:44 DEBUG : index.html: Unchanged skipping 2026/10/02 06:34:44 DEBUG : other/index.html: Unchanged skipping 2026/10/02 06:34:44 DEBUG : sub/index.html: Unchanged skipping --- PASS: TestIndexFilter (13.44s) === RUN TestIndexRules run.go:198: Remote "Cloudinary root 'rclone-test-vacilat8foqu'", Local "Local file system at /tmp/rclone1719434886", Modify Window "876000h0m0s" 2026/10/02 06:34:53 DEBUG : sub/index.html: size = 12306 OK 2026/10/02 06:34:53 DEBUG : sub/index.html: md5 = fca67a4486b3e873237a73c7229c1f5b OK 2026/10/02 06:34:53 INFO : sub/index.html: Copied (new) 2026/10/02 06:34:53 DEBUG : index.html: size = 12147 OK 2026/10/02 06:34:53 DEBUG : index.html: md5 = 487729d18d94fdb0d658ea1c5f31c415 OK 2026/10/02 06:34:53 INFO : index.html: Copied (new) index_test.go:62: Error Trace: /home/rclone/go/src/github.com/rclone/rclone/fs/operations/index_test.go:62 /home/rclone/go/src/github.com/rclone/rclone/fs/operations/index_test.go:241 Error: Received unexpected error: object not found Test: TestIndexRules Messages: sub/index.html --- FAIL: TestIndexRules (9.21s) === RUN TestIndexMaxDepth run.go:198: Remote "Cloudinary root 'rclone-test-vacilat8foqu'", Local "Local file system at /tmp/rclone1719434886", Modify Window "876000h0m0s" 2026/10/02 06:35:03 DEBUG : index.html: size = 12147 OK 2026/10/02 06:35:03 DEBUG : index.html: md5 = 487729d18d94fdb0d658ea1c5f31c415 OK 2026/10/02 06:35:03 INFO : index.html: Copied (new) index_test.go:62: Error Trace: /home/rclone/go/src/github.com/rclone/rclone/fs/operations/index_test.go:62 /home/rclone/go/src/github.com/rclone/rclone/fs/operations/index_test.go:259 Error: Received unexpected error: object not found Test: TestIndexMaxDepth Messages: index.html --- FAIL: TestIndexMaxDepth (8.15s) === RUN TestIndexLinkIndex run.go:198: Remote "Cloudinary root 'rclone-test-vacilat8foqu'", Local "Local file system at /tmp/rclone1719434886", Modify Window "876000h0m0s" 2026/10/02 06:35:10 DEBUG : sub/index.html: size = 12347 OK 2026/10/02 06:35:10 DEBUG : sub/index.html: md5 = 7c86401558b8ba2e798cb73575d8e402 OK 2026/10/02 06:35:10 INFO : sub/index.html: Copied (new) 2026/10/02 06:35:10 DEBUG : sub/deep/index.html: size = 12128 OK 2026/10/02 06:35:10 DEBUG : sub/deep/index.html: md5 = 835fd19115916d1c0be8c5feb411b389 OK 2026/10/02 06:35:10 INFO : sub/deep/index.html: Copied (new) 2026/10/02 06:35:10 DEBUG : index.html: size = 12167 OK 2026/10/02 06:35:10 DEBUG : index.html: md5 = 0dc983848568e8d632601750689042ab OK 2026/10/02 06:35:10 INFO : index.html: Copied (new) index_test.go:62: Error Trace: /home/rclone/go/src/github.com/rclone/rclone/fs/operations/index_test.go:62 /home/rclone/go/src/github.com/rclone/rclone/fs/operations/index_test.go:266 Error: Received unexpected error: object not found Test: TestIndexLinkIndex Messages: index.html --- FAIL: TestIndexLinkIndex (7.05s) === RUN TestIndexDirTime run.go:198: Remote "Cloudinary root 'rclone-test-vacilat8foqu'", Local "Local file system at /tmp/rclone1719434886", Modify Window "876000h0m0s" 2026/10/02 06:35:17 DEBUG : sub/index.json: size = 255 OK 2026/10/02 06:35:17 DEBUG : sub/index.json: md5 = f57065e90dcf6e956baf66319fca445a OK 2026/10/02 06:35:17 INFO : sub/index.json: Copied (new) 2026/10/02 06:35:17 DEBUG : sub/deep/index.json: size = 139 OK 2026/10/02 06:35:17 DEBUG : sub/deep/index.json: md5 = f82129b93b72c82ffcbc519043ffb477 OK 2026/10/02 06:35:17 INFO : sub/deep/index.json: Copied (new) 2026/10/02 06:35:17 DEBUG : index.json: size = 253 OK 2026/10/02 06:35:17 DEBUG : index.json: md5 = c282686131502fcf0112c70f5c3c8253 OK 2026/10/02 06:35:17 INFO : index.json: Copied (new) index_test.go:62: Error Trace: /home/rclone/go/src/github.com/rclone/rclone/fs/operations/index_test.go:62 /home/rclone/go/src/github.com/rclone/rclone/fs/operations/index_test.go:278 /home/rclone/go/src/github.com/rclone/rclone/fs/operations/index_test.go:300 Error: Received unexpected error: object not found Test: TestIndexDirTime Messages: index.json --- FAIL: TestIndexDirTime (6.91s) === RUN TestIndexTemplate run.go:198: Remote "Cloudinary root 'rclone-test-vacilat8foqu'", Local "Local file system at /tmp/rclone1719434886", Modify Window "876000h0m0s" 2026/10/02 06:35:24 DEBUG : sub/deep/list.txt: size = 47 OK 2026/10/02 06:35:24 DEBUG : sub/deep/list.txt: md5 = dc1cc2d7ce7f5592c21ea35204e8c55f OK 2026/10/02 06:35:24 INFO : sub/deep/list.txt: Copied (new) 2026/10/02 06:35:24 DEBUG : sub/list.txt: size = 64 OK 2026/10/02 06:35:24 DEBUG : sub/list.txt: md5 = 392b31a0b76dfeac344bfc90519f71cf OK 2026/10/02 06:35:24 INFO : sub/list.txt: Copied (new) 2026/10/02 06:35:24 DEBUG : list.txt: size = 59 OK 2026/10/02 06:35:24 DEBUG : list.txt: md5 = 7be1c5ff53c6c4db1785ba69f82a3a65 OK 2026/10/02 06:35:24 INFO : list.txt: Copied (new) index_test.go:62: Error Trace: /home/rclone/go/src/github.com/rclone/rclone/fs/operations/index_test.go:62 /home/rclone/go/src/github.com/rclone/rclone/fs/operations/index_test.go:327 Error: Received unexpected error: object not found Test: TestIndexTemplate Messages: sub/list.txt --- FAIL: TestIndexTemplate (7.41s) === RUN TestIndexTemplateBuiltin --- PASS: TestIndexTemplateBuiltin (0.00s) === RUN TestRcIndex rc_test.go:31: Skipping test on non local remote --- SKIP: TestRcIndex (0.00s) === RUN TestIndexNoHash index_test.go:371: Skipping test on non local remote --- SKIP: TestIndexNoHash (0.00s) === RUN TestIndexChanged run.go:198: Remote "Cloudinary root 'rclone-test-vacilat8foqu'", Local "Local file system at /tmp/rclone1719434886", Modify Window "876000h0m0s" 2026/10/02 06:35:32 DEBUG : index.html: size = 12399 OK 2026/10/02 06:35:32 DEBUG : index.html: md5 = a97c873e1964b4e2c5ae1b8219db600d OK 2026/10/02 06:35:32 INFO : index.html: Copied (new) 2026/10/02 06:35:32 DEBUG : sub/deep/index.html: size = 12087 OK 2026/10/02 06:35:32 DEBUG : sub/deep/index.html: md5 = 15175b0c498f289721af34354d8e89fb OK 2026/10/02 06:35:32 INFO : sub/deep/index.html: Copied (new) 2026/10/02 06:35:32 DEBUG : other/index.html: size = 12058 OK 2026/10/02 06:35:32 DEBUG : other/index.html: md5 = ae72a1a861b70e96a2e3cb87f571320c OK 2026/10/02 06:35:32 INFO : other/index.html: Copied (new) 2026/10/02 06:35:32 DEBUG : sub/index.html: size = 12306 OK 2026/10/02 06:35:32 DEBUG : sub/index.html: md5 = fca67a4486b3e873237a73c7229c1f5b OK 2026/10/02 06:35:32 INFO : sub/index.html: Copied (new) 2026/10/02 06:35:33 INFO : Cloudinary root 'rclone-test-vacilat8foqu': Partial index: listing 3 directories and walking 0 changed directories 2026/10/02 06:35:34 DEBUG : index.html: Dst hash empty - aborting Src hash check 2026/10/02 06:35:34 DEBUG : sub/index.html: Dst hash empty - aborting Src hash check 2026/10/02 06:35:35 DEBUG : index.html: Unchanged skipping 2026/10/02 06:35:35 DEBUG : sub/index.html: Unchanged skipping 2026/10/02 06:35:35 DEBUG : sub/deep/index.html: size = 12346 OK 2026/10/02 06:35:35 DEBUG : sub/deep/index.html: md5 = 307acb292face49495080b1f65c2affb OK 2026/10/02 06:35:35 INFO : sub/deep/index.html: Copied (replaced existing) 2026/10/02 06:35:37 INFO : Cloudinary root 'rclone-test-vacilat8foqu': Partial index: listing 3 directories and walking 0 changed directories 2026/10/02 06:35:38 DEBUG : index.html: Dst hash empty - aborting Src hash check 2026/10/02 06:35:38 DEBUG : index.html: Unchanged skipping 2026/10/02 06:35:38 DEBUG : sub/new/index.html: size = 12085 OK 2026/10/02 06:35:38 DEBUG : sub/new/index.html: md5 = fd1fdd6a1ea72319d9c7a09a8f907cb7 OK 2026/10/02 06:35:38 INFO : sub/new/index.html: Copied (new) 2026/10/02 06:35:39 DEBUG : sub/index.html: size = 12554 OK 2026/10/02 06:35:39 DEBUG : sub/index.html: md5 = 4212c11ce7fd28cd22d8d62f1b11cc4d OK 2026/10/02 06:35:39 INFO : sub/index.html: Copied (replaced existing) index_test.go:62: Error Trace: /home/rclone/go/src/github.com/rclone/rclone/fs/operations/index_test.go:62 /home/rclone/go/src/github.com/rclone/rclone/fs/operations/index_test.go:412 Error: Received unexpected error: object not found Test: TestIndexChanged Messages: sub/new/index.html --- FAIL: TestIndexChanged (17.18s) === RUN TestIndexChangedDelete run.go:198: Remote "Cloudinary root 'rclone-test-vacilat8foqu'", Local "Local file system at /tmp/rclone1719434886", Modify Window "876000h0m0s" 2026/10/02 06:35:49 DEBUG : index.html: size = 12147 OK 2026/10/02 06:35:49 DEBUG : index.html: md5 = 487729d18d94fdb0d658ea1c5f31c415 OK 2026/10/02 06:35:49 INFO : index.html: Copied (new) 2026/10/02 06:35:49 DEBUG : sub/deep/index.html: size = 12087 OK 2026/10/02 06:35:49 DEBUG : sub/deep/index.html: md5 = 15175b0c498f289721af34354d8e89fb OK 2026/10/02 06:35:49 INFO : sub/deep/index.html: Copied (new) 2026/10/02 06:35:49 DEBUG : sub/index.html: size = 12306 OK 2026/10/02 06:35:49 DEBUG : sub/index.html: md5 = fca67a4486b3e873237a73c7229c1f5b OK 2026/10/02 06:35:49 INFO : sub/index.html: Copied (new) 2026/10/02 06:35:49 INFO : Cloudinary root 'rclone-test-vacilat8foqu': Partial index: listing 3 directories and walking 0 changed directories 2026/10/02 06:35:50 DEBUG : index.html: Dst hash empty - aborting Src hash check 2026/10/02 06:35:50 DEBUG : sub/index.html: Dst hash empty - aborting Src hash check 2026/10/02 06:35:51 DEBUG : index.html: Unchanged skipping 2026/10/02 06:35:51 DEBUG : sub/index.html: Unchanged skipping 2026/10/02 06:35:51 DEBUG : sub/deep/index.html: size = 11829 OK 2026/10/02 06:35:51 DEBUG : sub/deep/index.html: md5 = d6b54f56fe3c56d0e46dc7cef27afea2 OK 2026/10/02 06:35:51 INFO : sub/deep/index.html: Copied (replaced existing) --- PASS: TestIndexChangedDelete (9.85s) === RUN TestIndexChangedFiles run.go:198: Remote "Cloudinary root 'rclone-test-vacilat8foqu'", Local "Local file system at /tmp/rclone1719434886", Modify Window "876000h0m0s" 2026/10/02 06:35:59 DEBUG : sub/index.html: size = 12306 OK 2026/10/02 06:35:59 DEBUG : sub/index.html: md5 = fca67a4486b3e873237a73c7229c1f5b OK 2026/10/02 06:35:59 INFO : sub/index.html: Copied (new) 2026/10/02 06:35:59 DEBUG : index.html: size = 12401 OK 2026/10/02 06:35:59 DEBUG : index.html: md5 = 080b36d70c765d0eca1fcc3033c03d3f OK 2026/10/02 06:35:59 INFO : index.html: Copied (new) 2026/10/02 06:35:59 DEBUG : sub/deep/index.html: size = 12087 OK 2026/10/02 06:35:59 DEBUG : sub/deep/index.html: md5 = 15175b0c498f289721af34354d8e89fb OK 2026/10/02 06:35:59 INFO : sub/deep/index.html: Copied (new) 2026/10/02 06:35:59 DEBUG : - odd/index.html: size = 12058 OK 2026/10/02 06:35:59 DEBUG : - odd/index.html: md5 = dfa9d4e0f1ef10534a0a1b80f02b69bd OK 2026/10/02 06:35:59 INFO : - odd/index.html: Copied (new) 2026/10/02 06:36:01 INFO : Cloudinary root 'rclone-test-vacilat8foqu': Partial index: listing 2 directories and walking 0 changed directories 2026/10/02 06:36:01 DEBUG : index.html: Dst hash empty - aborting Src hash check 2026/10/02 06:36:01 DEBUG : index.html: Unchanged skipping 2026/10/02 06:36:02 DEBUG : - odd/index.html: size = 12316 OK 2026/10/02 06:36:02 DEBUG : - odd/index.html: md5 = e94ff77d6cbf7555e8b4fc1012417c1c OK 2026/10/02 06:36:02 INFO : - odd/index.html: Copied (replaced existing) 2026/10/02 06:36:03 INFO : Cloudinary root 'rclone-test-vacilat8foqu': Partial index: listing 4 directories and walking 0 changed directories 2026/10/02 06:36:04 DEBUG : index.html: Dst hash empty - aborting Src hash check 2026/10/02 06:36:04 DEBUG : - odd/index.html: Dst hash empty - aborting Src hash check 2026/10/02 06:36:04 DEBUG : sub/deep/index.html: Dst hash empty - aborting Src hash check 2026/10/02 06:36:04 DEBUG : index.html: Unchanged skipping 2026/10/02 06:36:05 DEBUG : - odd/index.html: Unchanged skipping 2026/10/02 06:36:05 DEBUG : sub/deep/index.html: Unchanged skipping 2026/10/02 06:36:05 DEBUG : sub/index.html: size = 12565 OK 2026/10/02 06:36:05 DEBUG : sub/index.html: md5 = 4c5bc8b58e202e88635dc36022db2123 OK 2026/10/02 06:36:05 INFO : sub/index.html: Copied (replaced existing) index_test.go:519: Error Trace: /home/rclone/go/src/github.com/rclone/rclone/fs/operations/index_test.go:519 Error: "\n\n\n\n\t\n\t\t/sub\n\t\t\n\t\t\n\t\t\n\n\t\n\t\n\t\t\n\t\t\t\n\t\t\t\t\n\t\t\t\t\n\t\t\t\t\n\t\t\t\t\n\t\t\t\n\t\t\n\t\t
\n\t\t\t
Folder path
\n\t\t\t

/sub/\n\t\t\t

\n\t\t
\n\t\t
\n\t\t\t
\n\t\t\t\t
\n\t\t\t\t\t\n\t\t\t\t\t\n\t\t\t\t\t6 total\n\t\t\t\t
\n\t\t\t\t
\n\t\t\t\t\t\n\t\t\t\t\t\t\n\t\t\t\t\t\t\t\n\t\t\t\t\t\t\t\t\n\t\t\t\t\t\t\t\t\n\t\t\t\t\t\t\t\t\n\t\t\t\t\t\t\t\n\t\t\t\t\t\t\n\t\t\t\t\t\t\n\t\t\t\t\t\t\t\n\t\t\t\t\t\t\t\n\t\t\t\t\t\t\t\t\n\t\t\t\t\t\t\t\t\n\t\t\t\t\t\t\t\t\n\t\t\t\t\t\t\t\n\t\t\t\t\t\t\t\n\t\t\t\t\t\t\t\t\n\t\t\t\t\t\t\t\t\n\t\t\t\t\t\t\t\t\n\t\t\t\t\t\t\t\n\t\t\t\t\t\t\t\n\t\t\t\t\t\t\n\t\t\t\t\t
\n\t\t\t\t\t\t\t\t\tName\n\t\t\t\t\t\t\t\t\t\n\t\t\t\t\t\t\t\tSizeModified
Go up——
deep/\n\t\t\t\t\t\t\t\t——
file2.txt\n\t\t\t\t\t\t\t\t6—
\n\t\t\t\t
\n\t\t\t
\n\t\t
\n\t\t\n\t\n\n" does not contain "file9.txt" Test: TestIndexChangedFiles --- FAIL: TestIndexChangedFiles (15.72s) === RUN TestIndexChangedDirTime run.go:198: Remote "Cloudinary root 'rclone-test-vacilat8foqu'", Local "Local file system at /tmp/rclone1719434886", Modify Window "876000h0m0s" 2026/10/02 06:36:15 DEBUG : index.json: size = 371 OK 2026/10/02 06:36:15 DEBUG : index.json: md5 = c19f2fe4b6762e312207978319ad84ee OK 2026/10/02 06:36:15 INFO : index.json: Copied (new) 2026/10/02 06:36:15 DEBUG : sub/deep/index.json: size = 139 OK 2026/10/02 06:36:15 DEBUG : sub/deep/index.json: md5 = 2a85b93e466892fc79f9f329e59b00e8 OK 2026/10/02 06:36:15 INFO : sub/deep/index.json: Copied (new) 2026/10/02 06:36:15 DEBUG : other/index.json: size = 140 OK 2026/10/02 06:36:15 DEBUG : other/index.json: md5 = c8021e810d1dbbd1c2b6a3d1c9c79c92 OK 2026/10/02 06:36:15 INFO : other/index.json: Copied (new) 2026/10/02 06:36:15 DEBUG : sub/index.json: size = 255 OK 2026/10/02 06:36:15 DEBUG : sub/index.json: md5 = 7518c39e8b6150924ed53bcf207c3b1f OK 2026/10/02 06:36:15 INFO : sub/index.json: Copied (new) 2026/10/02 06:36:15 INFO : Cloudinary root 'rclone-test-vacilat8foqu': Partial index: listing 3 directories and walking 0 changed directories 2026/10/02 06:36:16 DEBUG : sub/index.json: Dst hash empty - aborting Src hash check 2026/10/02 06:36:17 DEBUG : sub/deep/index.json: size = 275 OK 2026/10/02 06:36:17 DEBUG : sub/deep/index.json: md5 = 2f4e46c6e69d9e6ff7865e15482fc64b OK 2026/10/02 06:36:17 INFO : sub/deep/index.json: Copied (replaced existing) 2026/10/02 06:36:17 DEBUG : index.json: size = 351 OK 2026/10/02 06:36:17 DEBUG : index.json: md5 = 2533cba1969c40d4efb5bb943f09cc34 OK 2026/10/02 06:36:17 INFO : index.json: Copied (replaced existing) 2026/10/02 06:36:17 DEBUG : sub/index.json: size = 255 OK 2026/10/02 06:36:17 DEBUG : sub/index.json: md5 = 17981c9d4507299201c8fa5ca195b595 OK 2026/10/02 06:36:17 INFO : sub/index.json: Copied (replaced existing) fstest.go:128: Error Trace: /home/rclone/go/src/github.com/rclone/rclone/fstest/fstest.go:128 /home/rclone/go/src/github.com/rclone/rclone/fs/operations/index_test.go:543 Error: Should be true Test: TestIndexChangedDirTime Messages: other: Modification time difference too big |2562047h47m16.854775807s| > 876000h0m0s (want 2011-12-25 12:59:59.123456789 +0000 UTC vs got 0001-01-01 00:00:00 +0000 UTC) (precision 876000h0m0s) --- FAIL: TestIndexChangedDirTime (12.30s) === RUN TestListDirSorted run.go:198: Remote "Cloudinary root 'rclone-test-vacilat8foqu'", Local "Local file system at /tmp/rclone1719434886", Modify Window "876000h0m0s" 2026/10/02 06:36:29 DEBUG : a.txt: Excluded (Size Filter) 2026/10/02 06:36:29 DEBUG : a.txt: Excluded 2026/10/02 06:36:29 DEBUG : sub dir/hello world2: Excluded (Size Filter) 2026/10/02 06:36:29 DEBUG : sub dir/hello world2: Excluded 2026/10/02 06:36:29 DEBUG : sub dir/hello world: Excluded (Size Filter) 2026/10/02 06:36:29 DEBUG : sub dir/hello world: Excluded 2026/10/02 06:36:30 DEBUG : sub dir/ignore dir: Excluded 2026/10/02 06:36:30 DEBUG : sub dir/hello world2: Excluded (Size Filter) 2026/10/02 06:36:30 DEBUG : sub dir/hello world2: Excluded 2026/10/02 06:36:30 DEBUG : sub dir/hello world: Excluded (Size Filter) 2026/10/02 06:36:30 DEBUG : sub dir/hello world: Excluded 2026/10/02 06:36:31 DEBUG : sub dir/ignore dir: Excluded --- PASS: TestListDirSorted (12.96s) === RUN TestListDirSortedFn run.go:198: Remote "Cloudinary root 'rclone-test-vacilat8foqu'", Local "Local file system at /tmp/rclone1719434886", Modify Window "876000h0m0s" 2026/10/02 06:36:42 DEBUG : a.txt: Excluded (Size Filter) 2026/10/02 06:36:42 DEBUG : a.txt: Excluded 2026/10/02 06:36:42 DEBUG : sub dir/hello world2: Excluded (Size Filter) 2026/10/02 06:36:42 DEBUG : sub dir/hello world2: Excluded 2026/10/02 06:36:42 DEBUG : sub dir/hello world: Excluded (Size Filter) 2026/10/02 06:36:42 DEBUG : sub dir/hello world: Excluded 2026/10/02 06:36:43 DEBUG : sub dir/ignore dir: Excluded 2026/10/02 06:36:43 DEBUG : sub dir/hello world2: Excluded (Size Filter) 2026/10/02 06:36:43 DEBUG : sub dir/hello world2: Excluded 2026/10/02 06:36:43 DEBUG : sub dir/hello world: Excluded (Size Filter) 2026/10/02 06:36:43 DEBUG : sub dir/hello world: Excluded 2026/10/02 06:36:43 DEBUG : sub dir/ignore dir: Excluded --- PASS: TestListDirSortedFn (12.60s) === RUN TestListJSON run.go:198: Remote "Cloudinary root 'rclone-test-vacilat8foqu'", Local "Local file system at /tmp/rclone1719434886", Modify Window "876000h0m0s" === RUN TestListJSON/Default === RUN TestListJSON/FilesOnly === RUN TestListJSON/DirsOnly === RUN TestListJSON/Recurse === RUN TestListJSON/SubDir === RUN TestListJSON/NoModTime === RUN TestListJSON/NoMimeType === RUN TestListJSON/ShowHash === RUN TestListJSON/HashTypes === RUN TestListJSON/Metadata --- PASS: TestListJSON (7.26s) --- PASS: TestListJSON/Default (0.35s) --- PASS: TestListJSON/FilesOnly (0.29s) --- PASS: TestListJSON/DirsOnly (0.35s) --- PASS: TestListJSON/Recurse (0.68s) --- PASS: TestListJSON/SubDir (0.30s) --- PASS: TestListJSON/NoModTime (0.32s) --- PASS: TestListJSON/NoMimeType (0.30s) --- PASS: TestListJSON/ShowHash (0.29s) --- PASS: TestListJSON/HashTypes (0.31s) --- PASS: TestListJSON/Metadata (0.30s) === RUN TestStatJSON run.go:198: Remote "Cloudinary root 'rclone-test-vacilat8foqu'", Local "Local file system at /tmp/rclone1719434886", Modify Window "876000h0m0s" === RUN TestStatJSON/Root === RUN TestStatJSON/RootFilesOnly === RUN TestStatJSON/RootDirsOnly === RUN TestStatJSON/Dir === RUN TestStatJSON/DirWithTrailingSlash === RUN TestStatJSON/File === RUN TestStatJSON/NotFound === RUN TestStatJSON/DirFilesOnly === RUN TestStatJSON/FileFilesOnly === RUN TestStatJSON/NotFoundFilesOnly === RUN TestStatJSON/DirDirsOnly === RUN TestStatJSON/FileDirsOnly === RUN TestStatJSON/NotFoundDirsOnly === RUN TestStatJSON/RootNotFound 2026/10/02 06:37:02 DEBUG : Creating backend with remote "TestCloudinary:rclone-test-vacilat8foqu/notfound" --- PASS: TestStatJSON (7.87s) --- PASS: TestStatJSON/Root (0.30s) --- PASS: TestStatJSON/RootFilesOnly (0.00s) --- PASS: TestStatJSON/RootDirsOnly (0.30s) --- PASS: TestStatJSON/Dir (0.46s) --- PASS: TestStatJSON/DirWithTrailingSlash (0.32s) --- PASS: TestStatJSON/File (0.50s) --- PASS: TestStatJSON/NotFound (0.59s) --- PASS: TestStatJSON/DirFilesOnly (0.17s) --- PASS: TestStatJSON/FileFilesOnly (0.22s) --- PASS: TestStatJSON/NotFoundFilesOnly (0.14s) --- PASS: TestStatJSON/DirDirsOnly (0.29s) --- PASS: TestStatJSON/FileDirsOnly (0.31s) --- PASS: TestStatJSON/NotFoundDirsOnly (0.32s) --- PASS: TestStatJSON/RootNotFound (0.47s) === RUN TestStatJSONMemory 2026/10/02 06:37:04 DEBUG : Creating backend with remote ":memory:" 2026/10/02 06:37:04 DEBUG : Memory root '': File to upload is small (5 bytes), uploading instead of streaming 2026/10/02 06:37:04 DEBUG : sub/file1: size = 5 OK 2026/10/02 06:37:04 DEBUG : sub/file1: md5 = 5d41402abc4b2a76b9719d911017c592 OK 2026/10/02 06:37:04 DEBUG : sub/file1: Size and md5 of src and dst objects identical === RUN TestStatJSONMemory/Dir === RUN TestStatJSONMemory/DirWithTrailingSlash === RUN TestStatJSONMemory/File === RUN TestStatJSONMemory/NotFound --- PASS: TestStatJSONMemory (0.00s) --- PASS: TestStatJSONMemory/Dir (0.00s) --- PASS: TestStatJSONMemory/DirWithTrailingSlash (0.00s) --- PASS: TestStatJSONMemory/File (0.00s) --- PASS: TestStatJSONMemory/NotFound (0.00s) === RUN TestStatJSONConfinement --- PASS: TestStatJSONConfinement (0.00s) === RUN TestMkdir run.go:198: Remote "Cloudinary root 'rclone-test-vacilat8foqu'", Local "Local file system at /tmp/rclone1719434886", Modify Window "876000h0m0s" 2026/10/02 06:37:04 INFO : Cloudinary root 'rclone-test-vacilat8foqu': Making directory 2026/10/02 06:37:05 INFO : Cloudinary root 'rclone-test-vacilat8foqu': Making directory --- PASS: TestMkdir (1.11s) === RUN TestLsd run.go:198: Remote "Cloudinary root 'rclone-test-vacilat8foqu'", Local "Local file system at /tmp/rclone1719434886", Modify Window "876000h0m0s" --- PASS: TestLsd (2.97s) === RUN TestLs run.go:198: Remote "Cloudinary root 'rclone-test-vacilat8foqu'", Local "Local file system at /tmp/rclone1719434886", Modify Window "876000h0m0s" --- PASS: TestLs (2.97s) === RUN TestLsWithFilesFrom run.go:198: Remote "Cloudinary root 'rclone-test-vacilat8foqu'", Local "Local file system at /tmp/rclone1719434886", Modify Window "876000h0m0s" 2026/10/02 06:37:13 DEBUG : empty space: Excluded (FilesFrom Filter) 2026/10/02 06:37:13 DEBUG : empty space: Excluded operations_test.go:139: Error Trace: /home/rclone/go/src/github.com/rclone/rclone/fs/operations/operations_test.go:139 Error: Not equal: expected: " 60 potato2\n" actual : "" Diff: --- Expected +++ Actual @@ -1,2 +1 @@ - 60 potato2 Test: TestLsWithFilesFrom --- FAIL: TestLsWithFilesFrom (2.79s) === RUN TestLsLong run.go:198: Remote "Cloudinary root 'rclone-test-vacilat8foqu'", Local "Local file system at /tmp/rclone1719434886", Modify Window "876000h0m0s" --- PASS: TestLsLong (3.02s) === RUN TestHashSums run.go:198: Remote "Cloudinary root 'rclone-test-vacilat8foqu'", Local "Local file system at /tmp/rclone1719434886", Modify Window "876000h0m0s" === RUN TestHashSums/Md5 operations_test.go:284: Error Trace: /home/rclone/go/src/github.com/rclone/rclone/fs/operations/operations_test.go:284 Error: " empty space\n potato2\n" does not contain "336d5ebc5436534e61d16e63ddfca327 empty space\n" Test: TestHashSums/Md5 operations_test.go:284: Error Trace: /home/rclone/go/src/github.com/rclone/rclone/fs/operations/operations_test.go:284 Error: " empty space\n potato2\n" does not contain "d6548b156ea68a4e003e786df99eee76 potato2\n" Test: TestHashSums/Md5 === RUN TestHashSums/Md5Download --- FAIL: TestHashSums (3.52s) --- FAIL: TestHashSums/Md5 (0.31s) --- PASS: TestHashSums/Md5Download (0.73s) === RUN TestHashSumsWithErrors 2026/10/02 06:37:21 DEBUG : Creating backend with remote ":memory:" 2026/10/02 06:37:21 ERROR : file1: hash unsupported: hash type not supported 2026/10/02 06:37:21 ERROR : sub/file1: hash unsupported: hash type not supported 2026/10/02 06:37:21 ERROR : sub/file1: hash unsupported: hash type not supported --- PASS: TestHashSumsWithErrors (0.00s) === RUN TestHashStream 2026/10/02 06:37:21 DEBUG : Creating md5 hash of 0 bytes read from input stream 2026/10/02 06:37:21 DEBUG : Creating md5 hash of 0 bytes read from input stream 2026/10/02 06:37:21 DEBUG : Creating sha1 hash of 0 bytes read from input stream 2026/10/02 06:37:21 DEBUG : Creating sha1 hash of 0 bytes read from input stream 2026/10/02 06:37:21 DEBUG : Creating md5 hash of 12 bytes read from input stream 2026/10/02 06:37:21 DEBUG : Creating md5 hash of 12 bytes read from input stream 2026/10/02 06:37:21 DEBUG : Creating sha1 hash of 12 bytes read from input stream 2026/10/02 06:37:21 DEBUG : Creating sha1 hash of 12 bytes read from input stream --- PASS: TestHashStream (0.00s) === RUN TestSuffixName --- PASS: TestSuffixName (0.00s) === RUN TestCount run.go:198: Remote "Cloudinary root 'rclone-test-vacilat8foqu'", Local "Local file system at /tmp/rclone1719434886", Modify Window "876000h0m0s" --- PASS: TestCount (11.86s) === RUN TestDelete run.go:198: Remote "Cloudinary root 'rclone-test-vacilat8foqu'", Local "Local file system at /tmp/rclone1719434886", Modify Window "876000h0m0s" 2026/10/02 06:37:34 DEBUG : Waiting for deletions to finish 2026/10/02 06:37:35 DEBUG : large: Excluded (Size Filter) 2026/10/02 06:37:35 DEBUG : large: Excluded 2026/10/02 06:37:35 INFO : medium: Deleted 2026/10/02 06:37:35 INFO : small: Deleted --- PASS: TestDelete (4.02s) === RUN TestDeleteFatalError run.go:198: Remote "Cloudinary root 'rclone-test-vacilat8foqu'", Local "Local file system at /tmp/rclone1719434886", Modify Window "876000h0m0s" 2026/10/02 06:37:47 DEBUG : Waiting for deletions to finish 2026/10/02 06:37:47 ERROR : file1: Got fatal error on delete: --max-delete threshold reached 2026/10/02 06:37:47 ERROR : file10: Got fatal error on delete: --max-delete threshold reached 2026/10/02 06:37:47 ERROR : file0: Got fatal error on delete: --max-delete threshold reached 2026/10/02 06:37:47 ERROR : file12: Got fatal error on delete: --max-delete threshold reached 2026/10/02 06:37:47 ERROR : file13: Got fatal error on delete: --max-delete threshold reached 2026/10/02 06:37:47 ERROR : file14: Got fatal error on delete: --max-delete threshold reached 2026/10/02 06:37:47 ERROR : file15: Got fatal error on delete: --max-delete threshold reached 2026/10/02 06:37:47 ERROR : file16: Got fatal error on delete: --max-delete threshold reached 2026/10/02 06:37:47 ERROR : file17: Got fatal error on delete: --max-delete threshold reached 2026/10/02 06:37:47 ERROR : file18: Got fatal error on delete: --max-delete threshold reached 2026/10/02 06:37:47 ERROR : file19: Got fatal error on delete: --max-delete threshold reached 2026/10/02 06:37:47 ERROR : file2: Got fatal error on delete: --max-delete threshold reached 2026/10/02 06:37:47 ERROR : file3: Got fatal error on delete: --max-delete threshold reached 2026/10/02 06:37:47 ERROR : file4: Got fatal error on delete: --max-delete threshold reached 2026/10/02 06:37:47 ERROR : file5: Got fatal error on delete: --max-delete threshold reached 2026/10/02 06:37:47 ERROR : file6: Got fatal error on delete: --max-delete threshold reached 2026/10/02 06:37:47 ERROR : file7: Got fatal error on delete: --max-delete threshold reached 2026/10/02 06:37:47 ERROR : file8: Got fatal error on delete: --max-delete threshold reached 2026/10/02 06:37:47 ERROR : file11: Got fatal error on delete: --max-delete threshold reached 2026/10/02 06:37:47 ERROR : file9: Got fatal error on delete: --max-delete threshold reached --- PASS: TestDeleteFatalError (19.04s) === RUN TestMaxDelete run.go:198: Remote "Cloudinary root 'rclone-test-vacilat8foqu'", Local "Local file system at /tmp/rclone1719434886", Modify Window "876000h0m0s" 2026/10/02 06:37:57 DEBUG : Waiting for deletions to finish 2026/10/02 06:37:58 ERROR : small: Got fatal error on delete: --max-delete threshold reached 2026/10/02 06:37:58 INFO : medium: Deleted 2026/10/02 06:37:58 INFO : large: Deleted --- PASS: TestMaxDelete (4.17s) === RUN TestMaxDeleteSizeLargeFile run.go:198: Remote "Cloudinary root 'rclone-test-vacilat8foqu'", Local "Local file system at /tmp/rclone1719434886", Modify Window "876000h0m0s" 2026/10/02 06:38:02 DEBUG : Waiting for deletions to finish 2026/10/02 06:38:03 ERROR : large: Got fatal error on delete: --max-delete-size threshold reached 2026/10/02 06:38:03 INFO : small: Deleted 2026/10/02 06:38:03 INFO : medium: Deleted --- PASS: TestMaxDeleteSizeLargeFile (5.67s) === RUN TestMaxDeleteSize run.go:198: Remote "Cloudinary root 'rclone-test-vacilat8foqu'", Local "Local file system at /tmp/rclone1719434886", Modify Window "876000h0m0s" 2026/10/02 06:38:07 DEBUG : Waiting for deletions to finish 2026/10/02 06:38:07 ERROR : small: Got fatal error on delete: --max-delete-size threshold reached 2026/10/02 06:38:08 INFO : medium: Deleted 2026/10/02 06:38:08 INFO : large: Deleted --- PASS: TestMaxDeleteSize (4.20s) === RUN TestReadFile run.go:198: Remote "Cloudinary root 'rclone-test-vacilat8foqu'", Local "Local file system at /tmp/rclone1719434886", Modify Window "876000h0m0s" operations_test.go:536: Error Trace: /home/rclone/go/src/github.com/rclone/rclone/fs/operations/operations_test.go:536 Error: Received unexpected error: object not found Test: TestReadFile --- FAIL: TestReadFile (3.03s) === RUN TestRetry 2026/10/02 06:38:13 DEBUG : Received error: Wrapped EOF is retriable: EOF - low level retry 1/5 2026/10/02 06:38:13 DEBUG : Received error: Wrapped EOF is retriable: EOF - low level retry 2/5 2026/10/02 06:38:13 DEBUG : Sleeping for 10ms (as indicated by the server) to obey Retry-After error: BANG: trying again in 10ms 2026/10/02 06:38:13 DEBUG : Sleeping for 10ms (as indicated by the server) to obey Retry-After error: BANG: trying again in 10ms 2026/10/02 06:38:13 DEBUG : Sleeping for 10ms (as indicated by the server) to obey Retry-After error: BANG: trying again in 10ms 2026/10/02 06:38:13 DEBUG : Sleeping for 10ms (as indicated by the server) to obey Retry-After error: BANG: trying again in 10ms --- PASS: TestRetry (0.04s) === RUN TestRetryAfterContextCancel 2026/10/02 06:38:13 DEBUG : Sleeping for 1h0m0s (as indicated by the server) to obey Retry-After error: BANG: trying again in 1h0m0s --- PASS: TestRetryAfterContextCancel (0.00s) === RUN TestRetryAfterLastTry --- PASS: TestRetryAfterLastTry (0.00s) === RUN TestCat run.go:198: Remote "Cloudinary root 'rclone-test-vacilat8foqu'", Local "Local file system at /tmp/rclone1719434886", Modify Window "876000h0m0s" --- PASS: TestCat (5.98s) === RUN TestPurge 2026/10/02 06:38:19 DEBUG : Creating backend with remote "TestCloudinary:rclone-test-siwihek9qepo" 2026/10/02 06:38:19 DEBUG : Using config file from "/home/rclone/.rclone.conf" 2026/10/02 06:38:19 DEBUG : Creating backend with remote "/tmp/rclone2317909626" run.go:198: Remote "Cloudinary root 'rclone-test-siwihek9qepo'", Local "Local file system at /tmp/rclone2317909626", Modify Window "876000h0m0s" 2026/10/02 06:38:20 INFO : A2: Making directory 2026/10/02 06:38:20 INFO : A1/B2: Making directory 2026/10/02 06:38:20 INFO : A1/B2/C2: Making directory 2026/10/02 06:38:21 INFO : A1/B1/C3: Making directory 2026/10/02 06:38:21 INFO : A3: Making directory 2026/10/02 06:38:21 INFO : A3/B3: Making directory 2026/10/02 06:38:21 INFO : A3/B3/C4: Making directory 2026/10/02 06:38:23 DEBUG : Waiting for deletions to finish 2026/10/02 06:38:24 INFO : A1/B1/C1/one: Deleted 2026/10/02 06:38:25 DEBUG : removing 2 level 3 directories 2026/10/02 06:38:25 INFO : A1/B1/C3: Removing directory 2026/10/02 06:38:25 INFO : A1/B1/C1: Removing directory 2026/10/02 06:38:25 DEBUG : removing 1 level 2 directories 2026/10/02 06:38:25 INFO : A1/B1: Removing directory 2026/10/02 06:38:27 DEBUG : Waiting for deletions to finish 2026/10/02 06:38:28 INFO : A1/two: Deleted 2026/10/02 06:38:29 DEBUG : removing 2 level 3 directories 2026/10/02 06:38:29 INFO : A3/B3/C4: Removing directory 2026/10/02 06:38:29 INFO : A1/B2/C2: Removing directory 2026/10/02 06:38:30 DEBUG : removing 2 level 2 directories 2026/10/02 06:38:30 INFO : A3/B3: Removing directory 2026/10/02 06:38:30 INFO : A1/B2: Removing directory 2026/10/02 06:38:30 DEBUG : removing 3 level 1 directories 2026/10/02 06:38:30 INFO : A3: Removing directory 2026/10/02 06:38:30 INFO : A1: Removing directory 2026/10/02 06:38:30 INFO : A2: Removing directory 2026/10/02 06:38:30 DEBUG : removing 1 level 0 directories 2026/10/02 06:38:30 INFO : Cloudinary root 'rclone-test-siwihek9qepo': Removing directory 2026/10/02 06:38:31 ERROR : error listing: directory not found 2026/10/02 06:38:31 ERROR : error listing: directory not found 2026/10/02 06:38:31 DEBUG : Cloudinary root 'rclone-test-siwihek9qepo': Purge dir "" 2026/10/02 06:38:31 NOTICE: purge failed to rmdir "": directory not found 2026/10/02 06:38:31 NOTICE: purge failed: directory not found --- PASS: TestPurge (12.70s) === RUN TestRmdirsNoLeaveRoot run.go:198: Remote "Cloudinary root 'rclone-test-vacilat8foqu'", Local "Local file system at /tmp/rclone1719434886", Modify Window "876000h0m0s" 2026/10/02 06:38:32 INFO : A2: Making directory 2026/10/02 06:38:32 INFO : A1/B2: Making directory 2026/10/02 06:38:32 INFO : A1/B2/C2: Making directory 2026/10/02 06:38:32 INFO : A1/B1/C3: Making directory 2026/10/02 06:38:33 INFO : A3: Making directory 2026/10/02 06:38:33 INFO : A3/B3: Making directory 2026/10/02 06:38:33 INFO : A3/B3/C4: Making directory 2026/10/02 06:38:35 DEBUG : removing 1 level 3 directories 2026/10/02 06:38:35 INFO : A3/B3/C4: Removing directory 2026/10/02 06:38:38 DEBUG : removing 2 level 3 directories 2026/10/02 06:38:38 INFO : A1/B2/C2: Removing directory 2026/10/02 06:38:38 INFO : A1/B1/C3: Removing directory 2026/10/02 06:38:39 DEBUG : removing 2 level 2 directories 2026/10/02 06:38:39 INFO : A3/B3: Removing directory 2026/10/02 06:38:39 INFO : A1/B2: Removing directory 2026/10/02 06:38:39 DEBUG : removing 2 level 1 directories 2026/10/02 06:38:39 INFO : A3: Removing directory 2026/10/02 06:38:39 INFO : A2: Removing directory 2026/10/02 06:38:44 DEBUG : removing 1 level 3 directories 2026/10/02 06:38:44 INFO : A1/B1/C1: Removing directory 2026/10/02 06:38:45 DEBUG : removing 1 level 2 directories 2026/10/02 06:38:45 INFO : A1/B1: Removing directory 2026/10/02 06:38:45 DEBUG : removing 1 level 1 directories 2026/10/02 06:38:45 INFO : A1: Removing directory 2026/10/02 06:38:45 DEBUG : removing 1 level 0 directories 2026/10/02 06:38:45 INFO : Cloudinary root 'rclone-test-vacilat8foqu': Removing directory 2026/10/02 06:38:46 ERROR : error listing: directory not found 2026/10/02 06:38:46 ERROR : error listing: directory not found --- PASS: TestRmdirsNoLeaveRoot (14.70s) === RUN TestRmdirsLeaveRoot run.go:198: Remote "Cloudinary root 'rclone-test-vacilat8foqu'", Local "Local file system at /tmp/rclone1719434886", Modify Window "876000h0m0s" 2026/10/02 06:38:46 INFO : A1: Making directory 2026/10/02 06:38:46 INFO : A1/B1: Making directory 2026/10/02 06:38:46 INFO : A1/B1/C1: Making directory 2026/10/02 06:38:49 DEBUG : removing 1 level 3 directories 2026/10/02 06:38:49 INFO : A1/B1/C1: Removing directory 2026/10/02 06:38:49 DEBUG : removing 1 level 2 directories 2026/10/02 06:38:49 INFO : A1/B1: Removing directory --- PASS: TestRmdirsLeaveRoot (5.12s) === RUN TestRmdirsWithFilter run.go:198: Remote "Cloudinary root 'rclone-test-vacilat8foqu'", Local "Local file system at /tmp/rclone1719434886", Modify Window "876000h0m0s" 2026/10/02 06:38:51 INFO : A1: Making directory 2026/10/02 06:38:51 INFO : A1/B1: Making directory 2026/10/02 06:38:52 INFO : A1/B1/C1: Making directory 2026/10/02 06:38:54 DEBUG : removing 1 level 3 directories 2026/10/02 06:38:54 INFO : A1/B1/C1: Removing directory 2026/10/02 06:38:55 DEBUG : removing 1 level 2 directories 2026/10/02 06:38:55 INFO : A1/B1: Removing directory --- PASS: TestRmdirsWithFilter (6.37s) === RUN TestCopyURL run.go:198: Remote "Cloudinary root 'rclone-test-vacilat8foqu'", Local "Local file system at /tmp/rclone1719434886", Modify Window "876000h0m0s" 2026/10/02 06:38:58 DEBUG : file1: size = 14 OK 2026/10/02 06:38:58 DEBUG : file1: md5 = 081404b3d2ae5bf599add15b7445ac07 OK 2026/10/02 06:39:00 DEBUG : file1: size = 14 OK 2026/10/02 06:39:00 DEBUG : file1: md5 = 081404b3d2ae5bf599add15b7445ac07 OK operations_test.go:929: Error Trace: /home/rclone/go/src/github.com/rclone/rclone/fs/operations/operations_test.go:929 Error: An error is expected but got nil. Test: TestCopyURL --- FAIL: TestCopyURL (3.36s) === RUN TestCopyURLDownloadHeaders run.go:198: Remote "Cloudinary root 'rclone-test-vacilat8foqu'", Local "Local file system at /tmp/rclone1719434886", Modify Window "876000h0m0s" 2026/10/02 06:39:01 DEBUG : file1: size = 14 OK 2026/10/02 06:39:01 DEBUG : file1: md5 = 081404b3d2ae5bf599add15b7445ac07 OK --- PASS: TestCopyURLDownloadHeaders (1.53s) === RUN TestCopyURLToWriter --- PASS: TestCopyURLToWriter (0.00s) === RUN TestMoveFile run.go:198: Remote "Cloudinary root 'rclone-test-vacilat8foqu'", Local "Local file system at /tmp/rclone1719434886", Modify Window "876000h0m0s" 2026/10/02 06:39:03 DEBUG : file1: Need to transfer - File not found at Destination 2026/10/02 06:39:03 DEBUG : sub/file2: size = 14 OK 2026/10/02 06:39:03 DEBUG : file1: md5 = 0ef726ce9b1a7692357ff70dd321d595 OK 2026/10/02 06:39:03 INFO : file1: Copied (new) to: sub/file2 2026/10/02 06:39:03 INFO : file1: Deleted 2026/10/02 06:39:04 DEBUG : file1: Need to transfer - File not found at Destination 2026/10/02 06:39:04 DEBUG : sub/file2: size = 14 OK 2026/10/02 06:39:04 DEBUG : file1: md5 = 0ef726ce9b1a7692357ff70dd321d595 OK 2026/10/02 06:39:04 INFO : file1: Copied (new) to: sub/file2 2026/10/02 06:39:04 INFO : file1: Deleted 2026/10/02 06:39:05 DEBUG : Cloudinary root 'rclone-test-vacilat8foqu': don't need to copy/move sub/file2, it is already at target location --- PASS: TestMoveFile (5.03s) === RUN TestMoveFileWithIgnoreExisting run.go:198: Remote "Cloudinary root 'rclone-test-vacilat8foqu'", Local "Local file system at /tmp/rclone1719434886", Modify Window "876000h0m0s" 2026/10/02 06:39:08 DEBUG : file1: Need to transfer - File not found at Destination 2026/10/02 06:39:08 DEBUG : file1: size = 14 OK 2026/10/02 06:39:08 DEBUG : file1: md5 = 0ef726ce9b1a7692357ff70dd321d595 OK 2026/10/02 06:39:08 INFO : file1: Copied (new) 2026/10/02 06:39:08 INFO : file1: Deleted 2026/10/02 06:39:09 DEBUG : file1: Need to transfer - File not found at Destination 2026/10/02 06:39:09 DEBUG : file1: size = 14 OK 2026/10/02 06:39:09 DEBUG : file1: md5 = 0708a3947e56ae531342f76f27275499 OK 2026/10/02 06:39:09 INFO : file1: Copied (new) 2026/10/02 06:39:09 INFO : file1: Deleted fstest.go:299: Sleeping for 1s for list eventual consistency: 1/5 fstest.go:299: Sleeping for 2s for list eventual consistency: 2/5 fstest.go:299: Sleeping for 4s for list eventual consistency: 3/5 fstest.go:299: Sleeping for 8s for list eventual consistency: 4/5 fstest.go:299: Sleeping for 16s for list eventual consistency: 5/5 fstest.go:306: Error Trace: /home/rclone/go/src/github.com/rclone/rclone/fstest/fstest.go:306 /home/rclone/go/src/github.com/rclone/rclone/fstest/fstest.go:339 /home/rclone/go/src/github.com/rclone/rclone/fstest/fstest.go:351 /home/rclone/go/src/github.com/rclone/rclone/fstest/run.go:352 /home/rclone/go/src/github.com/rclone/rclone/fs/operations/operations_test.go:1081 Error: Should be true Test: TestMoveFileWithIgnoreExisting Messages: listing wrong, want file1 (14) got fstest.go:204: Not found "file1" fstest.go:207: Error Trace: /home/rclone/go/src/github.com/rclone/rclone/fstest/fstest.go:207 /home/rclone/go/src/github.com/rclone/rclone/fstest/fstest.go:311 /home/rclone/go/src/github.com/rclone/rclone/fstest/fstest.go:339 /home/rclone/go/src/github.com/rclone/rclone/fstest/fstest.go:351 /home/rclone/go/src/github.com/rclone/rclone/fstest/run.go:352 /home/rclone/go/src/github.com/rclone/rclone/fs/operations/operations_test.go:1081 /usr/local/go/src/runtime/asm_amd64.s:1264 Error: Not equal: expected: 0 actual : 1 Test: TestMoveFileWithIgnoreExisting Messages: 1 objects not found --- FAIL: TestMoveFileWithIgnoreExisting (34.16s) === RUN TestMoveFileImmutable run.go:198: Remote "Cloudinary root 'rclone-test-vacilat8foqu'", Local "Local file system at /tmp/rclone1719434886", Modify Window "876000h0m0s" 2026/10/02 06:39:42 DEBUG : existing: Need to transfer - File not found at Destination 2026/10/02 06:39:43 DEBUG : existing: size = 8 OK 2026/10/02 06:39:43 DEBUG : existing: md5 = 53f8d64113036808686b056cc0b0f649 OK 2026/10/02 06:39:43 INFO : existing: Copied (new) 2026/10/02 06:39:43 INFO : existing: Deleted operations_test.go:1099: Error Trace: /home/rclone/go/src/github.com/rclone/rclone/fs/operations/operations_test.go:1099 Error: Expected error with "immutable file modified" in chain but got nil. Test: TestMoveFileImmutable fstest.go:299: Sleeping for 1s for list eventual consistency: 1/5 fstest.go:299: Sleeping for 2s for list eventual consistency: 2/5 fstest.go:299: Sleeping for 4s for list eventual consistency: 3/5 fstest.go:299: Sleeping for 8s for list eventual consistency: 4/5 fstest.go:299: Sleeping for 16s for list eventual consistency: 5/5 fstest.go:306: Error Trace: /home/rclone/go/src/github.com/rclone/rclone/fstest/fstest.go:306 /home/rclone/go/src/github.com/rclone/rclone/fstest/fstest.go:339 /home/rclone/go/src/github.com/rclone/rclone/fstest/fstest.go:351 /home/rclone/go/src/github.com/rclone/rclone/fstest/run.go:352 /home/rclone/go/src/github.com/rclone/rclone/fs/operations/operations_test.go:1100 Error: Should be true Test: TestMoveFileImmutable Messages: listing wrong, want existing (8) got fstest.go:204: Not found "existing" fstest.go:207: Error Trace: /home/rclone/go/src/github.com/rclone/rclone/fstest/fstest.go:207 /home/rclone/go/src/github.com/rclone/rclone/fstest/fstest.go:311 /home/rclone/go/src/github.com/rclone/rclone/fstest/fstest.go:339 /home/rclone/go/src/github.com/rclone/rclone/fstest/fstest.go:351 /home/rclone/go/src/github.com/rclone/rclone/fstest/run.go:352 /home/rclone/go/src/github.com/rclone/rclone/fs/operations/operations_test.go:1100 /usr/local/go/src/runtime/asm_amd64.s:1264 Error: Not equal: expected: 0 actual : 1 Test: TestMoveFileImmutable Messages: 1 objects not found fstest.go:299: Sleeping for 1s for list eventual consistency: 1/5 fstest.go:299: Sleeping for 2s for list eventual consistency: 2/5 fstest.go:299: Sleeping for 4s for list eventual consistency: 3/5 fstest.go:299: Sleeping for 8s for list eventual consistency: 4/5 fstest.go:299: Sleeping for 16s for list eventual consistency: 5/5 fstest.go:306: Error Trace: /home/rclone/go/src/github.com/rclone/rclone/fstest/fstest.go:306 /home/rclone/go/src/github.com/rclone/rclone/fstest/fstest.go:339 /home/rclone/go/src/github.com/rclone/rclone/fstest/fstest.go:351 /home/rclone/go/src/github.com/rclone/rclone/fstest/run.go:358 /home/rclone/go/src/github.com/rclone/rclone/fs/operations/operations_test.go:1101 Error: Should be true Test: TestMoveFileImmutable Messages: listing wrong, want existing (6) got existing (8) fstest.go:151: Error Trace: /home/rclone/go/src/github.com/rclone/rclone/fstest/fstest.go:151 /home/rclone/go/src/github.com/rclone/rclone/fstest/fstest.go:196 /home/rclone/go/src/github.com/rclone/rclone/fstest/fstest.go:309 /home/rclone/go/src/github.com/rclone/rclone/fstest/fstest.go:339 /home/rclone/go/src/github.com/rclone/rclone/fstest/fstest.go:351 /home/rclone/go/src/github.com/rclone/rclone/fstest/run.go:358 /home/rclone/go/src/github.com/rclone/rclone/fs/operations/operations_test.go:1101 Error: Not equal: expected: 6 actual : 8 Test: TestMoveFileImmutable Messages: existing: size incorrect file=6 vs obj=8 --- FAIL: TestMoveFileImmutable (66.25s) === RUN TestCaseInsensitiveMoveFile run.go:198: Remote "Cloudinary root 'rclone-test-vacilat8foqu'", Local "Local file system at /tmp/rclone1719434886", Modify Window "876000h0m0s" --- PASS: TestCaseInsensitiveMoveFile (0.59s) === RUN TestCaseInsensitiveMoveFileDryRun run.go:198: Remote "Cloudinary root 'rclone-test-vacilat8foqu'", Local "Local file system at /tmp/rclone1719434886", Modify Window "876000h0m0s" --- PASS: TestCaseInsensitiveMoveFileDryRun (0.65s) === RUN TestMoveFileBackupDir run.go:198: Remote "Cloudinary root 'rclone-test-vacilat8foqu'", Local "Local file system at /tmp/rclone1719434886", Modify Window "876000h0m0s" operations_test.go:1161: Skipping test as remote does not support server-side move or copy --- SKIP: TestMoveFileBackupDir (0.58s) === RUN TestSameConfig --- PASS: TestSameConfig (0.00s) === RUN TestSame --- PASS: TestSame (0.00s) === RUN TestOverlappingFilterCheckWithoutFilter --- PASS: TestOverlappingFilterCheckWithoutFilter (0.00s) === RUN TestOverlappingFilterCheckWithFilter --- PASS: TestOverlappingFilterCheckWithFilter (0.00s) === RUN TestListFormat --- PASS: TestListFormat (0.00s) === RUN TestDirMoveMoveError run.go:198: Remote "Cloudinary root 'rclone-test-vacilat8foqu'", Local "Local file system at /tmp/rclone1719434886", Modify Window "876000h0m0s" operations_test.go:1490: Skipping test on non local remote --- SKIP: TestDirMoveMoveError (19.61s) === RUN TestDirMoveContext run.go:198: Remote "Cloudinary root 'rclone-test-vacilat8foqu'", Local "Local file system at /tmp/rclone1719434886", Modify Window "876000h0m0s" operations_test.go:1490: Skipping test on non local remote --- SKIP: TestDirMoveContext (2.93s) === RUN TestDirMove run.go:198: Remote "Cloudinary root 'rclone-test-vacilat8foqu'", Local "Local file system at /tmp/rclone1719434886", Modify Window "876000h0m0s" 2026/10/02 06:41:15 INFO : A1/B2: Making directory 2026/10/02 06:41:15 INFO : A1/B1/C3: Making directory 2026/10/02 06:41:20 DEBUG : A2/B1/C2/five: size = 4 OK 2026/10/02 06:41:20 DEBUG : A1/B1/C2/five: Src hash empty - aborting Dst hash check 2026/10/02 06:41:20 INFO : A1/B1/C2/five: Copied (new) to: A2/B1/C2/five 2026/10/02 06:41:20 DEBUG : A2/B1/three: size = 5 OK 2026/10/02 06:41:20 DEBUG : A1/B1/three: Src hash empty - aborting Dst hash check 2026/10/02 06:41:20 INFO : A1/B1/three: Copied (new) to: A2/B1/three 2026/10/02 06:41:20 DEBUG : A2/one: size = 3 OK 2026/10/02 06:41:20 DEBUG : A1/one: Src hash empty - aborting Dst hash check 2026/10/02 06:41:20 INFO : A1/one: Copied (new) to: A2/one 2026/10/02 06:41:20 DEBUG : A2/two: size = 3 OK 2026/10/02 06:41:20 DEBUG : A1/two: Src hash empty - aborting Dst hash check 2026/10/02 06:41:20 INFO : A1/two: Copied (new) to: A2/two 2026/10/02 06:41:20 INFO : A1/B1/C2/five: Deleted 2026/10/02 06:41:21 INFO : A1/one: Deleted 2026/10/02 06:41:21 INFO : A1/B1/three: Deleted 2026/10/02 06:41:21 INFO : A1/two: Deleted 2026/10/02 06:41:21 DEBUG : A2/B1/C1/four: size = 4 OK 2026/10/02 06:41:21 DEBUG : A1/B1/C1/four: Src hash empty - aborting Dst hash check 2026/10/02 06:41:21 INFO : A1/B1/C1/four: Copied (new) to: A2/B1/C1/four 2026/10/02 06:41:21 INFO : A1/B1/C1/four: Deleted 2026/10/02 06:41:28 DEBUG : A3/two: size = 3 OK 2026/10/02 06:41:28 DEBUG : A2/two: Src hash empty - aborting Dst hash check 2026/10/02 06:41:28 INFO : A2/two: Copied (new) to: A3/two 2026/10/02 06:41:28 DEBUG : A3/one: size = 3 OK 2026/10/02 06:41:28 DEBUG : A2/one: Src hash empty - aborting Dst hash check 2026/10/02 06:41:28 INFO : A2/one: Copied (new) to: A3/one 2026/10/02 06:41:28 DEBUG : A3/B1/three: size = 5 OK 2026/10/02 06:41:28 DEBUG : A2/B1/three: Src hash empty - aborting Dst hash check 2026/10/02 06:41:28 INFO : A2/B1/three: Copied (new) to: A3/B1/three 2026/10/02 06:41:28 DEBUG : A3/B1/C2/five: size = 4 OK 2026/10/02 06:41:28 DEBUG : A2/B1/C2/five: Src hash empty - aborting Dst hash check 2026/10/02 06:41:28 INFO : A2/B1/C2/five: Copied (new) to: A3/B1/C2/five 2026/10/02 06:41:28 INFO : A2/B1/three: Deleted 2026/10/02 06:41:28 INFO : A2/one: Deleted 2026/10/02 06:41:28 INFO : A2/two: Deleted 2026/10/02 06:41:28 INFO : A2/B1/C2/five: Deleted 2026/10/02 06:41:29 DEBUG : A3/B1/C1/four: size = 4 OK 2026/10/02 06:41:29 DEBUG : A2/B1/C1/four: Src hash empty - aborting Dst hash check 2026/10/02 06:41:29 INFO : A2/B1/C1/four: Copied (new) to: A3/B1/C1/four 2026/10/02 06:41:29 INFO : A2/B1/C1/four: Deleted 2026/10/02 06:41:33 INFO : Cloudinary root 'rclone-test-vacilat8foqu': Can't DirMove - falling back to file moves: can't move directory - incompatible remotes 2026/10/02 06:41:36 DEBUG : A4/two: size = 3 OK 2026/10/02 06:41:36 DEBUG : A3/two: Src hash empty - aborting Dst hash check 2026/10/02 06:41:36 INFO : A3/two: Copied (new) to: A4/two 2026/10/02 06:41:36 DEBUG : A4/B1/C1/four: size = 4 OK 2026/10/02 06:41:36 DEBUG : A3/B1/C1/four: Src hash empty - aborting Dst hash check 2026/10/02 06:41:36 INFO : A3/B1/C1/four: Copied (new) to: A4/B1/C1/four 2026/10/02 06:41:36 DEBUG : A4/B1/three: size = 5 OK 2026/10/02 06:41:36 DEBUG : A3/B1/three: Src hash empty - aborting Dst hash check 2026/10/02 06:41:36 INFO : A3/B1/three: Copied (new) to: A4/B1/three 2026/10/02 06:41:36 DEBUG : A4/B1/C2/five: size = 4 OK 2026/10/02 06:41:36 DEBUG : A3/B1/C2/five: Src hash empty - aborting Dst hash check 2026/10/02 06:41:36 INFO : A3/B1/C2/five: Copied (new) to: A4/B1/C2/five 2026/10/02 06:41:36 DEBUG : A4/one: size = 3 OK 2026/10/02 06:41:36 DEBUG : A3/one: Src hash empty - aborting Dst hash check 2026/10/02 06:41:36 INFO : A3/one: Copied (new) to: A4/one 2026/10/02 06:41:36 INFO : A3/B1/three: Deleted 2026/10/02 06:41:36 INFO : A3/two: Deleted 2026/10/02 06:41:36 INFO : A3/B1/C2/five: Deleted 2026/10/02 06:41:36 INFO : A3/B1/C1/four: Deleted 2026/10/02 06:41:36 INFO : A3/one: Deleted --- PASS: TestDirMove (33.09s) === RUN TestGetFsInfo run.go:198: Remote "Cloudinary root 'rclone-test-vacilat8foqu'", Local "Local file system at /tmp/rclone1719434886", Modify Window "876000h0m0s" --- PASS: TestGetFsInfo (0.56s) === RUN TestRcat === RUN TestRcat/withChecksum=false,ignoreChecksum=false run.go:198: Remote "Cloudinary root 'rclone-test-vacilat8foqu'", Local "Local file system at /tmp/rclone1719434886", Modify Window "876000h0m0s" 2026/10/02 06:41:46 DEBUG : Cloudinary root 'rclone-test-vacilat8foqu': File to upload is small (34 bytes), uploading instead of streaming 2026/10/02 06:41:47 DEBUG : no_checksum_small_file_from_pipe: size = 34 OK 2026/10/02 06:41:47 DEBUG : no_checksum_small_file_from_pipe: md5 = 4c762bc6ec18f21b23fcae426c7863b5 OK 2026/10/02 06:41:47 DEBUG : no_checksum_small_file_from_pipe: Size and md5 of src and dst objects identical 2026/10/02 06:41:47 DEBUG : Cloudinary root 'rclone-test-vacilat8foqu': Target remote doesn't support streaming uploads, creating temporary local FS to spool file 2026/10/02 06:41:48 DEBUG : no_checksum_big_file_from_pipe: size = 102401 OK 2026/10/02 06:41:48 DEBUG : no_checksum_big_file_from_pipe: md5 = fffc7956ba9a7b58a63c01b6ce1ddc45 OK 2026/10/02 06:41:48 DEBUG : no_checksum_big_file_from_pipe: Size and md5 of src and dst objects identical === RUN TestRcat/withChecksum=true,ignoreChecksum=false run.go:198: Remote "Cloudinary root 'rclone-test-vacilat8foqu'", Local "Local file system at /tmp/rclone1719434886", Modify Window "876000h0m0s" 2026/10/02 06:41:49 DEBUG : Cloudinary root 'rclone-test-vacilat8foqu': File to upload is small (34 bytes), uploading instead of streaming 2026/10/02 06:41:50 DEBUG : with_checksum_small_file_from_pipe: size = 34 OK 2026/10/02 06:41:50 DEBUG : with_checksum_small_file_from_pipe: md5 = 4c762bc6ec18f21b23fcae426c7863b5 OK 2026/10/02 06:41:50 DEBUG : with_checksum_small_file_from_pipe: Size and md5 of src and dst objects identical 2026/10/02 06:41:50 DEBUG : Cloudinary root 'rclone-test-vacilat8foqu': Target remote doesn't support streaming uploads, creating temporary local FS to spool file 2026/10/02 06:41:51 DEBUG : with_checksum_big_file_from_pipe: size = 102401 OK 2026/10/02 06:41:51 DEBUG : with_checksum_big_file_from_pipe: md5 = fffc7956ba9a7b58a63c01b6ce1ddc45 OK 2026/10/02 06:41:51 DEBUG : with_checksum_big_file_from_pipe: Size and md5 of src and dst objects identical === RUN TestRcat/withChecksum=false,ignoreChecksum=true run.go:198: Remote "Cloudinary root 'rclone-test-vacilat8foqu'", Local "Local file system at /tmp/rclone1719434886", Modify Window "876000h0m0s" 2026/10/02 06:41:53 DEBUG : Cloudinary root 'rclone-test-vacilat8foqu': File to upload is small (34 bytes), uploading instead of streaming 2026/10/02 06:41:53 DEBUG : ignore_checksum_small_file_from_pipe: size = 34 OK 2026/10/02 06:41:53 DEBUG : ignore_checksum_small_file_from_pipe: Sizes identical 2026/10/02 06:41:53 DEBUG : Cloudinary root 'rclone-test-vacilat8foqu': Target remote doesn't support streaming uploads, creating temporary local FS to spool file 2026/10/02 06:41:54 DEBUG : ignore_checksum_big_file_from_pipe: size = 102401 OK 2026/10/02 06:41:54 DEBUG : ignore_checksum_big_file_from_pipe: Sizes identical === RUN TestRcat/withChecksum=true,ignoreChecksum=true run.go:198: Remote "Cloudinary root 'rclone-test-vacilat8foqu'", Local "Local file system at /tmp/rclone1719434886", Modify Window "876000h0m0s" 2026/10/02 06:41:56 DEBUG : Cloudinary root 'rclone-test-vacilat8foqu': File to upload is small (34 bytes), uploading instead of streaming 2026/10/02 06:41:56 DEBUG : ignore_checksum_small_file_from_pipe: size = 34 OK 2026/10/02 06:41:56 DEBUG : ignore_checksum_small_file_from_pipe: Src hash empty - aborting Dst hash check 2026/10/02 06:41:56 DEBUG : ignore_checksum_small_file_from_pipe: Size of src and dst objects identical 2026/10/02 06:41:56 DEBUG : Cloudinary root 'rclone-test-vacilat8foqu': Target remote doesn't support streaming uploads, creating temporary local FS to spool file 2026/10/02 06:41:57 DEBUG : ignore_checksum_big_file_from_pipe: size = 102401 OK 2026/10/02 06:41:57 DEBUG : ignore_checksum_big_file_from_pipe: Src hash empty - aborting Dst hash check 2026/10/02 06:41:57 DEBUG : ignore_checksum_big_file_from_pipe: Size of src and dst objects identical --- PASS: TestRcat (12.97s) --- PASS: TestRcat/withChecksum=false,ignoreChecksum=false (3.35s) --- PASS: TestRcat/withChecksum=true,ignoreChecksum=false (3.11s) --- PASS: TestRcat/withChecksum=false,ignoreChecksum=true (3.23s) --- PASS: TestRcat/withChecksum=true,ignoreChecksum=true (3.29s) === RUN TestRcatMetadata run.go:198: Remote "Cloudinary root 'rclone-test-vacilat8foqu'", Local "Local file system at /tmp/rclone1719434886", Modify Window "876000h0m0s" operations_test.go:1745: Skipping as destination doesn't support user metadata --- SKIP: TestRcatMetadata (0.52s) === RUN TestRcatSize run.go:198: Remote "Cloudinary root 'rclone-test-vacilat8foqu'", Local "Local file system at /tmp/rclone1719434886", Modify Window "876000h0m0s" 2026/10/02 06:42:00 DEBUG : potato1: size = 60 OK 2026/10/02 06:42:00 DEBUG : potato1: md5 = d6548b156ea68a4e003e786df99eee76 OK 2026/10/02 06:42:00 DEBUG : Cloudinary root 'rclone-test-vacilat8foqu': File to upload is small (60 bytes), uploading instead of streaming 2026/10/02 06:42:00 DEBUG : potato2: size = 60 OK 2026/10/02 06:42:00 DEBUG : potato2: md5 = d6548b156ea68a4e003e786df99eee76 OK 2026/10/02 06:42:00 DEBUG : potato2: Size and md5 of src and dst objects identical --- PASS: TestRcatSize (2.58s) === RUN TestRcatSizeShortEOF run.go:198: Remote "Cloudinary root 'rclone-test-vacilat8foqu'", Local "Local file system at /tmp/rclone1719434886", Modify Window "876000h0m0s" 2026/10/02 06:42:02 DEBUG : potato1: size = 120 (Cloudinary root 'rclone-test-vacilat8foqu') 2026/10/02 06:42:02 DEBUG : potato1: size = 60 (Cloudinary root 'rclone-test-vacilat8foqu') 2026/10/02 06:42:02 ERROR : potato1: corrupted on transfer: sizes differ src 120 vs dst(Cloudinary root 'rclone-test-vacilat8foqu') 60 2026/10/02 06:42:02 INFO : potato1: Removing failed copy --- PASS: TestRcatSizeShortEOF (1.53s) === RUN TestRcatSizeMetadata run.go:198: Remote "Cloudinary root 'rclone-test-vacilat8foqu'", Local "Local file system at /tmp/rclone1719434886", Modify Window "876000h0m0s" operations_test.go:1838: Skipping as destination doesn't support user metadata --- SKIP: TestRcatSizeMetadata (0.58s) === RUN TestRcatSizeUploadHeaders run.go:198: Remote "Cloudinary root 'rclone-test-vacilat8foqu'", Local "Local file system at /tmp/rclone1719434886", Modify Window "876000h0m0s" 2026/10/02 06:42:05 DEBUG : potato1: size = 60 OK 2026/10/02 06:42:05 DEBUG : potato1: md5 = d6548b156ea68a4e003e786df99eee76 OK --- PASS: TestRcatSizeUploadHeaders (1.61s) === RUN TestRcatSizeChecksum === RUN TestRcatSizeChecksum/Corrupted run.go:198: Remote "Cloudinary root 'rclone-test-vacilat8foqu'", Local "Local file system at /tmp/rclone1719434886", Modify Window "876000h0m0s" 2026/10/02 06:42:06 DEBUG : potato1: size = 60 OK 2026/10/02 06:42:06 DEBUG : potato1: md5 = d6548b156ea68a4e003e786df99eee76 (Cloudinary root 'rclone-test-vacilat8foqu') 2026/10/02 06:42:06 DEBUG : potato1: md5 = 771ba8b5f9b1a1201c9f9bb57bf74b99 (Cloudinary root 'rclone-test-vacilat8foqu') 2026/10/02 06:42:06 ERROR : potato1: corrupted on transfer: md5 hashes differ src "d6548b156ea68a4e003e786df99eee76" vs dst(Cloudinary root 'rclone-test-vacilat8foqu') "771ba8b5f9b1a1201c9f9bb57bf74b99" 2026/10/02 06:42:06 INFO : potato1: Removing failed copy === RUN TestRcatSizeChecksum/SizeDiffers run.go:198: Remote "Cloudinary root 'rclone-test-vacilat8foqu'", Local "Local file system at /tmp/rclone1719434886", Modify Window "876000h0m0s" 2026/10/02 06:42:08 DEBUG : potato4: size = 60 (Cloudinary root 'rclone-test-vacilat8foqu') 2026/10/02 06:42:08 DEBUG : potato4: size = 59 (Cloudinary root 'rclone-test-vacilat8foqu') 2026/10/02 06:42:08 ERROR : potato4: corrupted on transfer: sizes differ src 60 vs dst(Cloudinary root 'rclone-test-vacilat8foqu') 59 2026/10/02 06:42:08 INFO : potato4: Removing failed copy === RUN TestRcatSizeChecksum/IgnoreChecksum run.go:198: Remote "Cloudinary root 'rclone-test-vacilat8foqu'", Local "Local file system at /tmp/rclone1719434886", Modify Window "876000h0m0s" 2026/10/02 06:42:09 DEBUG : potato2: size = 60 OK === RUN TestRcatSizeChecksum/NoHashes run.go:198: Remote "Cloudinary root 'rclone-test-vacilat8foqu'", Local "Local file system at /tmp/rclone1719434886", Modify Window "876000h0m0s" 2026/10/02 06:42:11 DEBUG : potato3: size = 60 OK --- PASS: TestRcatSizeChecksum (6.49s) --- PASS: TestRcatSizeChecksum/Corrupted (1.85s) --- PASS: TestRcatSizeChecksum/SizeDiffers (1.58s) --- PASS: TestRcatSizeChecksum/IgnoreChecksum (1.62s) --- PASS: TestRcatSizeChecksum/NoHashes (1.44s) === RUN TestTouchDir run.go:198: Remote "Cloudinary root 'rclone-test-vacilat8foqu'", Local "Local file system at /tmp/rclone1719434886", Modify Window "876000h0m0s" operations_test.go:2020: Skipping test as remote does not support modtime --- SKIP: TestTouchDir (0.56s) === RUN TestMkdirMetadata run.go:198: Remote "Cloudinary root 'rclone-test-vacilat8foqu'", Local "Local file system at /tmp/rclone1719434886", Modify Window "876000h0m0s" operations_test.go:2058: Skipping test as remote does not support MkdirMetadata --- SKIP: TestMkdirMetadata (0.52s) === RUN TestMkdirModTime run.go:198: Remote "Cloudinary root 'rclone-test-vacilat8foqu'", Local "Local file system at /tmp/rclone1719434886", Modify Window "876000h0m0s" operations_test.go:2079: Skipping test as remote does not support DirSetModTime or MkdirMetadata --- SKIP: TestMkdirModTime (0.55s) === RUN TestCopyDirMetadata run.go:198: Remote "Cloudinary root 'rclone-test-vacilat8foqu'", Local "Local file system at /tmp/rclone1719434886", Modify Window "876000h0m0s" operations_test.go:2123: Skipping test as remote does not support WriteDirMetadata or MkdirMetadata --- SKIP: TestCopyDirMetadata (0.53s) === RUN TestSetDirModTime run.go:198: Remote "Cloudinary root 'rclone-test-vacilat8foqu'", Local "Local file system at /tmp/rclone1719434886", Modify Window "876000h0m0s" operations_test.go:2161: Skipping test as remote does not support DirSetModTime or WriteDirSetModTime --- SKIP: TestSetDirModTime (0.60s) === RUN TestDirsEqual run.go:198: Remote "Cloudinary root 'rclone-test-vacilat8foqu'", Local "Local file system at /tmp/rclone1719434886", Modify Window "876000h0m0s" operations_test.go:2212: Skipping test as remote does not support WriteDirMetadata or MkdirMetadata --- SKIP: TestDirsEqual (0.56s) === RUN TestRemoveExisting run.go:198: Remote "Cloudinary root 'rclone-test-vacilat8foqu'", Local "Local file system at /tmp/rclone1719434886", Modify Window "876000h0m0s" operations_test.go:2281: Skipping as remote can't Move --- SKIP: TestRemoveExisting (0.57s) === RUN TestRcatInputFailurePreservesDestination 2026/10/02 06:42:16 DEBUG : Creating backend with remote "/tmp/TestRcatInputFailurePreservesDestination2695298605/001" --- PASS: TestRcatInputFailurePreservesDestination (0.00s) === RUN TestRcAbout rc_test.go:31: Skipping test on non local remote --- SKIP: TestRcAbout (0.00s) === RUN TestRcCleanup rc_test.go:31: Skipping test on non local remote --- SKIP: TestRcCleanup (0.00s) === RUN TestRcCopyfile rc_test.go:31: Skipping test on non local remote --- SKIP: TestRcCopyfile (0.00s) === RUN TestRcCopyurl rc_test.go:31: Skipping test on non local remote --- SKIP: TestRcCopyurl (0.00s) === RUN TestRcDelete rc_test.go:31: Skipping test on non local remote --- SKIP: TestRcDelete (0.00s) === RUN TestRcDeletefile rc_test.go:31: Skipping test on non local remote --- SKIP: TestRcDeletefile (0.00s) === RUN TestRcList rc_test.go:31: Skipping test on non local remote --- SKIP: TestRcList (0.00s) === RUN TestRcStat rc_test.go:31: Skipping test on non local remote --- SKIP: TestRcStat (0.00s) === RUN TestRcSetTier rc_test.go:31: Skipping test on non local remote --- SKIP: TestRcSetTier (0.00s) === RUN TestRcSetTierFile rc_test.go:31: Skipping test on non local remote --- SKIP: TestRcSetTierFile (0.00s) === RUN TestRcMkdir rc_test.go:31: Skipping test on non local remote --- SKIP: TestRcMkdir (0.00s) === RUN TestRcMovefile rc_test.go:31: Skipping test on non local remote --- SKIP: TestRcMovefile (0.00s) === RUN TestRcPurge rc_test.go:31: Skipping test on non local remote --- SKIP: TestRcPurge (0.00s) === RUN TestRcRmdir rc_test.go:31: Skipping test on non local remote --- SKIP: TestRcRmdir (0.00s) === RUN TestRcRmdirs rc_test.go:31: Skipping test on non local remote --- SKIP: TestRcRmdirs (0.00s) === RUN TestRcSize rc_test.go:31: Skipping test on non local remote --- SKIP: TestRcSize (0.00s) === RUN TestRcPublicLink rc_test.go:31: Skipping test on non local remote --- SKIP: TestRcPublicLink (0.00s) === RUN TestRcFsInfo rc_test.go:31: Skipping test on non local remote --- SKIP: TestRcFsInfo (0.00s) === RUN TestUploadFile rc_test.go:31: Skipping test on non local remote --- SKIP: TestUploadFile (0.00s) === RUN TestRcCommand rc_test.go:31: Skipping test on non local remote --- SKIP: TestRcCommand (0.00s) === RUN TestRcDu rc_test.go:31: Skipping test on non local remote --- SKIP: TestRcDu (0.00s) === RUN TestRcCheck rc_test.go:31: Skipping test on non local remote --- SKIP: TestRcCheck (0.00s) === RUN TestRcHashsum rc_test.go:31: Skipping test on non local remote --- SKIP: TestRcHashsum (0.00s) === RUN TestRcHashsumSingleFile rc_test.go:31: Skipping test on non local remote --- SKIP: TestRcHashsumSingleFile (0.00s) === RUN TestRcHashsumFile rc_test.go:31: Skipping test on non local remote --- SKIP: TestRcHashsumFile (0.00s) === RUN TestRcGetFile rc_test.go:31: Skipping test on non local remote --- SKIP: TestRcGetFile (0.00s) FAIL 2026/10/02 06:42:16 DEBUG : Cloudinary root 'rclone-test-vacilat8foqu': Purge dir "" "./operations.test -test.v -test.timeout 1h0m0s -remote TestCloudinary: -list-retries 5 -verbose" - Finished ERROR in 11m48.522172597s (try 1/5): exit status 1: Failed [TestCopyFileImmutable TestIndex TestIndexRules TestIndexMaxDepth TestIndexLinkIndex TestIndexDirTime TestIndexTemplate TestIndexChanged TestIndexChangedFiles TestIndexChangedDirTime TestLsWithFilesFrom]