"./operations.test -test.v -test.timeout 1h0m0s -remote TestCloudinary: -list-retries 5 -verbose" - Starting (try 1/5) 2026/10/01 04:22:52 DEBUG : Creating backend with remote "TestCloudinary:rclone-test-rimusag2kive" 2026/10/01 04:22:52 DEBUG : Using config file from "/home/rclone/.rclone.conf" 2026/10/01 04:22:52 DEBUG : Creating backend with remote "/tmp/rclone878276083" === RUN TestDoMultiThreadCopy --- PASS: TestDoMultiThreadCopy (0.00s) === RUN TestMultithreadCalculateNumChunks === RUN TestMultithreadCalculateNumChunks/{size:1_chunkSize:65536_wantNumChunks:1} === RUN TestMultithreadCalculateNumChunks/{size:1048576_chunkSize:1_wantNumChunks:1048576} === RUN TestMultithreadCalculateNumChunks/{size:1048576_chunkSize:2_wantNumChunks:524288} === RUN TestMultithreadCalculateNumChunks/{size:1048577_chunkSize:2_wantNumChunks:524289} === RUN TestMultithreadCalculateNumChunks/{size:1048575_chunkSize:2_wantNumChunks:524288} --- PASS: TestMultithreadCalculateNumChunks (0.00s) --- PASS: TestMultithreadCalculateNumChunks/{size:1_chunkSize:65536_wantNumChunks:1} (0.00s) --- PASS: TestMultithreadCalculateNumChunks/{size:1048576_chunkSize:1_wantNumChunks:1048576} (0.00s) --- PASS: TestMultithreadCalculateNumChunks/{size:1048576_chunkSize:2_wantNumChunks:524288} (0.00s) --- PASS: TestMultithreadCalculateNumChunks/{size:1048577_chunkSize:2_wantNumChunks:524289} (0.00s) --- PASS: TestMultithreadCalculateNumChunks/{size:1048575_chunkSize:2_wantNumChunks:524288} (0.00s) === RUN TestMultithreadCopy run.go:198: Remote "Cloudinary root 'rclone-test-rimusag2kive'", Local "Local file system at /tmp/rclone878276083", Modify Window "876000h0m0s" multithread_test.go:120: multithread writing not supported 2026/10/01 04:22:52 ERROR : error listing: directory not found --- SKIP: TestMultithreadCopy (0.14s) === RUN TestMultithreadCopyAbort run.go:198: Remote "Cloudinary root 'rclone-test-rimusag2kive'", Local "Local file system at /tmp/rclone878276083", Modify Window "876000h0m0s" multithread_test.go:120: multithread writing not supported 2026/10/01 04:22:52 ERROR : error listing: directory not found --- SKIP: TestMultithreadCopyAbort (0.15s) === RUN TestMultithreadCopyWriterAtErrors === RUN TestMultithreadCopyWriterAtErrors/open/fatal=false 2026/10/01 04:22:52 DEBUG : file.txt: multi-thread copy: disabling buffering because destination uses OpenWriterAt === RUN TestMultithreadCopyWriterAtErrors/open/fatal=true 2026/10/01 04:22:52 DEBUG : file.txt: multi-thread copy: disabling buffering because destination uses OpenWriterAt === RUN TestMultithreadCopyWriterAtErrors/write/fatal=false 2026/10/01 04:22:52 DEBUG : file.txt: multi-thread copy: disabling buffering because destination uses OpenWriterAt 2026/10/01 04:22:52 DEBUG : file.txt: Starting multi-thread copy with 4 chunks of size 4 with 2 parallel streams 2026/10/01 04:22:52 DEBUG : file.txt: multi-thread copy: chunk 2/4 (4-8) size 4 starting 2026/10/01 04:22:52 DEBUG : file.txt: writing chunk 1 2026/10/01 04:22:52 DEBUG : file.txt: multi-thread copy: chunk 2/4 failed: multi-thread copy: failed to write chunk: disk full 2026/10/01 04:22:52 DEBUG : file.txt: multi-thread copy: chunk 3/4 (8-12) size 4 starting 2026/10/01 04:22:52 DEBUG : file.txt: writing chunk 2 2026/10/01 04:22:52 DEBUG : file.txt: multi-thread copy: chunk 3/4 failed: multi-thread copy: failed to write chunk: disk full 2026/10/01 04:22:52 DEBUG : file.txt: multi-thread copy: chunk 1/4 (0-4) size 4 starting 2026/10/01 04:22:52 DEBUG : file.txt: writing chunk 0 2026/10/01 04:22:52 DEBUG : file.txt: multi-thread copy: chunk 1/4 failed: multi-thread copy: failed to write chunk: disk full 2026/10/01 04:22:52 DEBUG : file.txt: multi-thread copy: cancelling transfer on exit 2026/10/01 04:22:52 DEBUG : file.txt: multi-thread copy: abort failed: multi-thread copy: failed to find temp file when aborting chunk writer: object not found === RUN TestMultithreadCopyWriterAtErrors/write/fatal=true 2026/10/01 04:22:52 DEBUG : file.txt: multi-thread copy: disabling buffering because destination uses OpenWriterAt 2026/10/01 04:22:52 DEBUG : file.txt: Starting multi-thread copy with 4 chunks of size 4 with 2 parallel streams 2026/10/01 04:22:52 DEBUG : file.txt: multi-thread copy: chunk 2/4 (4-8) size 4 starting 2026/10/01 04:22:52 DEBUG : file.txt: writing chunk 1 2026/10/01 04:22:52 DEBUG : file.txt: multi-thread copy: chunk 2/4 failed: multi-thread copy: failed to write chunk: disk full 2026/10/01 04:22:52 DEBUG : file.txt: multi-thread copy: chunk 3/4 (8-12) size 4 starting 2026/10/01 04:22:52 DEBUG : file.txt: writing chunk 2 2026/10/01 04:22:52 DEBUG : file.txt: multi-thread copy: chunk 3/4 failed: multi-thread copy: failed to write chunk: disk full 2026/10/01 04:22:52 DEBUG : file.txt: multi-thread copy: chunk 1/4 (0-4) size 4 starting 2026/10/01 04:22:52 DEBUG : file.txt: writing chunk 0 2026/10/01 04:22:52 DEBUG : file.txt: multi-thread copy: chunk 1/4 failed: multi-thread copy: failed to write chunk: disk full 2026/10/01 04:22:52 DEBUG : file.txt: multi-thread copy: cancelling transfer on exit 2026/10/01 04:22:52 DEBUG : file.txt: multi-thread copy: abort failed: multi-thread copy: failed to find temp file when aborting chunk writer: object not found === RUN TestMultithreadCopyWriterAtErrors/close/fatal=false 2026/10/01 04:22:52 DEBUG : file.txt: multi-thread copy: disabling buffering because destination uses OpenWriterAt 2026/10/01 04:22:52 DEBUG : file.txt: Starting multi-thread copy with 4 chunks of size 4 with 2 parallel streams 2026/10/01 04:22:52 DEBUG : file.txt: multi-thread copy: chunk 2/4 (4-8) size 4 starting 2026/10/01 04:22:52 DEBUG : file.txt: writing chunk 1 2026/10/01 04:22:52 DEBUG : file.txt: multi-thread copy: chunk 2/4 (4-8) size 4 finished 2026/10/01 04:22:52 DEBUG : file.txt: multi-thread copy: chunk 1/4 (0-4) size 4 starting 2026/10/01 04:22:52 DEBUG : file.txt: writing chunk 0 2026/10/01 04:22:52 DEBUG : file.txt: multi-thread copy: chunk 3/4 (8-12) size 4 starting 2026/10/01 04:22:52 DEBUG : file.txt: writing chunk 2 2026/10/01 04:22:52 DEBUG : file.txt: multi-thread copy: chunk 1/4 (0-4) size 4 finished 2026/10/01 04:22:52 DEBUG : file.txt: multi-thread copy: chunk 3/4 (8-12) size 4 finished 2026/10/01 04:22:52 DEBUG : file.txt: multi-thread copy: chunk 4/4 (12-16) size 4 starting 2026/10/01 04:22:52 DEBUG : file.txt: writing chunk 3 2026/10/01 04:22:52 DEBUG : file.txt: multi-thread copy: chunk 4/4 (12-16) size 4 finished 2026/10/01 04:22:52 DEBUG : file.txt: multi-thread copy: cancelling transfer on exit 2026/10/01 04:22:52 DEBUG : file.txt: multi-thread copy: abort failed: multi-thread copy: failed to find temp file when aborting chunk writer: object not found === RUN TestMultithreadCopyWriterAtErrors/close/fatal=true 2026/10/01 04:22:52 DEBUG : file.txt: multi-thread copy: disabling buffering because destination uses OpenWriterAt 2026/10/01 04:22:52 DEBUG : file.txt: Starting multi-thread copy with 4 chunks of size 4 with 2 parallel streams 2026/10/01 04:22:52 DEBUG : file.txt: multi-thread copy: chunk 2/4 (4-8) size 4 starting 2026/10/01 04:22:52 DEBUG : file.txt: writing chunk 1 2026/10/01 04:22:52 DEBUG : file.txt: multi-thread copy: chunk 2/4 (4-8) size 4 finished 2026/10/01 04:22:52 DEBUG : file.txt: multi-thread copy: chunk 3/4 (8-12) size 4 starting 2026/10/01 04:22:52 DEBUG : file.txt: writing chunk 2 2026/10/01 04:22:52 DEBUG : file.txt: multi-thread copy: chunk 3/4 (8-12) size 4 finished 2026/10/01 04:22:52 DEBUG : file.txt: multi-thread copy: chunk 4/4 (12-16) size 4 starting 2026/10/01 04:22:52 DEBUG : file.txt: writing chunk 3 2026/10/01 04:22:52 DEBUG : file.txt: multi-thread copy: chunk 4/4 (12-16) size 4 finished 2026/10/01 04:22:52 DEBUG : file.txt: multi-thread copy: chunk 1/4 (0-4) size 4 starting 2026/10/01 04:22:52 DEBUG : file.txt: writing chunk 0 2026/10/01 04:22:52 DEBUG : file.txt: multi-thread copy: chunk 1/4 (0-4) size 4 finished 2026/10/01 04:22:52 DEBUG : file.txt: multi-thread copy: cancelling transfer on exit 2026/10/01 04:22:52 DEBUG : file.txt: multi-thread copy: abort failed: multi-thread copy: failed to find temp file when aborting chunk writer: object not found --- PASS: TestMultithreadCopyWriterAtErrors (0.00s) --- PASS: TestMultithreadCopyWriterAtErrors/open/fatal=false (0.00s) --- PASS: TestMultithreadCopyWriterAtErrors/open/fatal=true (0.00s) --- PASS: TestMultithreadCopyWriterAtErrors/write/fatal=false (0.00s) --- PASS: TestMultithreadCopyWriterAtErrors/write/fatal=true (0.00s) --- PASS: TestMultithreadCopyWriterAtErrors/close/fatal=false (0.00s) --- PASS: TestMultithreadCopyWriterAtErrors/close/fatal=true (0.00s) === RUN TestSizeDiffers 2026/10/01 04:22:52 DEBUG : a: size = 0 OK 2026/10/01 04:22:52 DEBUG : a: size = 1 (memory) 2026/10/01 04:22:52 DEBUG : a: size = 2 (memory) --- PASS: TestSizeDiffers (0.00s) === RUN TestDirTransferEntry --- PASS: TestDirTransferEntry (0.00s) === RUN TestReOpen === RUN TestReOpen/Normal === RUN TestReOpen/Normal/Basics 2026/10/01 04:22:52 DEBUG : potato: Seek from 10 to 0 === RUN TestReOpen/Normal/ErrorAtStart === RUN TestReOpen/Normal/WithErrors 2026/10/01 04:22:52 DEBUG : potato: Reopening on read failure after offset 2 bytes: retry 1/10: test error 2026/10/01 04:22:52 DEBUG : potato: Reopening on read failure after offset 3 bytes: retry 2/10: test error 2026/10/01 04:22:52 DEBUG : potato: Reopening on read failure after offset 6 bytes: retry 3/10: test error === RUN TestReOpen/Normal/TooManyErrors 2026/10/01 04:22:52 DEBUG : potato: Reopening on read failure after offset 2 bytes: retry 1/3: test error 2026/10/01 04:22:52 DEBUG : potato: Reopening on read failure after offset 3 bytes: retry 2/3: test error 2026/10/01 04:22:52 DEBUG : potato: Reopening on read failure after offset 6 bytes: retry 3/3: test error 2026/10/01 04:22:52 DEBUG : potato: Reopen failed after offset 6 bytes read: failed to reopen: too many retries === RUN TestReOpen/Normal/ReadAt 2026/10/01 04:22:52 DEBUG : potato: Reopening on read failure after offset 2 bytes: retry 0/10: test error 2026/10/01 04:22:52 DEBUG : potato: Reopening on read failure after offset 3 bytes: retry 1/10: test error 2026/10/01 04:22:52 DEBUG : potato: Seek from 5 to 1 === RUN TestReOpen/Normal/Seek 2026/10/01 04:22:52 DEBUG : potato: Reopening on read failure after offset 2 bytes: retry 0/10: test error 2026/10/01 04:22:52 DEBUG : potato: Reopening on read failure after offset 3 bytes: retry 1/10: test error 2026/10/01 04:22:52 DEBUG : potato: Seek from 5 to 2 === RUN TestReOpen/Normal/AccountRead === RUN TestReOpen/Normal/AccountReadDelay 2026/10/01 04:22:52 DEBUG : potato: Seek from 10 to 0 2026/10/01 04:22:52 DEBUG : potato: Seek from 10 to 0 2026/10/01 04:22:52 DEBUG : potato: Seek from 10 to 0 === RUN TestReOpen/Normal/AccountReadError === RUN TestReOpen/WithRangeOption === RUN TestReOpen/WithRangeOption/Basics 2026/10/01 04:22:52 DEBUG : potato: Seek from 7 to 0 === RUN TestReOpen/WithRangeOption/ErrorAtStart === RUN TestReOpen/WithRangeOption/WithErrors 2026/10/01 04:22:52 DEBUG : potato: Reopening on read failure after offset 2 bytes: retry 1/10: test error 2026/10/01 04:22:52 DEBUG : potato: Reopening on read failure after offset 3 bytes: retry 2/10: test error 2026/10/01 04:22:52 DEBUG : potato: Reopening on read failure after offset 6 bytes: retry 3/10: test error === RUN TestReOpen/WithRangeOption/TooManyErrors 2026/10/01 04:22:52 DEBUG : potato: Reopening on read failure after offset 2 bytes: retry 1/3: test error 2026/10/01 04:22:52 DEBUG : potato: Reopening on read failure after offset 3 bytes: retry 2/3: test error 2026/10/01 04:22:52 DEBUG : potato: Reopening on read failure after offset 6 bytes: retry 3/3: test error 2026/10/01 04:22:52 DEBUG : potato: Reopen failed after offset 6 bytes read: failed to reopen: too many retries === RUN TestReOpen/WithRangeOption/ReadAt 2026/10/01 04:22:52 DEBUG : potato: Reopening on read failure after offset 2 bytes: retry 0/10: test error 2026/10/01 04:22:52 DEBUG : potato: Reopening on read failure after offset 3 bytes: retry 1/10: test error 2026/10/01 04:22:52 DEBUG : potato: Seek from 5 to 1 === RUN TestReOpen/WithRangeOption/Seek 2026/10/01 04:22:52 DEBUG : potato: Reopening on read failure after offset 2 bytes: retry 0/10: test error 2026/10/01 04:22:52 DEBUG : potato: Reopening on read failure after offset 3 bytes: retry 1/10: test error 2026/10/01 04:22:52 DEBUG : potato: Seek from 5 to 2 2026/10/01 04:22:52 DEBUG : potato: Seek from 7 to 4 === RUN TestReOpen/WithRangeOption/AccountRead === RUN TestReOpen/WithRangeOption/AccountReadDelay 2026/10/01 04:22:52 DEBUG : potato: Seek from 7 to 0 2026/10/01 04:22:52 DEBUG : potato: Seek from 7 to 0 2026/10/01 04:22:52 DEBUG : potato: Seek from 7 to 0 === RUN TestReOpen/WithRangeOption/AccountReadError === RUN TestReOpen/WithSeekOption === RUN TestReOpen/WithSeekOption/Basics 2026/10/01 04:22:52 DEBUG : potato: Seek from 8 to 0 === RUN TestReOpen/WithSeekOption/ErrorAtStart === RUN TestReOpen/WithSeekOption/WithErrors 2026/10/01 04:22:52 DEBUG : potato: Reopening on read failure after offset 2 bytes: retry 1/10: test error 2026/10/01 04:22:52 DEBUG : potato: Reopening on read failure after offset 3 bytes: retry 2/10: test error 2026/10/01 04:22:52 DEBUG : potato: Reopening on read failure after offset 6 bytes: retry 3/10: test error === RUN TestReOpen/WithSeekOption/TooManyErrors 2026/10/01 04:22:52 DEBUG : potato: Reopening on read failure after offset 2 bytes: retry 1/3: test error 2026/10/01 04:22:52 DEBUG : potato: Reopening on read failure after offset 3 bytes: retry 2/3: test error 2026/10/01 04:22:52 DEBUG : potato: Reopening on read failure after offset 6 bytes: retry 3/3: test error 2026/10/01 04:22:52 DEBUG : potato: Reopen failed after offset 6 bytes read: failed to reopen: too many retries === RUN TestReOpen/WithSeekOption/ReadAt 2026/10/01 04:22:52 DEBUG : potato: Reopening on read failure after offset 2 bytes: retry 0/10: test error 2026/10/01 04:22:52 DEBUG : potato: Reopening on read failure after offset 3 bytes: retry 1/10: test error 2026/10/01 04:22:52 DEBUG : potato: Seek from 5 to 1 === RUN TestReOpen/WithSeekOption/Seek 2026/10/01 04:22:52 DEBUG : potato: Reopening on read failure after offset 2 bytes: retry 0/10: test error 2026/10/01 04:22:52 DEBUG : potato: Reopening on read failure after offset 3 bytes: retry 1/10: test error 2026/10/01 04:22:52 DEBUG : potato: Seek from 5 to 2 2026/10/01 04:22:52 DEBUG : potato: Seek from 7 to 5 === RUN TestReOpen/WithSeekOption/AccountRead === RUN TestReOpen/WithSeekOption/AccountReadDelay 2026/10/01 04:22:52 DEBUG : potato: Seek from 8 to 0 2026/10/01 04:22:52 DEBUG : potato: Seek from 8 to 0 2026/10/01 04:22:52 DEBUG : potato: Seek from 8 to 0 === RUN TestReOpen/WithSeekOption/AccountReadError === RUN TestReOpen/UnknownSize === RUN TestReOpen/UnknownSize/Basics 2026/10/01 04:22:52 DEBUG : potato: Seek from 9 to 0 === RUN TestReOpen/UnknownSize/ErrorAtStart === RUN TestReOpen/UnknownSize/WithErrors 2026/10/01 04:22:52 DEBUG : potato: Reopening on read failure after offset 2 bytes: retry 1/10: test error 2026/10/01 04:22:52 DEBUG : potato: Reopening on read failure after offset 3 bytes: retry 2/10: test error 2026/10/01 04:22:52 DEBUG : potato: Reopening on read failure after offset 6 bytes: retry 3/10: test error === RUN TestReOpen/UnknownSize/TooManyErrors 2026/10/01 04:22:52 DEBUG : potato: Reopening on read failure after offset 2 bytes: retry 1/3: test error 2026/10/01 04:22:52 DEBUG : potato: Reopening on read failure after offset 3 bytes: retry 2/3: test error 2026/10/01 04:22:52 DEBUG : potato: Reopening on read failure after offset 6 bytes: retry 3/3: test error 2026/10/01 04:22:52 DEBUG : potato: Reopen failed after offset 6 bytes read: failed to reopen: too many retries === RUN TestReOpen/UnknownSize/ReadAt 2026/10/01 04:22:52 DEBUG : potato: Reopening on read failure after offset 2 bytes: retry 0/10: test error 2026/10/01 04:22:52 DEBUG : potato: Reopening on read failure after offset 3 bytes: retry 1/10: test error 2026/10/01 04:22:52 DEBUG : potato: Seek from 5 to 1 === RUN TestReOpen/UnknownSize/Seek 2026/10/01 04:22:52 DEBUG : potato: Reopening on read failure after offset 2 bytes: retry 0/10: test error 2026/10/01 04:22:52 DEBUG : potato: Reopening on read failure after offset 3 bytes: retry 1/10: test error 2026/10/01 04:22:52 DEBUG : potato: Seek from 5 to 2 2026/10/01 04:22:52 DEBUG : potato: Seek from 7 to 6 === RUN TestReOpen/UnknownSize/AccountRead === RUN TestReOpen/UnknownSize/AccountReadDelay 2026/10/01 04:22:52 DEBUG : potato: Seek from 9 to 0 2026/10/01 04:22:52 DEBUG : potato: Seek from 9 to 0 2026/10/01 04:22:52 DEBUG : potato: Seek from 9 to 0 === RUN TestReOpen/UnknownSize/AccountReadError --- PASS: TestReOpen (0.00s) --- PASS: TestReOpen/Normal (0.00s) --- PASS: TestReOpen/Normal/Basics (0.00s) --- PASS: TestReOpen/Normal/ErrorAtStart (0.00s) --- PASS: TestReOpen/Normal/WithErrors (0.00s) --- PASS: TestReOpen/Normal/TooManyErrors (0.00s) --- PASS: TestReOpen/Normal/ReadAt (0.00s) --- PASS: TestReOpen/Normal/Seek (0.00s) --- PASS: TestReOpen/Normal/AccountRead (0.00s) --- PASS: TestReOpen/Normal/AccountReadDelay (0.00s) --- PASS: TestReOpen/Normal/AccountReadError (0.00s) --- PASS: TestReOpen/WithRangeOption (0.00s) --- PASS: TestReOpen/WithRangeOption/Basics (0.00s) --- PASS: TestReOpen/WithRangeOption/ErrorAtStart (0.00s) --- PASS: TestReOpen/WithRangeOption/WithErrors (0.00s) --- PASS: TestReOpen/WithRangeOption/TooManyErrors (0.00s) --- PASS: TestReOpen/WithRangeOption/ReadAt (0.00s) --- PASS: TestReOpen/WithRangeOption/Seek (0.00s) --- PASS: TestReOpen/WithRangeOption/AccountRead (0.00s) --- PASS: TestReOpen/WithRangeOption/AccountReadDelay (0.00s) --- PASS: TestReOpen/WithRangeOption/AccountReadError (0.00s) --- PASS: TestReOpen/WithSeekOption (0.00s) --- PASS: TestReOpen/WithSeekOption/Basics (0.00s) --- PASS: TestReOpen/WithSeekOption/ErrorAtStart (0.00s) --- PASS: TestReOpen/WithSeekOption/WithErrors (0.00s) --- PASS: TestReOpen/WithSeekOption/TooManyErrors (0.00s) --- PASS: TestReOpen/WithSeekOption/ReadAt (0.00s) --- PASS: TestReOpen/WithSeekOption/Seek (0.00s) --- PASS: TestReOpen/WithSeekOption/AccountRead (0.00s) --- PASS: TestReOpen/WithSeekOption/AccountReadDelay (0.00s) --- PASS: TestReOpen/WithSeekOption/AccountReadError (0.00s) --- PASS: TestReOpen/UnknownSize (0.00s) --- PASS: TestReOpen/UnknownSize/Basics (0.00s) --- PASS: TestReOpen/UnknownSize/ErrorAtStart (0.00s) --- PASS: TestReOpen/UnknownSize/WithErrors (0.00s) --- PASS: TestReOpen/UnknownSize/TooManyErrors (0.00s) --- PASS: TestReOpen/UnknownSize/ReadAt (0.00s) --- PASS: TestReOpen/UnknownSize/Seek (0.00s) --- PASS: TestReOpen/UnknownSize/AccountRead (0.00s) --- PASS: TestReOpen/UnknownSize/AccountReadDelay (0.00s) --- PASS: TestReOpen/UnknownSize/AccountReadError (0.00s) === RUN TestCheck run.go:198: Remote "Cloudinary root 'rclone-test-rimusag2kive'", Local "Local file system at /tmp/rclone878276083", Modify Window "876000h0m0s" === RUN TestCheck/1 === RUN TestCheck/2 === RUN TestCheck/3 === RUN TestCheck/4 === RUN TestCheck/5 === RUN TestCheck/6 === RUN TestCheck/7 --- PASS: TestCheck (8.95s) --- PASS: TestCheck/1 (0.32s) --- PASS: TestCheck/2 (0.29s) --- PASS: TestCheck/3 (0.38s) --- PASS: TestCheck/4 (0.33s) --- PASS: TestCheck/5 (0.32s) --- PASS: TestCheck/6 (0.32s) --- PASS: TestCheck/7 (0.32s) === RUN TestCheckFsError 2026/10/01 04:23:01 DEBUG : Creating backend with remote "nonexistent" 2026/10/01 04:23:01 DEBUG : Creating backend with remote "nonexistent" 2026/10/01 04:23:01 DEBUG : Local file system at nonexistent: Waiting for checks to finish 2026/10/01 04:23:01 ERROR : Local file system at nonexistent: error reading source root directory: directory not found 2026/10/01 04:23:01 NOTICE: Local file system at nonexistent: 0 differences found 2026/10/01 04:23:01 NOTICE: Local file system at nonexistent: 2 errors while checking --- PASS: TestCheckFsError (0.00s) === RUN TestCheckDownload run.go:198: Remote "Cloudinary root 'rclone-test-rimusag2kive'", Local "Local file system at /tmp/rclone878276083", Modify Window "876000h0m0s" === RUN TestCheckDownload/1 === RUN TestCheckDownload/2 === RUN TestCheckDownload/3 === RUN TestCheckDownload/4 === RUN TestCheckDownload/5 === RUN TestCheckDownload/6 === RUN TestCheckDownload/7 --- PASS: TestCheckDownload (11.17s) --- PASS: TestCheckDownload/1 (0.74s) --- PASS: TestCheckDownload/2 (0.47s) --- PASS: TestCheckDownload/3 (0.32s) --- PASS: TestCheckDownload/4 (0.93s) --- PASS: TestCheckDownload/5 (0.36s) --- PASS: TestCheckDownload/6 (0.35s) --- PASS: TestCheckDownload/7 (0.78s) === RUN TestCheckSizeOnly run.go:198: Remote "Cloudinary root 'rclone-test-rimusag2kive'", Local "Local file system at /tmp/rclone878276083", Modify Window "876000h0m0s" === RUN TestCheckSizeOnly/1 === RUN TestCheckSizeOnly/2 === RUN TestCheckSizeOnly/3 === RUN TestCheckSizeOnly/4 === RUN TestCheckSizeOnly/5 === RUN TestCheckSizeOnly/6 === RUN TestCheckSizeOnly/7 --- PASS: TestCheckSizeOnly (10.06s) --- PASS: TestCheckSizeOnly/1 (0.33s) --- PASS: TestCheckSizeOnly/2 (0.38s) --- PASS: TestCheckSizeOnly/3 (0.33s) --- PASS: TestCheckSizeOnly/4 (0.37s) --- PASS: TestCheckSizeOnly/5 (0.32s) --- PASS: TestCheckSizeOnly/6 (0.83s) --- PASS: TestCheckSizeOnly/7 (0.32s) === RUN TestCheckEqualReaders --- PASS: TestCheckEqualReaders (0.00s) === RUN TestParseSumFile run.go:198: Remote "Cloudinary root 'rclone-test-rimusag2kive'", Local "Local file system at /tmp/rclone878276083", Modify Window "876000h0m0s" fstest.go:542: Sleeping for 1s for findObject eventual consistency: 1/5 (object not found) fstest.go:542: Sleeping for 1.5s for findObject eventual consistency: 2/5 (object not found) 2026/10/01 04:23:26 NOTICE: test.sum: improperly formatted checksum line 4 2026/10/01 04:23:26 NOTICE: test.sum: improperly formatted checksum line 5 2026/10/01 04:23:26 NOTICE: test.sum: improperly formatted checksum line 6 2026/10/01 04:23:26 NOTICE: test.sum: 2 warning(s) suppressed... 2026/10/01 04:23:28 NOTICE: test.sum: improperly formatted checksum line 4 2026/10/01 04:23:28 NOTICE: test.sum: improperly formatted checksum line 5 2026/10/01 04:23:28 NOTICE: test.sum: improperly formatted checksum line 6 2026/10/01 04:23:28 NOTICE: test.sum: 2 warning(s) suppressed... --- PASS: TestParseSumFile (5.83s) === RUN TestCheckSum run.go:198: Remote "Cloudinary root 'rclone-test-rimusag2kive'", Local "Local file system at /tmp/rclone878276083", Modify Window "876000h0m0s" 2026/10/01 04:23:28 DEBUG : Creating backend with remote "TestCloudinary:rclone-test-rimusag2kive/data" === RUN TestCheckSum/subtest1 === NAME TestCheckSum check_test.go:408: Error Trace: /home/rclone/go/src/github.com/rclone/rclone/fs/operations/check_test.go:408 /home/rclone/go/src/github.com/rclone/rclone/fs/operations/check_test.go:432 Error: Received unexpected error: cannot open sum file: object not found Test: TestCheckSum Messages: unexpected error in run 1 check_test.go:417: Error Trace: /home/rclone/go/src/github.com/rclone/rclone/fs/operations/check_test.go:417 /home/rclone/go/src/github.com/rclone/rclone/fs/operations/check_test.go:432 Error: "" does not contain "matching files" Test: TestCheckSum Messages: missing matching files in run 1 check_test.go:419: Error Trace: /home/rclone/go/src/github.com/rclone/rclone/fs/operations/check_test.go:419 /home/rclone/go/src/github.com/rclone/rclone/fs/operations/check_test.go:432 Error: Not equal: expected: 1 actual : 0 Test: TestCheckSum Messages: wrong number of checks in run 1 check_test.go:388: Error Trace: /home/rclone/go/src/github.com/rclone/rclone/fs/operations/check_test.go:388 /home/rclone/go/src/github.com/rclone/rclone/fs/operations/check_test.go:421 /home/rclone/go/src/github.com/rclone/rclone/fs/operations/check_test.go:432 Error: Not equal: expected: []string{"", "= banana"} actual : []string{} Diff: --- Expected +++ Actual @@ -1,4 +1,2 @@ -([]string) (len=2) { - (string) "", - (string) (len=8) "= banana" +([]string) { } Test: TestCheckSum Messages: wrong combined result in run 1 check_test.go:388: Error Trace: /home/rclone/go/src/github.com/rclone/rclone/fs/operations/check_test.go:388 /home/rclone/go/src/github.com/rclone/rclone/fs/operations/check_test.go:424 /home/rclone/go/src/github.com/rclone/rclone/fs/operations/check_test.go:432 Error: Not equal: expected: []string{"", "banana"} actual : []string{} Diff: --- Expected +++ Actual @@ -1,4 +1,2 @@ -([]string) (len=2) { - (string) "", - (string) (len=6) "banana" +([]string) { } Test: TestCheckSum Messages: wrong match result in run 1 === RUN TestCheckSum/subtest2 === RUN TestCheckSum/subtest3 === NAME TestCheckSum check_test.go:408: Error Trace: /home/rclone/go/src/github.com/rclone/rclone/fs/operations/check_test.go:408 /home/rclone/go/src/github.com/rclone/rclone/fs/operations/check_test.go:432 Error: Received unexpected error: 1 differences found Test: TestCheckSum Messages: unexpected error in run 3 check_test.go:413: Error Trace: /home/rclone/go/src/github.com/rclone/rclone/fs/operations/check_test.go:413 /home/rclone/go/src/github.com/rclone/rclone/fs/operations/check_test.go:432 Error: Not equal: expected: 0 actual : 1 Test: TestCheckSum Messages: wrong error count in run 3 check_test.go:388: Error Trace: /home/rclone/go/src/github.com/rclone/rclone/fs/operations/check_test.go:388 /home/rclone/go/src/github.com/rclone/rclone/fs/operations/check_test.go:421 /home/rclone/go/src/github.com/rclone/rclone/fs/operations/check_test.go:432 Error: Not equal: expected: []string{"", "= banana", "= potato"} actual : []string{"", "- potato", "= banana"} Diff: --- Expected +++ Actual @@ -2,4 +2,4 @@ (string) "", - (string) (len=8) "= banana", - (string) (len=8) "= potato" + (string) (len=8) "- potato", + (string) (len=8) "= banana" } Test: TestCheckSum Messages: wrong combined result in run 3 check_test.go:388: Error Trace: /home/rclone/go/src/github.com/rclone/rclone/fs/operations/check_test.go:388 /home/rclone/go/src/github.com/rclone/rclone/fs/operations/check_test.go:422 /home/rclone/go/src/github.com/rclone/rclone/fs/operations/check_test.go:432 Error: Not equal: expected: []string{} actual : []string{"", "potato"} Diff: --- Expected +++ Actual @@ -1,2 +1,4 @@ -([]string) { +([]string) (len=2) { + (string) "", + (string) (len=6) "potato" } Test: TestCheckSum Messages: wrong missingonsrc result in run 3 check_test.go:388: Error Trace: /home/rclone/go/src/github.com/rclone/rclone/fs/operations/check_test.go:388 /home/rclone/go/src/github.com/rclone/rclone/fs/operations/check_test.go:424 /home/rclone/go/src/github.com/rclone/rclone/fs/operations/check_test.go:432 Error: Not equal: expected: []string{"", "banana", "potato"} actual : []string{"", "banana"} Diff: --- Expected +++ Actual @@ -1,5 +1,4 @@ -([]string) (len=3) { +([]string) (len=2) { (string) "", - (string) (len=6) "banana", - (string) (len=6) "potato" + (string) (len=6) "banana" } Test: TestCheckSum Messages: wrong match result in run 3 === RUN TestCheckSum/subtest4 === NAME TestCheckSum check_test.go:411: Error Trace: /home/rclone/go/src/github.com/rclone/rclone/fs/operations/check_test.go:411 /home/rclone/go/src/github.com/rclone/rclone/fs/operations/check_test.go:432 Error: An error is expected but got nil. Test: TestCheckSum Messages: no expected error in run 4 check_test.go:413: Error Trace: /home/rclone/go/src/github.com/rclone/rclone/fs/operations/check_test.go:413 /home/rclone/go/src/github.com/rclone/rclone/fs/operations/check_test.go:432 Error: Not equal: expected: 1 actual : 0 Test: TestCheckSum Messages: wrong error count in run 4 check_test.go:388: Error Trace: /home/rclone/go/src/github.com/rclone/rclone/fs/operations/check_test.go:388 /home/rclone/go/src/github.com/rclone/rclone/fs/operations/check_test.go:421 /home/rclone/go/src/github.com/rclone/rclone/fs/operations/check_test.go:432 Error: Not equal: expected: []string{"", "* banana", "= potato"} actual : []string{"", "= banana", "= potato"} Diff: --- Expected +++ Actual @@ -2,3 +2,3 @@ (string) "", - (string) (len=8) "* banana", + (string) (len=8) "= banana", (string) (len=8) "= potato" Test: TestCheckSum Messages: wrong combined result in run 4 check_test.go:388: Error Trace: /home/rclone/go/src/github.com/rclone/rclone/fs/operations/check_test.go:388 /home/rclone/go/src/github.com/rclone/rclone/fs/operations/check_test.go:424 /home/rclone/go/src/github.com/rclone/rclone/fs/operations/check_test.go:432 Error: Not equal: expected: []string{"", "potato"} actual : []string{"", "banana", "potato"} Diff: --- Expected +++ Actual @@ -1,3 +1,4 @@ -([]string) (len=2) { +([]string) (len=3) { (string) "", + (string) (len=6) "banana", (string) (len=6) "potato" Test: TestCheckSum Messages: wrong match result in run 4 check_test.go:388: Error Trace: /home/rclone/go/src/github.com/rclone/rclone/fs/operations/check_test.go:388 /home/rclone/go/src/github.com/rclone/rclone/fs/operations/check_test.go:425 /home/rclone/go/src/github.com/rclone/rclone/fs/operations/check_test.go:432 Error: Not equal: expected: []string{"", "banana"} actual : []string{} Diff: --- Expected +++ Actual @@ -1,4 +1,2 @@ -([]string) (len=2) { - (string) "", - (string) (len=6) "banana" +([]string) { } Test: TestCheckSum Messages: wrong differ result in run 4 === RUN TestCheckSum/subtest5 === RUN TestCheckSum/subtest6 === NAME TestCheckSum check_test.go:413: Error Trace: /home/rclone/go/src/github.com/rclone/rclone/fs/operations/check_test.go:413 /home/rclone/go/src/github.com/rclone/rclone/fs/operations/check_test.go:432 Error: Not equal: expected: 2 actual : 1 Test: TestCheckSum Messages: wrong error count in run 6 check_test.go:388: Error Trace: /home/rclone/go/src/github.com/rclone/rclone/fs/operations/check_test.go:388 /home/rclone/go/src/github.com/rclone/rclone/fs/operations/check_test.go:421 /home/rclone/go/src/github.com/rclone/rclone/fs/operations/check_test.go:432 Error: Not equal: expected: []string{"", "* potato", "+ orange", "= banana"} actual : []string{"", "+ orange", "= banana", "= potato"} Diff: --- Expected +++ Actual @@ -2,5 +2,5 @@ (string) "", - (string) (len=8) "* potato", (string) (len=8) "+ orange", - (string) (len=8) "= banana" + (string) (len=8) "= banana", + (string) (len=8) "= potato" } Test: TestCheckSum Messages: wrong combined result in run 6 check_test.go:388: Error Trace: /home/rclone/go/src/github.com/rclone/rclone/fs/operations/check_test.go:388 /home/rclone/go/src/github.com/rclone/rclone/fs/operations/check_test.go:424 /home/rclone/go/src/github.com/rclone/rclone/fs/operations/check_test.go:432 Error: Not equal: expected: []string{"", "banana"} actual : []string{"", "banana", "potato"} Diff: --- Expected +++ Actual @@ -1,4 +1,5 @@ -([]string) (len=2) { +([]string) (len=3) { (string) "", - (string) (len=6) "banana" + (string) (len=6) "banana", + (string) (len=6) "potato" } Test: TestCheckSum Messages: wrong match result in run 6 check_test.go:388: Error Trace: /home/rclone/go/src/github.com/rclone/rclone/fs/operations/check_test.go:388 /home/rclone/go/src/github.com/rclone/rclone/fs/operations/check_test.go:425 /home/rclone/go/src/github.com/rclone/rclone/fs/operations/check_test.go:432 Error: Not equal: expected: []string{"", "potato"} actual : []string{} Diff: --- Expected +++ Actual @@ -1,4 +1,2 @@ -([]string) (len=2) { - (string) "", - (string) (len=6) "potato" +([]string) { } Test: TestCheckSum Messages: wrong differ result in run 6 === RUN TestCheckSum/subtest7 --- FAIL: TestCheckSum (20.25s) --- PASS: TestCheckSum/subtest1 (0.22s) --- PASS: TestCheckSum/subtest2 (0.96s) --- PASS: TestCheckSum/subtest3 (0.59s) --- PASS: TestCheckSum/subtest4 (0.86s) --- PASS: TestCheckSum/subtest5 (0.98s) --- PASS: TestCheckSum/subtest6 (0.90s) --- PASS: TestCheckSum/subtest7 (0.85s) === RUN TestCheckSumDownload run.go:198: Remote "Cloudinary root 'rclone-test-rimusag2kive'", Local "Local file system at /tmp/rclone878276083", Modify Window "876000h0m0s" 2026/10/01 04:23:49 DEBUG : Creating backend with remote "TestCloudinary:rclone-test-rimusag2kive/data" === RUN TestCheckSumDownload/subtest1 === NAME TestCheckSumDownload check_test.go:408: Error Trace: /home/rclone/go/src/github.com/rclone/rclone/fs/operations/check_test.go:408 /home/rclone/go/src/github.com/rclone/rclone/fs/operations/check_test.go:432 Error: Received unexpected error: cannot open sum file: object not found Test: TestCheckSumDownload Messages: unexpected error in run 1 check_test.go:417: Error Trace: /home/rclone/go/src/github.com/rclone/rclone/fs/operations/check_test.go:417 /home/rclone/go/src/github.com/rclone/rclone/fs/operations/check_test.go:432 Error: "" does not contain "matching files" Test: TestCheckSumDownload Messages: missing matching files in run 1 check_test.go:419: Error Trace: /home/rclone/go/src/github.com/rclone/rclone/fs/operations/check_test.go:419 /home/rclone/go/src/github.com/rclone/rclone/fs/operations/check_test.go:432 Error: Not equal: expected: 1 actual : 0 Test: TestCheckSumDownload Messages: wrong number of checks in run 1 check_test.go:388: Error Trace: /home/rclone/go/src/github.com/rclone/rclone/fs/operations/check_test.go:388 /home/rclone/go/src/github.com/rclone/rclone/fs/operations/check_test.go:421 /home/rclone/go/src/github.com/rclone/rclone/fs/operations/check_test.go:432 Error: Not equal: expected: []string{"", "= banana"} actual : []string{} Diff: --- Expected +++ Actual @@ -1,4 +1,2 @@ -([]string) (len=2) { - (string) "", - (string) (len=8) "= banana" +([]string) { } Test: TestCheckSumDownload Messages: wrong combined result in run 1 check_test.go:388: Error Trace: /home/rclone/go/src/github.com/rclone/rclone/fs/operations/check_test.go:388 /home/rclone/go/src/github.com/rclone/rclone/fs/operations/check_test.go:424 /home/rclone/go/src/github.com/rclone/rclone/fs/operations/check_test.go:432 Error: Not equal: expected: []string{"", "banana"} actual : []string{} Diff: --- Expected +++ Actual @@ -1,4 +1,2 @@ -([]string) (len=2) { - (string) "", - (string) (len=6) "banana" +([]string) { } Test: TestCheckSumDownload Messages: wrong match result in run 1 === RUN TestCheckSumDownload/subtest2 === RUN TestCheckSumDownload/subtest3 === RUN TestCheckSumDownload/subtest4 === RUN TestCheckSumDownload/subtest5 === RUN TestCheckSumDownload/subtest6 === RUN TestCheckSumDownload/subtest7 --- FAIL: TestCheckSumDownload (20.33s) --- PASS: TestCheckSumDownload/subtest1 (0.18s) --- PASS: TestCheckSumDownload/subtest2 (0.94s) --- PASS: TestCheckSumDownload/subtest3 (0.87s) --- PASS: TestCheckSumDownload/subtest4 (0.97s) --- PASS: TestCheckSumDownload/subtest5 (0.88s) --- PASS: TestCheckSumDownload/subtest6 (1.00s) --- PASS: TestCheckSumDownload/subtest7 (0.98s) === RUN TestCheckSumConcurrency 2026/10/01 04:24:09 DEBUG : file0: md5 = 022eb0c0085c731f335df970fafa7446 OK 2026/10/01 04:24:09 DEBUG : file2: md5 = a58f09ae3db8ae4b943fdbaace096072 OK 2026/10/01 04:24:09 DEBUG : file1: md5 = 17fbabbccbdea0e6be9eb64c8c6fea41 OK 2026/10/01 04:24:09 DEBUG : file3: md5 = e0639b17e0744aca9a3ba29c049e59ee OK 2026/10/01 04:24:09 NOTICE: Mock file system at checkSum: 0 differences found 2026/10/01 04:24:09 NOTICE: Mock file system at checkSum: 4 matching files --- PASS: TestCheckSumConcurrency (0.00s) === RUN TestCheckSumDownloadConcurrency 2026/10/01 04:24:09 DEBUG : file0: md5 = 022eb0c0085c731f335df970fafa7446 OK 2026/10/01 04:24:09 DEBUG : file2: md5 = a58f09ae3db8ae4b943fdbaace096072 OK 2026/10/01 04:24:09 DEBUG : file3: md5 = e0639b17e0744aca9a3ba29c049e59ee OK 2026/10/01 04:24:09 DEBUG : file1: md5 = 17fbabbccbdea0e6be9eb64c8c6fea41 OK 2026/10/01 04:24:09 NOTICE: Mock file system at checkSum: 0 differences found 2026/10/01 04:24:09 NOTICE: Mock file system at checkSum: 4 matching files --- PASS: TestCheckSumDownloadConcurrency (0.00s) === RUN TestApplyTransforms 2026/10/01 04:24:09 DEBUG : Creating backend with remote "TestCloudinary:rclone-test-sidarup3fiya" 2026/10/01 04:24:09 DEBUG : Using config file from "/home/rclone/.rclone.conf" 2026/10/01 04:24:09 DEBUG : Creating backend with remote "/tmp/rclone1677918868" run.go:198: Remote "Cloudinary root 'rclone-test-sidarup3fiya'", Local "Local file system at /tmp/rclone1677918868", Modify Window "876000h0m0s" upper checkfile vs. lower remote (without normalization) 2026/10/01 04:24:11 ERROR : hello, world!: sum not found 2026/10/01 04:24:11 ERROR : HELLO, WORLD!: file not in Cloudinary root 'rclone-test-sidarup3fiya' 2026/10/01 04:24:11 NOTICE: Cloudinary root 'rclone-test-sidarup3fiya': 1 files missing 2026/10/01 04:24:11 NOTICE: 1 hashes missing 2026/10/01 04:24:11 NOTICE: Cloudinary root 'rclone-test-sidarup3fiya': 1 differences found 2026/10/01 04:24:11 NOTICE: Cloudinary root 'rclone-test-sidarup3fiya': 2 errors while checking upper checkfile vs. lower remote (with normalization) 2026/10/01 04:24:12 DEBUG : hello, world!: md5 = 65a8e27d8879283831b664bd8b7f0ad4 OK 2026/10/01 04:24:12 NOTICE: Cloudinary root 'rclone-test-sidarup3fiya': 0 differences found 2026/10/01 04:24:12 NOTICE: Cloudinary root 'rclone-test-sidarup3fiya': 1 matching files 2026/10/01 04:24:12 DEBUG : Creating backend with remote "TestCloudinary:rclone-test-wexolab1mebo" 2026/10/01 04:24:12 DEBUG : Using config file from "/home/rclone/.rclone.conf" 2026/10/01 04:24:13 DEBUG : Creating backend with remote "/tmp/rclone1302690606" run.go:198: Remote "Cloudinary root 'rclone-test-wexolab1mebo'", Local "Local file system at /tmp/rclone1302690606", Modify Window "876000h0m0s" lower checkfile vs. upper remote (without normalization) 2026/10/01 04:24:14 ERROR : HELLO, WORLD!: sum not found 2026/10/01 04:24:14 ERROR : hello, world!: file not in Cloudinary root 'rclone-test-wexolab1mebo' 2026/10/01 04:24:14 NOTICE: Cloudinary root 'rclone-test-wexolab1mebo': 1 files missing 2026/10/01 04:24:14 NOTICE: 1 hashes missing 2026/10/01 04:24:14 NOTICE: Cloudinary root 'rclone-test-wexolab1mebo': 1 differences found 2026/10/01 04:24:14 NOTICE: Cloudinary root 'rclone-test-wexolab1mebo': 2 errors while checking lower checkfile vs. upper remote (with normalization) 2026/10/01 04:24:15 DEBUG : HELLO, WORLD!: md5 = 65a8e27d8879283831b664bd8b7f0ad4 OK 2026/10/01 04:24:15 NOTICE: Cloudinary root 'rclone-test-wexolab1mebo': 0 differences found 2026/10/01 04:24:15 NOTICE: Cloudinary root 'rclone-test-wexolab1mebo': 1 matching files 2026/10/01 04:24:15 DEBUG : Creating backend with remote "TestCloudinary:rclone-test-hukitup5vope" 2026/10/01 04:24:15 DEBUG : Using config file from "/home/rclone/.rclone.conf" 2026/10/01 04:24:15 DEBUG : Creating backend with remote "/tmp/rclone2034430512" run.go:198: Remote "Cloudinary root 'rclone-test-hukitup5vope'", Local "Local file system at /tmp/rclone2034430512", Modify Window "876000h0m0s" lower checkfile vs. upperlowermixed remote (without normalization) 2026/10/01 04:24:17 ERROR : HeLlO, wOrLd!: sum not found 2026/10/01 04:24:17 ERROR : hello, world!: file not in Cloudinary root 'rclone-test-hukitup5vope' 2026/10/01 04:24:17 NOTICE: Cloudinary root 'rclone-test-hukitup5vope': 1 files missing 2026/10/01 04:24:17 NOTICE: 1 hashes missing 2026/10/01 04:24:17 NOTICE: Cloudinary root 'rclone-test-hukitup5vope': 1 differences found 2026/10/01 04:24:17 NOTICE: Cloudinary root 'rclone-test-hukitup5vope': 2 errors while checking lower checkfile vs. upperlowermixed remote (with normalization) 2026/10/01 04:24:17 DEBUG : HeLlO, wOrLd!: md5 = 65a8e27d8879283831b664bd8b7f0ad4 OK 2026/10/01 04:24:17 NOTICE: Cloudinary root 'rclone-test-hukitup5vope': 0 differences found 2026/10/01 04:24:17 NOTICE: Cloudinary root 'rclone-test-hukitup5vope': 1 matching files 2026/10/01 04:24:17 DEBUG : Creating backend with remote "TestCloudinary:rclone-test-lixelab1xuyo" 2026/10/01 04:24:17 DEBUG : Using config file from "/home/rclone/.rclone.conf" 2026/10/01 04:24:17 DEBUG : Creating backend with remote "/tmp/rclone1767712737" run.go:198: Remote "Cloudinary root 'rclone-test-lixelab1xuyo'", Local "Local file system at /tmp/rclone1767712737", Modify Window "876000h0m0s" upperlowermixed checkfile vs. upper remote (without normalization) 2026/10/01 04:24:19 ERROR : HELLO, WORLD!: sum not found 2026/10/01 04:24:19 ERROR : HeLlO, wOrLd!: file not in Cloudinary root 'rclone-test-lixelab1xuyo' 2026/10/01 04:24:19 NOTICE: Cloudinary root 'rclone-test-lixelab1xuyo': 1 files missing 2026/10/01 04:24:19 NOTICE: 1 hashes missing 2026/10/01 04:24:19 NOTICE: Cloudinary root 'rclone-test-lixelab1xuyo': 1 differences found 2026/10/01 04:24:19 NOTICE: Cloudinary root 'rclone-test-lixelab1xuyo': 2 errors while checking upperlowermixed checkfile vs. upper remote (with normalization) 2026/10/01 04:24:20 DEBUG : HELLO, WORLD!: md5 = 65a8e27d8879283831b664bd8b7f0ad4 OK 2026/10/01 04:24:20 NOTICE: Cloudinary root 'rclone-test-lixelab1xuyo': 0 differences found 2026/10/01 04:24:20 NOTICE: Cloudinary root 'rclone-test-lixelab1xuyo': 1 matching files 2026/10/01 04:24:20 DEBUG : Creating backend with remote "TestCloudinary:rclone-test-cuxixuj3qasu" 2026/10/01 04:24:20 DEBUG : Using config file from "/home/rclone/.rclone.conf" 2026/10/01 04:24:20 DEBUG : Creating backend with remote "/tmp/rclone943527373" run.go:198: Remote "Cloudinary root 'rclone-test-cuxixuj3qasu'", Local "Local file system at /tmp/rclone943527373", Modify Window "876000h0m0s" NFD checkfile vs. NFC remote (without normalization) 2026/10/01 04:24:22 ERROR : 測試_Русский___ě_áñ: sum not found 2026/10/01 04:24:22 ERROR : 測試_Русский___ě_áñ: file not in Cloudinary root 'rclone-test-cuxixuj3qasu' 2026/10/01 04:24:22 NOTICE: Cloudinary root 'rclone-test-cuxixuj3qasu': 1 files missing 2026/10/01 04:24:22 NOTICE: 1 hashes missing 2026/10/01 04:24:22 NOTICE: Cloudinary root 'rclone-test-cuxixuj3qasu': 1 differences found 2026/10/01 04:24:22 NOTICE: Cloudinary root 'rclone-test-cuxixuj3qasu': 2 errors while checking NFD checkfile vs. NFC remote (with normalization) 2026/10/01 04:24:23 DEBUG : 測試_Русский___ě_áñ: md5 = 65a8e27d8879283831b664bd8b7f0ad4 OK 2026/10/01 04:24:23 NOTICE: Cloudinary root 'rclone-test-cuxixuj3qasu': 0 differences found 2026/10/01 04:24:23 NOTICE: Cloudinary root 'rclone-test-cuxixuj3qasu': 1 matching files 2026/10/01 04:24:23 DEBUG : Creating backend with remote "TestCloudinary:rclone-test-yoqufeq4pusi" 2026/10/01 04:24:23 DEBUG : Using config file from "/home/rclone/.rclone.conf" 2026/10/01 04:24:23 DEBUG : Creating backend with remote "/tmp/rclone3873395053" run.go:198: Remote "Cloudinary root 'rclone-test-yoqufeq4pusi'", Local "Local file system at /tmp/rclone3873395053", Modify Window "876000h0m0s" NFC checkfile vs. NFD remote (without normalization) 2026/10/01 04:24:25 ERROR : 測試_Русский___ě_áñ: sum not found 2026/10/01 04:24:25 ERROR : 測試_Русский___ě_áñ: file not in Cloudinary root 'rclone-test-yoqufeq4pusi' 2026/10/01 04:24:25 NOTICE: Cloudinary root 'rclone-test-yoqufeq4pusi': 1 files missing 2026/10/01 04:24:25 NOTICE: 1 hashes missing 2026/10/01 04:24:25 NOTICE: Cloudinary root 'rclone-test-yoqufeq4pusi': 1 differences found 2026/10/01 04:24:25 NOTICE: Cloudinary root 'rclone-test-yoqufeq4pusi': 2 errors while checking NFC checkfile vs. NFD remote (with normalization) 2026/10/01 04:24:25 DEBUG : 測試_Русский___ě_áñ: md5 = 65a8e27d8879283831b664bd8b7f0ad4 OK 2026/10/01 04:24:25 NOTICE: Cloudinary root 'rclone-test-yoqufeq4pusi': 0 differences found 2026/10/01 04:24:25 NOTICE: Cloudinary root 'rclone-test-yoqufeq4pusi': 1 matching files 2026/10/01 04:24:25 DEBUG : Creating backend with remote "TestCloudinary:rclone-test-hofowiy7vejo" 2026/10/01 04:24:25 DEBUG : Using config file from "/home/rclone/.rclone.conf" 2026/10/01 04:24:26 DEBUG : Creating backend with remote "/tmp/rclone2709356929" run.go:198: Remote "Cloudinary root 'rclone-test-hofowiy7vejo'", Local "Local file system at /tmp/rclone2709356929", Modify Window "876000h0m0s" NFDx2 checkfile vs. both remote (without normalization) 2026/10/01 04:24:27 ERROR : 測試_Русский___ě_áñ測試_Русский___ě_áñ: sum not found 2026/10/01 04:24:27 ERROR : 測試_Русский___ě_áñ測試_Русский___ě_áñ: file not in Cloudinary root 'rclone-test-hofowiy7vejo' 2026/10/01 04:24:27 NOTICE: Cloudinary root 'rclone-test-hofowiy7vejo': 1 files missing 2026/10/01 04:24:27 NOTICE: 1 hashes missing 2026/10/01 04:24:27 NOTICE: Cloudinary root 'rclone-test-hofowiy7vejo': 1 differences found 2026/10/01 04:24:27 NOTICE: Cloudinary root 'rclone-test-hofowiy7vejo': 2 errors while checking NFDx2 checkfile vs. both remote (with normalization) 2026/10/01 04:24:28 DEBUG : 測試_Русский___ě_áñ測試_Русский___ě_áñ: md5 = 65a8e27d8879283831b664bd8b7f0ad4 OK 2026/10/01 04:24:28 NOTICE: Cloudinary root 'rclone-test-hofowiy7vejo': 0 differences found 2026/10/01 04:24:28 NOTICE: Cloudinary root 'rclone-test-hofowiy7vejo': 1 matching files 2026/10/01 04:24:28 DEBUG : Creating backend with remote "TestCloudinary:rclone-test-solibiw7nofa" 2026/10/01 04:24:28 DEBUG : Using config file from "/home/rclone/.rclone.conf" 2026/10/01 04:24:29 DEBUG : Creating backend with remote "/tmp/rclone2057090012" run.go:198: Remote "Cloudinary root 'rclone-test-solibiw7nofa'", Local "Local file system at /tmp/rclone2057090012", Modify Window "876000h0m0s" NFCx2 checkfile vs. both remote (without normalization) 2026/10/01 04:24:30 ERROR : 測試_Русский___ě_áñ測試_Русский___ě_áñ: sum not found 2026/10/01 04:24:30 ERROR : 測試_Русский___ě_áñ測試_Русский___ě_áñ: file not in Cloudinary root 'rclone-test-solibiw7nofa' 2026/10/01 04:24:30 NOTICE: Cloudinary root 'rclone-test-solibiw7nofa': 1 files missing 2026/10/01 04:24:30 NOTICE: 1 hashes missing 2026/10/01 04:24:30 NOTICE: Cloudinary root 'rclone-test-solibiw7nofa': 1 differences found 2026/10/01 04:24:30 NOTICE: Cloudinary root 'rclone-test-solibiw7nofa': 2 errors while checking NFCx2 checkfile vs. both remote (with normalization) 2026/10/01 04:24:31 DEBUG : 測試_Русский___ě_áñ測試_Русский___ě_áñ: md5 = 65a8e27d8879283831b664bd8b7f0ad4 OK 2026/10/01 04:24:31 NOTICE: Cloudinary root 'rclone-test-solibiw7nofa': 0 differences found 2026/10/01 04:24:31 NOTICE: Cloudinary root 'rclone-test-solibiw7nofa': 1 matching files 2026/10/01 04:24:31 DEBUG : Creating backend with remote "TestCloudinary:rclone-test-huwaluf8hegi" 2026/10/01 04:24:31 DEBUG : Using config file from "/home/rclone/.rclone.conf" 2026/10/01 04:24:32 DEBUG : Creating backend with remote "/tmp/rclone485674687" run.go:198: Remote "Cloudinary root 'rclone-test-huwaluf8hegi'", Local "Local file system at /tmp/rclone485674687", Modify Window "876000h0m0s" both checkfile vs. NFDx2 remote (without normalization) 2026/10/01 04:24:34 ERROR : 測試_Русский___ě_áñ測試_Русский___ě_áñ: sum not found 2026/10/01 04:24:34 ERROR : 測試_Русский___ě_áñ測試_Русский___ě_áñ: file not in Cloudinary root 'rclone-test-huwaluf8hegi' 2026/10/01 04:24:34 NOTICE: Cloudinary root 'rclone-test-huwaluf8hegi': 1 files missing 2026/10/01 04:24:34 NOTICE: 1 hashes missing 2026/10/01 04:24:34 NOTICE: Cloudinary root 'rclone-test-huwaluf8hegi': 1 differences found 2026/10/01 04:24:34 NOTICE: Cloudinary root 'rclone-test-huwaluf8hegi': 2 errors while checking both checkfile vs. NFDx2 remote (with normalization) 2026/10/01 04:24:34 DEBUG : 測試_Русский___ě_áñ測試_Русский___ě_áñ: md5 = 65a8e27d8879283831b664bd8b7f0ad4 OK 2026/10/01 04:24:34 NOTICE: Cloudinary root 'rclone-test-huwaluf8hegi': 0 differences found 2026/10/01 04:24:34 NOTICE: Cloudinary root 'rclone-test-huwaluf8hegi': 1 matching files 2026/10/01 04:24:34 DEBUG : Creating backend with remote "TestCloudinary:rclone-test-giwapil2leke" 2026/10/01 04:24:34 DEBUG : Using config file from "/home/rclone/.rclone.conf" 2026/10/01 04:24:34 DEBUG : Creating backend with remote "/tmp/rclone4020455935" run.go:198: Remote "Cloudinary root 'rclone-test-giwapil2leke'", Local "Local file system at /tmp/rclone4020455935", Modify Window "876000h0m0s" both checkfile vs. NFCx2 remote (without normalization) 2026/10/01 04:24:36 ERROR : 測試_Русский___ě_áñ測試_Русский___ě_áñ: sum not found 2026/10/01 04:24:36 ERROR : 測試_Русский___ě_áñ測試_Русский___ě_áñ: file not in Cloudinary root 'rclone-test-giwapil2leke' 2026/10/01 04:24:36 NOTICE: Cloudinary root 'rclone-test-giwapil2leke': 1 files missing 2026/10/01 04:24:36 NOTICE: 1 hashes missing 2026/10/01 04:24:36 NOTICE: Cloudinary root 'rclone-test-giwapil2leke': 1 differences found 2026/10/01 04:24:36 NOTICE: Cloudinary root 'rclone-test-giwapil2leke': 2 errors while checking both checkfile vs. NFCx2 remote (with normalization) 2026/10/01 04:24:37 DEBUG : 測試_Русский___ě_áñ測試_Русский___ě_áñ: md5 = 65a8e27d8879283831b664bd8b7f0ad4 OK 2026/10/01 04:24:37 NOTICE: Cloudinary root 'rclone-test-giwapil2leke': 0 differences found 2026/10/01 04:24:37 NOTICE: Cloudinary root 'rclone-test-giwapil2leke': 1 matching files 2026/10/01 04:24:37 DEBUG : Cloudinary root 'rclone-test-giwapil2leke': Purge object "測試_Русский___ě_áñ測試_Русский___ě_áñ" 2026/10/01 04:24:38 DEBUG : Cloudinary root 'rclone-test-giwapil2leke': Purge dir "" 2026/10/01 04:24:40 DEBUG : Cloudinary root 'rclone-test-huwaluf8hegi': Purge object "測試_Русский___ě_áñ測試_Русский___ě_áñ" 2026/10/01 04:24:40 DEBUG : Cloudinary root 'rclone-test-huwaluf8hegi': Purge dir "" 2026/10/01 04:24:41 DEBUG : Cloudinary root 'rclone-test-solibiw7nofa': Purge object "測試_Русский___ě_áñ測試_Русский___ě_áñ" 2026/10/01 04:24:41 DEBUG : Cloudinary root 'rclone-test-solibiw7nofa': Purge dir "" 2026/10/01 04:24:42 DEBUG : Cloudinary root 'rclone-test-hofowiy7vejo': Purge object "測試_Русский___ě_áñ測試_Русский___ě_áñ" 2026/10/01 04:24:43 DEBUG : Cloudinary root 'rclone-test-hofowiy7vejo': Purge dir "" 2026/10/01 04:24:43 DEBUG : Cloudinary root 'rclone-test-yoqufeq4pusi': Purge object "測試_Русский___ě_áñ" 2026/10/01 04:24:44 DEBUG : Cloudinary root 'rclone-test-yoqufeq4pusi': Purge dir "" 2026/10/01 04:24:45 DEBUG : Cloudinary root 'rclone-test-cuxixuj3qasu': Purge object "測試_Русский___ě_áñ" 2026/10/01 04:24:45 DEBUG : Cloudinary root 'rclone-test-cuxixuj3qasu': Purge dir "" 2026/10/01 04:24:46 DEBUG : Cloudinary root 'rclone-test-lixelab1xuyo': Purge object "HELLO, WORLD!" 2026/10/01 04:24:46 DEBUG : Cloudinary root 'rclone-test-lixelab1xuyo': Purge dir "" 2026/10/01 04:24:47 DEBUG : Cloudinary root 'rclone-test-hukitup5vope': Purge object "HeLlO, wOrLd!" 2026/10/01 04:24:47 DEBUG : Cloudinary root 'rclone-test-hukitup5vope': Purge dir "" 2026/10/01 04:24:47 DEBUG : Cloudinary root 'rclone-test-wexolab1mebo': Purge object "HELLO, WORLD!" 2026/10/01 04:24:48 DEBUG : Cloudinary root 'rclone-test-wexolab1mebo': Purge dir "" 2026/10/01 04:24:49 DEBUG : Cloudinary root 'rclone-test-sidarup3fiya': Purge object "hello, world!" 2026/10/01 04:24:49 DEBUG : Cloudinary root 'rclone-test-sidarup3fiya': Purge dir "" --- PASS: TestApplyTransforms (40.14s) === RUN TestTruncateString --- PASS: TestTruncateString (0.00s) === RUN TestCopyFile run.go:198: Remote "Cloudinary root 'rclone-test-rimusag2kive'", Local "Local file system at /tmp/rclone878276083", Modify Window "876000h0m0s" 2026/10/01 04:24:49 DEBUG : file1: Need to transfer - File not found at Destination 2026/10/01 04:24:50 DEBUG : sub/file2: size = 14 OK 2026/10/01 04:24:50 DEBUG : file1: md5 = 0ef726ce9b1a7692357ff70dd321d595 OK 2026/10/01 04:24:50 INFO : file1: Copied (new) to: sub/file2 2026/10/01 04:24:51 DEBUG : file1: Need to transfer - File not found at Destination 2026/10/01 04:24:51 DEBUG : sub/file2: size = 14 OK 2026/10/01 04:24:51 DEBUG : file1: md5 = 0ef726ce9b1a7692357ff70dd321d595 OK 2026/10/01 04:24:51 INFO : file1: Copied (new) to: sub/file2 2026/10/01 04:24:53 DEBUG : Cloudinary root 'rclone-test-rimusag2kive': don't need to copy/move sub/file2, it is already at target location --- PASS: TestCopyFile (6.27s) === RUN TestCopyFileImmutable run.go:198: Remote "Cloudinary root 'rclone-test-rimusag2kive'", Local "Local file system at /tmp/rclone878276083", Modify Window "876000h0m0s" 2026/10/01 04:24:56 DEBUG : existing: Need to transfer - File not found at Destination 2026/10/01 04:24:56 DEBUG : existing: size = 6 OK 2026/10/01 04:24:56 DEBUG : existing: md5 = 8ee2027983915ec78acc45027d874316 OK 2026/10/01 04:24:56 INFO : existing: Copied (new) 2026/10/01 04:24:57 DEBUG : existing: Need to transfer - File not found at Destination 2026/10/01 04:24:57 DEBUG : existing: size = 6 OK 2026/10/01 04:24:57 DEBUG : existing: md5 = 8ee2027983915ec78acc45027d874316 OK 2026/10/01 04:24:57 INFO : existing: Copied (new) 2026/10/01 04:24:58 DEBUG : existing: size = 8 (Local file system at /tmp/rclone878276083) 2026/10/01 04:24:58 DEBUG : existing: size = 6 (Cloudinary root 'rclone-test-rimusag2kive') 2026/10/01 04:24:58 DEBUG : existing: Sizes differ 2026/10/01 04:24:58 ERROR : existing: Source and destination exist but do not match: immutable file modified --- PASS: TestCopyFileImmutable (3.81s) === RUN TestCopyLongFile run.go:198: Remote "Cloudinary root 'rclone-test-rimusag2kive'", Local "Local file system at /tmp/rclone878276083", Modify Window "876000h0m0s" copy_test.go:188: Test only runs on local --- SKIP: TestCopyLongFile (0.55s) === RUN TestCopyFileBackupDir run.go:198: Remote "Cloudinary root 'rclone-test-rimusag2kive'", Local "Local file system at /tmp/rclone878276083", Modify Window "876000h0m0s" copy_test.go:208: Skipping test as remote does not support server-side move or copy --- SKIP: TestCopyFileBackupDir (0.64s) === RUN TestCopyFileCompareDest run.go:198: Remote "Cloudinary root 'rclone-test-rimusag2kive'", Local "Local file system at /tmp/rclone878276083", Modify Window "876000h0m0s" 2026/10/01 04:25:00 DEBUG : Creating backend with remote "TestCloudinary:rclone-test-rimusag2kive/dst" 2026/10/01 04:25:01 DEBUG : Creating backend with remote "TestCloudinary:rclone-test-rimusag2kive/CompareDest" 2026/10/01 04:25:01 DEBUG : one: Need to transfer - File not found at Destination 2026/10/01 04:25:03 DEBUG : one: size = 3 OK 2026/10/01 04:25:03 DEBUG : one: md5 = f97c5d29941bfb1b2fdab0874906ab82 OK 2026/10/01 04:25:03 INFO : one: Copied (new) 2026/10/01 04:25:04 DEBUG : one: Need to transfer - File not found at Destination 2026/10/01 04:25:05 DEBUG : one: size = 5 OK 2026/10/01 04:25:05 DEBUG : one: md5 = 07912d142f5d63ee918b34796b5a2432 OK 2026/10/01 04:25:05 INFO : one: Copied (new) 2026/10/01 04:25:09 DEBUG : one: size = 5 (Local file system at /tmp/rclone878276083) 2026/10/01 04:25:09 DEBUG : one: size = 3 (Cloudinary root 'rclone-test-rimusag2kive/dst') 2026/10/01 04:25:09 DEBUG : one: Sizes differ 2026/10/01 04:25:11 DEBUG : one: size = 5 OK 2026/10/01 04:25:11 DEBUG : one: Sizes identical 2026/10/01 04:25:11 DEBUG : one: Destination found in --compare-dest, skipping 2026/10/01 04:25:14 DEBUG : two: Need to transfer - File not found at Destination 2026/10/01 04:25:14 DEBUG : two: size = 3 OK 2026/10/01 04:25:14 DEBUG : two: md5 = b8a9f715dbb64fd5c56e7783c6820a61 OK 2026/10/01 04:25:14 INFO : two: Copied (new) fstest.go:299: Sleeping for 1s for list eventual consistency: 1/5 fstest.go:299: Sleeping for 2s for list eventual consistency: 2/5 fstest.go:299: Sleeping for 4s for list eventual consistency: 3/5 fstest.go:299: Sleeping for 8s for list eventual consistency: 4/5 fstest.go:299: Sleeping for 16s for list eventual consistency: 5/5 fstest.go:306: Error Trace: /home/rclone/go/src/github.com/rclone/rclone/fstest/fstest.go:306 /home/rclone/go/src/github.com/rclone/rclone/fstest/fstest.go:339 /home/rclone/go/src/github.com/rclone/rclone/fstest/fstest.go:351 /home/rclone/go/src/github.com/rclone/rclone/fstest/run.go:358 /home/rclone/go/src/github.com/rclone/rclone/fs/operations/copy_test.go:282 Error: Should be true Test: TestCopyFileCompareDest Messages: listing wrong, want CompareDest/one (5), CompareDest/two (3), dst/one (3) got CompareDest/one (5), CompareDest/two (3), dst/one (3), dst/two (3) fstest.go:192: Error Trace: /home/rclone/go/src/github.com/rclone/rclone/fstest/fstest.go:192 /home/rclone/go/src/github.com/rclone/rclone/fstest/fstest.go:309 /home/rclone/go/src/github.com/rclone/rclone/fstest/fstest.go:339 /home/rclone/go/src/github.com/rclone/rclone/fstest/fstest.go:351 /home/rclone/go/src/github.com/rclone/rclone/fstest/run.go:358 /home/rclone/go/src/github.com/rclone/rclone/fs/operations/copy_test.go:282 /usr/local/go/src/runtime/asm_amd64.s:1264 Error: Should be true Test: TestCopyFileCompareDest Messages: Unexpected file "dst/two" 2026/10/01 04:25:49 DEBUG : two: size = 3 OK 2026/10/01 04:25:49 DEBUG : two: Sizes identical 2026/10/01 04:25:49 DEBUG : two: Unchanged skipping fstest.go:299: Sleeping for 1s for list eventual consistency: 1/5 fstest.go:299: Sleeping for 2s for list eventual consistency: 2/5 fstest.go:299: Sleeping for 4s for list eventual consistency: 3/5 fstest.go:299: Sleeping for 8s for list eventual consistency: 4/5 fstest.go:299: Sleeping for 16s for list eventual consistency: 5/5 fstest.go:306: Error Trace: /home/rclone/go/src/github.com/rclone/rclone/fstest/fstest.go:306 /home/rclone/go/src/github.com/rclone/rclone/fstest/fstest.go:339 /home/rclone/go/src/github.com/rclone/rclone/fstest/fstest.go:351 /home/rclone/go/src/github.com/rclone/rclone/fstest/run.go:358 /home/rclone/go/src/github.com/rclone/rclone/fs/operations/copy_test.go:288 Error: Should be true Test: TestCopyFileCompareDest Messages: listing wrong, want CompareDest/one (5), CompareDest/two (3), dst/one (3) got CompareDest/one (5), CompareDest/two (3), dst/one (3), dst/two (3) fstest.go:192: Error Trace: /home/rclone/go/src/github.com/rclone/rclone/fstest/fstest.go:192 /home/rclone/go/src/github.com/rclone/rclone/fstest/fstest.go:309 /home/rclone/go/src/github.com/rclone/rclone/fstest/fstest.go:339 /home/rclone/go/src/github.com/rclone/rclone/fstest/fstest.go:351 /home/rclone/go/src/github.com/rclone/rclone/fstest/run.go:358 /home/rclone/go/src/github.com/rclone/rclone/fs/operations/copy_test.go:288 /usr/local/go/src/runtime/asm_amd64.s:1264 Error: Should be true Test: TestCopyFileCompareDest Messages: Unexpected file "dst/two" fstest.go:299: Sleeping for 1s for list eventual consistency: 1/5 fstest.go:299: Sleeping for 2s for list eventual consistency: 2/5 fstest.go:299: Sleeping for 4s for list eventual consistency: 3/5 fstest.go:299: Sleeping for 8s for list eventual consistency: 4/5 fstest.go:299: Sleeping for 16s for list eventual consistency: 5/5 fstest.go:306: Error Trace: /home/rclone/go/src/github.com/rclone/rclone/fstest/fstest.go:306 /home/rclone/go/src/github.com/rclone/rclone/fstest/fstest.go:339 /home/rclone/go/src/github.com/rclone/rclone/fstest/fstest.go:351 /home/rclone/go/src/github.com/rclone/rclone/fstest/run.go:358 /home/rclone/go/src/github.com/rclone/rclone/fs/operations/copy_test.go:292 Error: Should be true Test: TestCopyFileCompareDest Messages: listing wrong, want CompareDest/one (5), CompareDest/two (3), dst/one (3) got CompareDest/one (5), CompareDest/two (3), dst/one (3), dst/two (3) fstest.go:192: Error Trace: /home/rclone/go/src/github.com/rclone/rclone/fstest/fstest.go:192 /home/rclone/go/src/github.com/rclone/rclone/fstest/fstest.go:309 /home/rclone/go/src/github.com/rclone/rclone/fstest/fstest.go:339 /home/rclone/go/src/github.com/rclone/rclone/fstest/fstest.go:351 /home/rclone/go/src/github.com/rclone/rclone/fstest/run.go:358 /home/rclone/go/src/github.com/rclone/rclone/fs/operations/copy_test.go:292 /usr/local/go/src/runtime/asm_amd64.s:1264 Error: Should be true Test: TestCopyFileCompareDest Messages: Unexpected file "dst/two" 2026/10/01 04:27:00 DEBUG : two: size = 5 (Local file system at /tmp/rclone878276083) 2026/10/01 04:27:00 DEBUG : two: size = 3 (Cloudinary root 'rclone-test-rimusag2kive/dst') 2026/10/01 04:27:00 DEBUG : two: Sizes differ 2026/10/01 04:27:00 DEBUG : two: size = 5 (Local file system at /tmp/rclone878276083) 2026/10/01 04:27:00 DEBUG : two: size = 3 (Cloudinary root 'rclone-test-rimusag2kive/CompareDest') 2026/10/01 04:27:00 DEBUG : two: Sizes differ 2026/10/01 04:27:01 DEBUG : two: size = 5 OK 2026/10/01 04:27:01 DEBUG : two: md5 = 2379e4ce8c3380e996ab0509f17069ad OK 2026/10/01 04:27:01 INFO : two: Copied (replaced existing) --- FAIL: TestCopyFileCompareDest (124.63s) === RUN TestCopyFileCopyDestImmutable run.go:198: Remote "Cloudinary root 'rclone-test-rimusag2kive'", Local "Local file system at /tmp/rclone878276083", Modify Window "876000h0m0s" copy_test.go:312: Skipping test as remote does not support server-side copy --- SKIP: TestCopyFileCopyDestImmutable (0.61s) === RUN TestCopyFileCopyDest run.go:198: Remote "Cloudinary root 'rclone-test-rimusag2kive'", Local "Local file system at /tmp/rclone878276083", Modify Window "876000h0m0s" copy_test.go:340: Skipping test as remote does not support server-side copy --- SKIP: TestCopyFileCopyDest (0.70s) === RUN TestCopyInplace run.go:198: Remote "Cloudinary root 'rclone-test-rimusag2kive'", Local "Local file system at /tmp/rclone878276083", Modify Window "876000h0m0s" copy_test.go:434: Partial uploads not supported --- SKIP: TestCopyInplace (0.66s) === RUN TestCopyLongFileName run.go:198: Remote "Cloudinary root 'rclone-test-rimusag2kive'", Local "Local file system at /tmp/rclone878276083", Modify Window "876000h0m0s" copy_test.go:467: Partial uploads not supported --- SKIP: TestCopyLongFileName (0.67s) === RUN TestCopyLongFileNameCollision run.go:198: Remote "Cloudinary root 'rclone-test-rimusag2kive'", Local "Local file system at /tmp/rclone878276083", Modify Window "876000h0m0s" copy_test.go:500: Partial uploads not supported --- SKIP: TestCopyLongFileNameCollision (0.74s) === RUN TestCopyFileMaxTransfer run.go:198: Remote "Cloudinary root 'rclone-test-rimusag2kive'", Local "Local file system at /tmp/rclone878276083", Modify Window "876000h0m0s" 2026/10/01 04:27:09 DEBUG : TestCopyFileMaxTransfer/file1: Need to transfer - File not found at Destination 2026/10/01 04:27:09 DEBUG : TestCopyFileMaxTransfer/file1: size = 14 OK 2026/10/01 04:27:09 DEBUG : TestCopyFileMaxTransfer/file1: md5 = 0ef726ce9b1a7692357ff70dd321d595 OK 2026/10/01 04:27:09 INFO : TestCopyFileMaxTransfer/file1: Copied (new) 2026/10/01 04:27:10 DEBUG : TestCopyFileMaxTransfer/file2: Need to transfer - File not found at Destination 2026/10/01 04:27:10 NOTICE: io: read/write on closed pipe 2026/10/01 04:27:10 ERROR : TestCopyFileMaxTransfer/file2: Failed to copy: failed to upload to Cloudinary: Post "https://api.cloudinary.com/v1_1/durakvfdu/auto/upload": max transfer limit reached as set by --max-transfer 2026/10/01 04:27:12 DEBUG : TestCopyFileMaxTransfer/file3: Need to transfer - File not found at Destination 2026/10/01 04:27:13 DEBUG : TestCopyFileMaxTransfer/file4: Need to transfer - File not found at Destination 2026/10/01 04:27:14 DEBUG : TestCopyFileMaxTransfer/file4: size = 2062 OK 2026/10/01 04:27:14 DEBUG : TestCopyFileMaxTransfer/file4: md5 = d0b9f0dfb3b49706b03bd7cfa9f5d624 OK 2026/10/01 04:27:14 INFO : TestCopyFileMaxTransfer/file4: Copied (new) --- PASS: TestCopyFileMaxTransfer (8.78s) === RUN TestDeduplicateInteractive run.go:198: Remote "Cloudinary root 'rclone-test-rimusag2kive'", Local "Local file system at /tmp/rclone878276083", Modify Window "876000h0m0s" dedupe_test.go:25: Can't test deduplicate - no duplicate files possible --- SKIP: TestDeduplicateInteractive (0.73s) === RUN TestDeduplicateSkip run.go:198: Remote "Cloudinary root 'rclone-test-rimusag2kive'", Local "Local file system at /tmp/rclone878276083", Modify Window "876000h0m0s" dedupe_test.go:25: Can't test deduplicate - no duplicate files possible --- SKIP: TestDeduplicateSkip (0.62s) === RUN TestDeduplicateSizeOnly run.go:198: Remote "Cloudinary root 'rclone-test-rimusag2kive'", Local "Local file system at /tmp/rclone878276083", Modify Window "876000h0m0s" dedupe_test.go:25: Can't test deduplicate - no duplicate files possible --- SKIP: TestDeduplicateSizeOnly (0.70s) === RUN TestDeduplicateFirst run.go:198: Remote "Cloudinary root 'rclone-test-rimusag2kive'", Local "Local file system at /tmp/rclone878276083", Modify Window "876000h0m0s" dedupe_test.go:25: Can't test deduplicate - no duplicate files possible --- SKIP: TestDeduplicateFirst (0.66s) === RUN TestDeduplicateNewest run.go:198: Remote "Cloudinary root 'rclone-test-rimusag2kive'", Local "Local file system at /tmp/rclone878276083", Modify Window "876000h0m0s" dedupe_test.go:25: Can't test deduplicate - no duplicate files possible --- SKIP: TestDeduplicateNewest (0.72s) === RUN TestDeduplicateNewestByHash run.go:198: Remote "Cloudinary root 'rclone-test-rimusag2kive'", Local "Local file system at /tmp/rclone878276083", Modify Window "876000h0m0s" dedupe_test.go:43: Can't run this test without modtimes --- SKIP: TestDeduplicateNewestByHash (0.64s) === RUN TestDeduplicateOldest run.go:198: Remote "Cloudinary root 'rclone-test-rimusag2kive'", Local "Local file system at /tmp/rclone878276083", Modify Window "876000h0m0s" dedupe_test.go:25: Can't test deduplicate - no duplicate files possible --- SKIP: TestDeduplicateOldest (0.60s) === RUN TestDeduplicateLargest run.go:198: Remote "Cloudinary root 'rclone-test-rimusag2kive'", Local "Local file system at /tmp/rclone878276083", Modify Window "876000h0m0s" dedupe_test.go:25: Can't test deduplicate - no duplicate files possible --- SKIP: TestDeduplicateLargest (0.79s) === RUN TestDeduplicateSmallest run.go:198: Remote "Cloudinary root 'rclone-test-rimusag2kive'", Local "Local file system at /tmp/rclone878276083", Modify Window "876000h0m0s" dedupe_test.go:25: Can't test deduplicate - no duplicate files possible --- SKIP: TestDeduplicateSmallest (0.66s) === RUN TestDeduplicateRename run.go:198: Remote "Cloudinary root 'rclone-test-rimusag2kive'", Local "Local file system at /tmp/rclone878276083", Modify Window "876000h0m0s" dedupe_test.go:25: Can't test deduplicate - no duplicate files possible --- SKIP: TestDeduplicateRename (0.62s) === RUN TestDeduplicateRenameManyExisting run.go:198: Remote "Cloudinary root 'rclone-test-rimusag2kive'", Local "Local file system at /tmp/rclone878276083", Modify Window "876000h0m0s" dedupe_test.go:25: Can't test deduplicate - no duplicate files possible --- SKIP: TestDeduplicateRenameManyExisting (0.64s) === RUN TestMergeDirs run.go:198: Remote "Cloudinary root 'rclone-test-rimusag2kive'", Local "Local file system at /tmp/rclone878276083", Modify Window "876000h0m0s" dedupe_test.go:294: Can't merge directories --- SKIP: TestMergeDirs (0.60s) === RUN TestIndex run.go:198: Remote "Cloudinary root 'rclone-test-rimusag2kive'", Local "Local file system at /tmp/rclone878276083", Modify Window "876000h0m0s" 2026/10/01 04:27:28 DEBUG : caddy.json: size = 259 OK 2026/10/01 04:27:28 DEBUG : caddy.json: md5 = dc6a0a75ac6ca4c5c4d67ce9cc07c967 OK 2026/10/01 04:27:28 INFO : caddy.json: Copied (new) 2026/10/01 04:27:29 DEBUG : index.json: size = 213 OK 2026/10/01 04:27:29 DEBUG : index.json: md5 = 6d9005410c2c0151ea1f793aac08f065 OK 2026/10/01 04:27:29 INFO : index.json: Copied (new) 2026/10/01 04:27:29 DEBUG : sub/deep/index.html: size = 12087 OK 2026/10/01 04:27:29 DEBUG : sub/deep/index.html: md5 = 15175b0c498f289721af34354d8e89fb OK 2026/10/01 04:27:29 INFO : sub/deep/index.html: Copied (new) 2026/10/01 04:27:29 DEBUG : index.html: size = 12147 OK 2026/10/01 04:27:29 DEBUG : index.html: md5 = 487729d18d94fdb0d658ea1c5f31c415 OK 2026/10/01 04:27:29 INFO : index.html: Copied (new) 2026/10/01 04:27:29 DEBUG : sub/deep/index.json: size = 119 OK 2026/10/01 04:27:29 DEBUG : sub/deep/index.json: md5 = 7e871c8a7baa48027dd34c724a216943 OK 2026/10/01 04:27:29 INFO : sub/deep/index.json: Copied (new) 2026/10/01 04:27:29 DEBUG : sub/index.html: size = 12306 OK 2026/10/01 04:27:29 DEBUG : sub/index.html: md5 = fca67a4486b3e873237a73c7229c1f5b OK 2026/10/01 04:27:29 INFO : sub/index.html: Copied (new) 2026/10/01 04:27:29 DEBUG : sub/deep/caddy.json: size = 131 OK 2026/10/01 04:27:29 DEBUG : sub/deep/caddy.json: md5 = d85deaaa7d227b303a0247bb5c1690a8 OK 2026/10/01 04:27:29 INFO : sub/deep/caddy.json: Copied (new) 2026/10/01 04:27:29 DEBUG : sub/index.json: size = 215 OK 2026/10/01 04:27:29 DEBUG : sub/index.json: md5 = a2268aa29c5a00e765e4612e571decea OK 2026/10/01 04:27:29 INFO : sub/index.json: Copied (new) 2026/10/01 04:27:30 DEBUG : sub/caddy.json: size = 261 OK 2026/10/01 04:27:30 DEBUG : sub/caddy.json: md5 = 75c950ebaddffd546d2416be7d12398e OK 2026/10/01 04:27:30 INFO : sub/caddy.json: Copied (new) 2026/10/01 04:27:34 DEBUG : index.html: Dst hash empty - aborting Src hash check 2026/10/01 04:27:34 DEBUG : sub/deep/index.html: Dst hash empty - aborting Src hash check 2026/10/01 04:27:34 DEBUG : sub/index.html: Dst hash empty - aborting Src hash check 2026/10/01 04:27:34 DEBUG : index.html: Unchanged skipping 2026/10/01 04:27:34 DEBUG : index.json: Dst hash empty - aborting Src hash check 2026/10/01 04:27:34 DEBUG : sub/index.html: Unchanged skipping 2026/10/01 04:27:34 DEBUG : sub/index.json: Dst hash empty - aborting Src hash check 2026/10/01 04:27:34 DEBUG : index.json: Unchanged skipping 2026/10/01 04:27:34 DEBUG : caddy.json: Dst hash empty - aborting Src hash check 2026/10/01 04:27:34 DEBUG : caddy.json: Unchanged skipping 2026/10/01 04:27:34 DEBUG : sub/deep/index.html: Unchanged skipping 2026/10/01 04:27:34 DEBUG : sub/deep/index.json: Dst hash empty - aborting Src hash check 2026/10/01 04:27:34 DEBUG : sub/index.json: Unchanged skipping 2026/10/01 04:27:34 DEBUG : sub/caddy.json: Dst hash empty - aborting Src hash check 2026/10/01 04:27:35 DEBUG : sub/deep/index.json: Unchanged skipping 2026/10/01 04:27:35 DEBUG : sub/deep/caddy.json: Dst hash empty - aborting Src hash check 2026/10/01 04:27:35 DEBUG : sub/caddy.json: Unchanged skipping 2026/10/01 04:27:35 DEBUG : sub/deep/caddy.json: Unchanged skipping 2026/10/01 04:27:36 DEBUG : caddy.json: size = 259 OK 2026/10/01 04:27:36 DEBUG : caddy.json: md5 = dc6a0a75ac6ca4c5c4d67ce9cc07c967 OK 2026/10/01 04:27:36 INFO : caddy.json: Copied (replaced existing) 2026/10/01 04:27:36 DEBUG : index.json: size = 213 OK 2026/10/01 04:27:36 DEBUG : index.json: md5 = 6d9005410c2c0151ea1f793aac08f065 OK 2026/10/01 04:27:36 INFO : index.json: Copied (replaced existing) 2026/10/01 04:27:36 DEBUG : index.html: size = 12147 OK 2026/10/01 04:27:36 DEBUG : index.html: md5 = 487729d18d94fdb0d658ea1c5f31c415 OK 2026/10/01 04:27:36 INFO : index.html: Copied (replaced existing) 2026/10/01 04:27:37 DEBUG : sub/deep/index.html: size = 12087 OK 2026/10/01 04:27:37 DEBUG : sub/deep/index.html: md5 = 15175b0c498f289721af34354d8e89fb OK 2026/10/01 04:27:37 INFO : sub/deep/index.html: Copied (replaced existing) 2026/10/01 04:27:37 DEBUG : sub/deep/index.json: size = 119 OK 2026/10/01 04:27:37 DEBUG : sub/deep/index.json: md5 = 7e871c8a7baa48027dd34c724a216943 OK 2026/10/01 04:27:37 INFO : sub/deep/index.json: Copied (replaced existing) 2026/10/01 04:27:37 DEBUG : sub/index.html: size = 12306 OK 2026/10/01 04:27:37 DEBUG : sub/index.html: md5 = fca67a4486b3e873237a73c7229c1f5b OK 2026/10/01 04:27:37 INFO : sub/index.html: Copied (replaced existing) 2026/10/01 04:27:37 DEBUG : sub/deep/caddy.json: size = 131 OK 2026/10/01 04:27:37 DEBUG : sub/deep/caddy.json: md5 = d85deaaa7d227b303a0247bb5c1690a8 OK 2026/10/01 04:27:37 INFO : sub/deep/caddy.json: Copied (replaced existing) 2026/10/01 04:27:37 DEBUG : sub/index.json: size = 215 OK 2026/10/01 04:27:37 DEBUG : sub/index.json: md5 = a2268aa29c5a00e765e4612e571decea OK 2026/10/01 04:27:37 INFO : sub/index.json: Copied (replaced existing) 2026/10/01 04:27:37 DEBUG : sub/caddy.json: size = 261 OK 2026/10/01 04:27:37 DEBUG : sub/caddy.json: md5 = 75c950ebaddffd546d2416be7d12398e OK 2026/10/01 04:27:37 INFO : sub/caddy.json: Copied (replaced existing) 2026/10/01 04:27:39 DEBUG : index.html: Dst hash empty - aborting Src hash check 2026/10/01 04:27:39 DEBUG : sub/index.html: Dst hash empty - aborting Src hash check 2026/10/01 04:27:39 DEBUG : index.html: Unchanged skipping 2026/10/01 04:27:39 DEBUG : index.json: Dst hash empty - aborting Src hash check 2026/10/01 04:27:39 DEBUG : sub/index.html: Unchanged skipping 2026/10/01 04:27:39 DEBUG : sub/index.json: Dst hash empty - aborting Src hash check 2026/10/01 04:27:39 DEBUG : index.json: Unchanged skipping 2026/10/01 04:27:39 DEBUG : caddy.json: Dst hash empty - aborting Src hash check 2026/10/01 04:27:39 DEBUG : sub/index.json: Unchanged skipping 2026/10/01 04:27:39 DEBUG : sub/caddy.json: Dst hash empty - aborting Src hash check 2026/10/01 04:27:39 DEBUG : caddy.json: Unchanged skipping 2026/10/01 04:27:39 DEBUG : sub/caddy.json: Unchanged skipping 2026/10/01 04:27:40 DEBUG : sub/deep/caddy.json: size = 260 OK 2026/10/01 04:27:40 DEBUG : sub/deep/caddy.json: md5 = 7d40922480f85532b0215606cd889177 OK 2026/10/01 04:27:40 INFO : sub/deep/caddy.json: Copied (replaced existing) 2026/10/01 04:27:40 DEBUG : sub/deep/index.html: size = 12346 OK 2026/10/01 04:27:40 DEBUG : sub/deep/index.html: md5 = 307acb292face49495080b1f65c2affb OK 2026/10/01 04:27:40 INFO : sub/deep/index.html: Copied (replaced existing) 2026/10/01 04:27:40 DEBUG : sub/deep/index.json: size = 235 OK 2026/10/01 04:27:40 DEBUG : sub/deep/index.json: md5 = d06cbda009ac7901132a43ebb95c8e8b OK 2026/10/01 04:27:40 INFO : sub/deep/index.json: Copied (replaced existing) index_test.go:156: Error Trace: /home/rclone/go/src/github.com/rclone/rclone/fs/operations/index_test.go:156 Error: "\n\n\n\n\t\n\t\t/sub/deep\n\t\t\n\t\t\n\t\t\n\n\t\n\t\n\t\t\n\t\t\t\n\t\t\t\t\n\t\t\t\t\n\t\t\t\t\n\t\t\t\t\n\t\t\t\n\t\t\n\t\t
\n\t\t\t
Folder path
\n\t\t\t

/sub/deep/\n\t\t\t

\n\t\t
\n\t\t
\n\t\t\t
\n\t\t\t\t
\n\t\t\t\t\t\n\t\t\t\t\t\n\t\t\t\t\t6 total\n\t\t\t\t
\n\t\t\t\t
\n\t\t\t\t\t\n\t\t\t\t\t\t\n\t\t\t\t\t\t\t\n\t\t\t\t\t\t\t\t\n\t\t\t\t\t\t\t\t\n\t\t\t\t\t\t\t\t\n\t\t\t\t\t\t\t\n\t\t\t\t\t\t\n\t\t\t\t\t\t\n\t\t\t\t\t\t\t\n\t\t\t\t\t\t\t\n\t\t\t\t\t\t\t\t\n\t\t\t\t\t\t\t\t\n\t\t\t\t\t\t\t\t\n\t\t\t\t\t\t\t\n\t\t\t\t\t\t\t\n\t\t\t\t\t\t\n\t\t\t\t\t
\n\t\t\t\t\t\t\t\t\tName\n\t\t\t\t\t\t\t\t\t\n\t\t\t\t\t\t\t\tSizeModified
Go up——
file3.txt\n\t\t\t\t\t\t\t\t6—
\n\t\t\t\t
\n\t\t\t
\n\t\t
\n\t\t\n\t\n\n" does not contain "file4.txt" Test: TestIndex 2026/10/01 04:27:42 DEBUG : index.html: Dst hash empty - aborting Src hash check 2026/10/01 04:27:42 DEBUG : sub/index.html: Dst hash empty - aborting Src hash check 2026/10/01 04:27:42 NOTICE: sub/deep/index.html: Skipped copy as --dry-run is set (size 12.309Ki) 2026/10/01 04:27:42 NOTICE: sub/deep/index.json: Skipped copy as --dry-run is set (size 351) 2026/10/01 04:27:42 NOTICE: sub/deep/caddy.json: Skipped copy as --dry-run is set (size 389) 2026/10/01 04:27:42 DEBUG : index.html: Unchanged skipping 2026/10/01 04:27:42 DEBUG : index.json: Dst hash empty - aborting Src hash check 2026/10/01 04:27:42 DEBUG : sub/index.html: Unchanged skipping 2026/10/01 04:27:42 DEBUG : sub/index.json: Dst hash empty - aborting Src hash check 2026/10/01 04:27:42 DEBUG : index.json: Unchanged skipping 2026/10/01 04:27:42 DEBUG : caddy.json: Dst hash empty - aborting Src hash check 2026/10/01 04:27:42 DEBUG : sub/index.json: Unchanged skipping 2026/10/01 04:27:42 DEBUG : sub/caddy.json: Dst hash empty - aborting Src hash check 2026/10/01 04:27:42 DEBUG : caddy.json: Unchanged skipping 2026/10/01 04:27:42 DEBUG : sub/caddy.json: Unchanged skipping --- FAIL: TestIndex (24.90s) === RUN TestIndexDelete run.go:198: Remote "Cloudinary root 'rclone-test-rimusag2kive'", Local "Local file system at /tmp/rclone878276083", Modify Window "876000h0m0s" 2026/10/01 04:27:55 DEBUG : sub/index.html: size = 12306 OK 2026/10/01 04:27:55 DEBUG : sub/index.html: md5 = fca67a4486b3e873237a73c7229c1f5b OK 2026/10/01 04:27:55 INFO : sub/index.html: Copied (new) 2026/10/01 04:27:55 DEBUG : sub/deep/index.html: size = 12087 OK 2026/10/01 04:27:55 DEBUG : sub/deep/index.html: md5 = 15175b0c498f289721af34354d8e89fb OK 2026/10/01 04:27:55 INFO : sub/deep/index.html: Copied (new) 2026/10/01 04:27:55 DEBUG : index.html: size = 12147 OK 2026/10/01 04:27:55 DEBUG : index.html: md5 = 487729d18d94fdb0d658ea1c5f31c415 OK 2026/10/01 04:27:55 INFO : index.html: Copied (new) 2026/10/01 04:27:57 DEBUG : index.html: Dst hash empty - aborting Src hash check 2026/10/01 04:27:57 DEBUG : sub/index.html: Dst hash empty - aborting Src hash check 2026/10/01 04:27:57 DEBUG : index.html: Unchanged skipping 2026/10/01 04:27:57 DEBUG : sub/index.html: Unchanged skipping 2026/10/01 04:27:57 DEBUG : sub/deep/index.html: size = 11829 OK 2026/10/01 04:27:57 DEBUG : sub/deep/index.html: md5 = d6b54f56fe3c56d0e46dc7cef27afea2 OK 2026/10/01 04:27:57 INFO : sub/deep/index.html: Copied (replaced existing) --- PASS: TestIndexDelete (12.83s) === RUN TestIndexFilter run.go:198: Remote "Cloudinary root 'rclone-test-rimusag2kive'", Local "Local file system at /tmp/rclone878276083", Modify Window "876000h0m0s" 2026/10/01 04:28:07 DEBUG : other/notes.md: Excluded (Path Filter) 2026/10/01 04:28:07 DEBUG : index.html: size = 12399 OK 2026/10/01 04:28:07 DEBUG : index.html: md5 = a97c873e1964b4e2c5ae1b8219db600d OK 2026/10/01 04:28:07 INFO : index.html: Copied (new) 2026/10/01 04:28:07 DEBUG : other/index.html: size = 11802 OK 2026/10/01 04:28:07 DEBUG : other/index.html: md5 = 1fbd534a06e1d3387ab22be5de393e5f OK 2026/10/01 04:28:07 INFO : other/index.html: Copied (new) 2026/10/01 04:28:07 DEBUG : sub/index.html: size = 12056 OK 2026/10/01 04:28:07 DEBUG : sub/index.html: md5 = f9ee9218c597a152aacbc7fa84b26e05 OK 2026/10/01 04:28:07 INFO : sub/index.html: Copied (new) 2026/10/01 04:28:12 DEBUG : other/notes.md: Excluded (Path Filter) 2026/10/01 04:28:12 DEBUG : sub/index.html: Dst hash empty - aborting Src hash check 2026/10/01 04:28:12 DEBUG : index.html: Dst hash empty - aborting Src hash check 2026/10/01 04:28:12 DEBUG : other/index.html: Dst hash empty - aborting Src hash check 2026/10/01 04:28:12 DEBUG : sub/index.html: Unchanged skipping 2026/10/01 04:28:12 DEBUG : index.html: Unchanged skipping 2026/10/01 04:28:12 DEBUG : other/index.html: Unchanged skipping --- PASS: TestIndexFilter (14.95s) === RUN TestIndexRules run.go:198: Remote "Cloudinary root 'rclone-test-rimusag2kive'", Local "Local file system at /tmp/rclone878276083", Modify Window "876000h0m0s" 2026/10/01 04:28:22 DEBUG : index.html: size = 12147 OK 2026/10/01 04:28:22 DEBUG : index.html: md5 = 487729d18d94fdb0d658ea1c5f31c415 OK 2026/10/01 04:28:22 INFO : index.html: Copied (new) 2026/10/01 04:28:22 DEBUG : sub/index.html: size = 12306 OK 2026/10/01 04:28:22 DEBUG : sub/index.html: md5 = fca67a4486b3e873237a73c7229c1f5b OK 2026/10/01 04:28:22 INFO : sub/index.html: Copied (new) 2026/10/01 04:28:26 DEBUG : sub/index.html: Dst hash empty - aborting Src hash check 2026/10/01 04:28:27 DEBUG : sub/index.html: Unchanged skipping 2026/10/01 04:28:27 DEBUG : sub/deep/index.html: size = 12087 OK 2026/10/01 04:28:27 DEBUG : sub/deep/index.html: md5 = 15175b0c498f289721af34354d8e89fb OK 2026/10/01 04:28:27 INFO : sub/deep/index.html: Copied (replaced existing) --- PASS: TestIndexRules (14.39s) === RUN TestIndexMaxDepth run.go:198: Remote "Cloudinary root 'rclone-test-rimusag2kive'", Local "Local file system at /tmp/rclone878276083", Modify Window "876000h0m0s" 2026/10/01 04:28:36 DEBUG : index.html: size = 12147 OK 2026/10/01 04:28:36 DEBUG : index.html: md5 = 487729d18d94fdb0d658ea1c5f31c415 OK 2026/10/01 04:28:36 INFO : index.html: Copied (new) index_test.go:62: Error Trace: /home/rclone/go/src/github.com/rclone/rclone/fs/operations/index_test.go:62 /home/rclone/go/src/github.com/rclone/rclone/fs/operations/index_test.go:259 Error: Received unexpected error: object not found Test: TestIndexMaxDepth Messages: index.html --- FAIL: TestIndexMaxDepth (8.45s) === RUN TestIndexLinkIndex run.go:198: Remote "Cloudinary root 'rclone-test-rimusag2kive'", Local "Local file system at /tmp/rclone878276083", Modify Window "876000h0m0s" 2026/10/01 04:28:44 DEBUG : sub/deep/index.html: size = 12128 OK 2026/10/01 04:28:44 DEBUG : sub/deep/index.html: md5 = 835fd19115916d1c0be8c5feb411b389 OK 2026/10/01 04:28:44 INFO : sub/deep/index.html: Copied (new) 2026/10/01 04:28:44 DEBUG : sub/index.html: size = 12347 OK 2026/10/01 04:28:44 DEBUG : sub/index.html: md5 = 7c86401558b8ba2e798cb73575d8e402 OK 2026/10/01 04:28:44 INFO : sub/index.html: Copied (new) 2026/10/01 04:28:44 DEBUG : index.html: size = 12167 OK 2026/10/01 04:28:44 DEBUG : index.html: md5 = 0dc983848568e8d632601750689042ab OK 2026/10/01 04:28:44 INFO : index.html: Copied (new) index_test.go:62: Error Trace: /home/rclone/go/src/github.com/rclone/rclone/fs/operations/index_test.go:62 /home/rclone/go/src/github.com/rclone/rclone/fs/operations/index_test.go:266 Error: Received unexpected error: object not found Test: TestIndexLinkIndex Messages: index.html --- FAIL: TestIndexLinkIndex (7.77s) === RUN TestIndexDirTime run.go:198: Remote "Cloudinary root 'rclone-test-rimusag2kive'", Local "Local file system at /tmp/rclone878276083", Modify Window "876000h0m0s" 2026/10/01 04:28:52 DEBUG : sub/index.json: size = 255 OK 2026/10/01 04:28:52 DEBUG : sub/index.json: md5 = 5b11af831b136b4a15af9fd1d9632b9f OK 2026/10/01 04:28:52 INFO : sub/index.json: Copied (new) 2026/10/01 04:28:52 DEBUG : index.json: size = 253 OK 2026/10/01 04:28:52 DEBUG : index.json: md5 = eab2c54a82a634653160bf62e6063284 OK 2026/10/01 04:28:52 INFO : index.json: Copied (new) 2026/10/01 04:28:52 DEBUG : sub/deep/index.json: size = 139 OK 2026/10/01 04:28:52 DEBUG : sub/deep/index.json: md5 = 4150804b1909bf62ea0fd845b7f49b08 OK 2026/10/01 04:28:52 INFO : sub/deep/index.json: Copied (new) index_test.go:62: Error Trace: /home/rclone/go/src/github.com/rclone/rclone/fs/operations/index_test.go:62 /home/rclone/go/src/github.com/rclone/rclone/fs/operations/index_test.go:278 /home/rclone/go/src/github.com/rclone/rclone/fs/operations/index_test.go:300 Error: Received unexpected error: object not found Test: TestIndexDirTime Messages: index.json --- FAIL: TestIndexDirTime (7.41s) === RUN TestIndexTemplate run.go:198: Remote "Cloudinary root 'rclone-test-rimusag2kive'", Local "Local file system at /tmp/rclone878276083", Modify Window "876000h0m0s" 2026/10/01 04:28:59 DEBUG : sub/deep/list.txt: size = 47 OK 2026/10/01 04:28:59 DEBUG : sub/deep/list.txt: md5 = dc1cc2d7ce7f5592c21ea35204e8c55f OK 2026/10/01 04:28:59 INFO : sub/deep/list.txt: Copied (new) 2026/10/01 04:28:59 DEBUG : sub/list.txt: size = 64 OK 2026/10/01 04:28:59 DEBUG : sub/list.txt: md5 = 392b31a0b76dfeac344bfc90519f71cf OK 2026/10/01 04:28:59 INFO : sub/list.txt: Copied (new) 2026/10/01 04:28:59 DEBUG : list.txt: size = 59 OK 2026/10/01 04:28:59 DEBUG : list.txt: md5 = 7be1c5ff53c6c4db1785ba69f82a3a65 OK 2026/10/01 04:28:59 INFO : list.txt: Copied (new) index_test.go:62: Error Trace: /home/rclone/go/src/github.com/rclone/rclone/fs/operations/index_test.go:62 /home/rclone/go/src/github.com/rclone/rclone/fs/operations/index_test.go:327 Error: Received unexpected error: object not found Test: TestIndexTemplate Messages: sub/list.txt --- FAIL: TestIndexTemplate (7.37s) === RUN TestIndexTemplateBuiltin --- PASS: TestIndexTemplateBuiltin (0.00s) === RUN TestRcIndex rc_test.go:31: Skipping test on non local remote --- SKIP: TestRcIndex (0.00s) === RUN TestIndexNoHash index_test.go:371: Skipping test on non local remote --- SKIP: TestIndexNoHash (0.00s) === RUN TestIndexChanged run.go:198: Remote "Cloudinary root 'rclone-test-rimusag2kive'", Local "Local file system at /tmp/rclone878276083", Modify Window "876000h0m0s" 2026/10/01 04:29:08 DEBUG : index.html: size = 12399 OK 2026/10/01 04:29:08 DEBUG : index.html: md5 = a97c873e1964b4e2c5ae1b8219db600d OK 2026/10/01 04:29:08 INFO : index.html: Copied (new) 2026/10/01 04:29:08 DEBUG : sub/index.html: size = 12306 OK 2026/10/01 04:29:08 DEBUG : sub/index.html: md5 = fca67a4486b3e873237a73c7229c1f5b OK 2026/10/01 04:29:08 INFO : sub/index.html: Copied (new) 2026/10/01 04:29:08 DEBUG : sub/deep/index.html: size = 12087 OK 2026/10/01 04:29:08 DEBUG : sub/deep/index.html: md5 = 15175b0c498f289721af34354d8e89fb OK 2026/10/01 04:29:08 INFO : sub/deep/index.html: Copied (new) 2026/10/01 04:29:08 DEBUG : other/index.html: size = 12058 OK 2026/10/01 04:29:08 DEBUG : other/index.html: md5 = ae72a1a861b70e96a2e3cb87f571320c OK 2026/10/01 04:29:08 INFO : other/index.html: Copied (new) 2026/10/01 04:29:09 INFO : Cloudinary root 'rclone-test-rimusag2kive': Partial index: listing 3 directories and walking 0 changed directories 2026/10/01 04:29:10 DEBUG : index.html: Dst hash empty - aborting Src hash check 2026/10/01 04:29:10 DEBUG : sub/index.html: Dst hash empty - aborting Src hash check 2026/10/01 04:29:11 DEBUG : index.html: Unchanged skipping 2026/10/01 04:29:11 DEBUG : sub/index.html: Unchanged skipping 2026/10/01 04:29:11 DEBUG : sub/deep/index.html: size = 12346 OK 2026/10/01 04:29:11 DEBUG : sub/deep/index.html: md5 = 307acb292face49495080b1f65c2affb OK 2026/10/01 04:29:11 INFO : sub/deep/index.html: Copied (replaced existing) 2026/10/01 04:29:12 INFO : Cloudinary root 'rclone-test-rimusag2kive': Partial index: listing 3 directories and walking 0 changed directories 2026/10/01 04:29:13 DEBUG : index.html: Dst hash empty - aborting Src hash check 2026/10/01 04:29:14 DEBUG : index.html: Unchanged skipping 2026/10/01 04:29:14 DEBUG : sub/new/index.html: size = 12085 OK 2026/10/01 04:29:14 DEBUG : sub/new/index.html: md5 = fd1fdd6a1ea72319d9c7a09a8f907cb7 OK 2026/10/01 04:29:14 INFO : sub/new/index.html: Copied (new) 2026/10/01 04:29:14 DEBUG : sub/index.html: size = 12554 OK 2026/10/01 04:29:14 DEBUG : sub/index.html: md5 = 4212c11ce7fd28cd22d8d62f1b11cc4d OK 2026/10/01 04:29:14 INFO : sub/index.html: Copied (replaced existing) index_test.go:411: Error Trace: /home/rclone/go/src/github.com/rclone/rclone/fs/operations/index_test.go:411 Error: "\n\n\n\n\t\n\t\t/sub\n\t\t\n\t\t\n\t\t\n\n\t\n\t\n\t\t\n\t\t\t\n\t\t\t\t\n\t\t\t\t\n\t\t\t\t\n\t\t\t\t\n\t\t\t\n\t\t\n\t\t
\n\t\t\t
Folder path
\n\t\t\t

/sub/\n\t\t\t

\n\t\t
\n\t\t
\n\t\t\t
\n\t\t\t\t
\n\t\t\t\t\t\n\t\t\t\t\t\n\t\t\t\t\t6 total\n\t\t\t\t
\n\t\t\t\t
\n\t\t\t\t\t\n\t\t\t\t\t\t\n\t\t\t\t\t\t\t\n\t\t\t\t\t\t\t\t\n\t\t\t\t\t\t\t\t\n\t\t\t\t\t\t\t\t\n\t\t\t\t\t\t\t\n\t\t\t\t\t\t\n\t\t\t\t\t\t\n\t\t\t\t\t\t\t\n\t\t\t\t\t\t\t\n\t\t\t\t\t\t\t\t\n\t\t\t\t\t\t\t\t\n\t\t\t\t\t\t\t\t\n\t\t\t\t\t\t\t\n\t\t\t\t\t\t\t\n\t\t\t\t\t\t\t\t\n\t\t\t\t\t\t\t\t\n\t\t\t\t\t\t\t\t\n\t\t\t\t\t\t\t\n\t\t\t\t\t\t\t\n\t\t\t\t\t\t\n\t\t\t\t\t
\n\t\t\t\t\t\t\t\t\tName\n\t\t\t\t\t\t\t\t\t\n\t\t\t\t\t\t\t\tSizeModified
Go up——
deep/\n\t\t\t\t\t\t\t\t——
file2.txt\n\t\t\t\t\t\t\t\t6—
\n\t\t\t\t
\n\t\t\t
\n\t\t
\n\t\t\n\t\n\n" does not contain "new/" Test: TestIndexChanged index_test.go:62: Error Trace: /home/rclone/go/src/github.com/rclone/rclone/fs/operations/index_test.go:62 /home/rclone/go/src/github.com/rclone/rclone/fs/operations/index_test.go:412 Error: Received unexpected error: object not found Test: TestIndexChanged Messages: sub/new/index.html --- FAIL: TestIndexChanged (18.96s) === RUN TestIndexChangedDelete run.go:198: Remote "Cloudinary root 'rclone-test-rimusag2kive'", Local "Local file system at /tmp/rclone878276083", Modify Window "876000h0m0s" 2026/10/01 04:29:25 DEBUG : sub/index.html: size = 12306 OK 2026/10/01 04:29:25 DEBUG : sub/index.html: md5 = fca67a4486b3e873237a73c7229c1f5b OK 2026/10/01 04:29:25 INFO : sub/index.html: Copied (new) 2026/10/01 04:29:25 DEBUG : sub/deep/index.html: size = 12087 OK 2026/10/01 04:29:25 DEBUG : sub/deep/index.html: md5 = 15175b0c498f289721af34354d8e89fb OK 2026/10/01 04:29:25 INFO : sub/deep/index.html: Copied (new) 2026/10/01 04:29:25 DEBUG : index.html: size = 12147 OK 2026/10/01 04:29:25 DEBUG : index.html: md5 = 487729d18d94fdb0d658ea1c5f31c415 OK 2026/10/01 04:29:25 INFO : index.html: Copied (new) 2026/10/01 04:29:26 INFO : Cloudinary root 'rclone-test-rimusag2kive': Partial index: listing 3 directories and walking 0 changed directories 2026/10/01 04:29:27 DEBUG : index.html: Dst hash empty - aborting Src hash check 2026/10/01 04:29:27 DEBUG : sub/index.html: Dst hash empty - aborting Src hash check 2026/10/01 04:29:27 DEBUG : index.html: Unchanged skipping 2026/10/01 04:29:27 DEBUG : sub/index.html: Unchanged skipping 2026/10/01 04:29:28 DEBUG : sub/deep/index.html: size = 11829 OK 2026/10/01 04:29:28 DEBUG : sub/deep/index.html: md5 = d6b54f56fe3c56d0e46dc7cef27afea2 OK 2026/10/01 04:29:28 INFO : sub/deep/index.html: Copied (replaced existing) --- PASS: TestIndexChangedDelete (9.35s) === RUN TestIndexChangedFiles run.go:198: Remote "Cloudinary root 'rclone-test-rimusag2kive'", Local "Local file system at /tmp/rclone878276083", Modify Window "876000h0m0s" 2026/10/01 04:29:35 DEBUG : sub/index.html: size = 12306 OK 2026/10/01 04:29:35 DEBUG : sub/index.html: md5 = fca67a4486b3e873237a73c7229c1f5b OK 2026/10/01 04:29:35 INFO : sub/index.html: Copied (new) 2026/10/01 04:29:35 DEBUG : sub/deep/index.html: size = 12087 OK 2026/10/01 04:29:35 DEBUG : sub/deep/index.html: md5 = 15175b0c498f289721af34354d8e89fb OK 2026/10/01 04:29:35 INFO : sub/deep/index.html: Copied (new) 2026/10/01 04:29:35 DEBUG : - odd/index.html: size = 12058 OK 2026/10/01 04:29:35 DEBUG : - odd/index.html: md5 = dfa9d4e0f1ef10534a0a1b80f02b69bd OK 2026/10/01 04:29:35 INFO : - odd/index.html: Copied (new) 2026/10/01 04:29:35 DEBUG : index.html: size = 12401 OK 2026/10/01 04:29:35 DEBUG : index.html: md5 = 080b36d70c765d0eca1fcc3033c03d3f OK 2026/10/01 04:29:35 INFO : index.html: Copied (new) 2026/10/01 04:29:36 INFO : Cloudinary root 'rclone-test-rimusag2kive': Partial index: listing 2 directories and walking 0 changed directories 2026/10/01 04:29:37 DEBUG : index.html: Dst hash empty - aborting Src hash check 2026/10/01 04:29:37 DEBUG : index.html: Unchanged skipping 2026/10/01 04:29:38 DEBUG : - odd/index.html: size = 12316 OK 2026/10/01 04:29:38 DEBUG : - odd/index.html: md5 = e94ff77d6cbf7555e8b4fc1012417c1c OK 2026/10/01 04:29:38 INFO : - odd/index.html: Copied (replaced existing) 2026/10/01 04:29:38 INFO : Cloudinary root 'rclone-test-rimusag2kive': Partial index: listing 4 directories and walking 0 changed directories 2026/10/01 04:29:42 DEBUG : index.html: Dst hash empty - aborting Src hash check 2026/10/01 04:29:42 DEBUG : - odd/index.html: Dst hash empty - aborting Src hash check 2026/10/01 04:29:42 DEBUG : sub/deep/index.html: Dst hash empty - aborting Src hash check 2026/10/01 04:29:42 DEBUG : index.html: Unchanged skipping 2026/10/01 04:29:42 DEBUG : - odd/index.html: Unchanged skipping 2026/10/01 04:29:42 DEBUG : sub/deep/index.html: Unchanged skipping 2026/10/01 04:29:43 DEBUG : sub/index.html: size = 12565 OK 2026/10/01 04:29:43 DEBUG : sub/index.html: md5 = 4c5bc8b58e202e88635dc36022db2123 OK 2026/10/01 04:29:43 INFO : sub/index.html: Copied (replaced existing) index_test.go:519: Error Trace: /home/rclone/go/src/github.com/rclone/rclone/fs/operations/index_test.go:519 Error: "\n\n\n\n\t\n\t\t/sub\n\t\t\n\t\t\n\t\t\n\n\t\n\t\n\t\t\n\t\t\t\n\t\t\t\t\n\t\t\t\t\n\t\t\t\t\n\t\t\t\t\n\t\t\t\n\t\t\n\t\t
\n\t\t\t
Folder path
\n\t\t\t

/sub/\n\t\t\t

\n\t\t
\n\t\t
\n\t\t\t
\n\t\t\t\t
\n\t\t\t\t\t\n\t\t\t\t\t\n\t\t\t\t\t6 total\n\t\t\t\t
\n\t\t\t\t
\n\t\t\t\t\t\n\t\t\t\t\t\t\n\t\t\t\t\t\t\t\n\t\t\t\t\t\t\t\t\n\t\t\t\t\t\t\t\t\n\t\t\t\t\t\t\t\t\n\t\t\t\t\t\t\t\n\t\t\t\t\t\t\n\t\t\t\t\t\t\n\t\t\t\t\t\t\t\n\t\t\t\t\t\t\t\n\t\t\t\t\t\t\t\t\n\t\t\t\t\t\t\t\t\n\t\t\t\t\t\t\t\t\n\t\t\t\t\t\t\t\n\t\t\t\t\t\t\t\n\t\t\t\t\t\t\t\t\n\t\t\t\t\t\t\t\t\n\t\t\t\t\t\t\t\t\n\t\t\t\t\t\t\t\n\t\t\t\t\t\t\t\n\t\t\t\t\t\t\n\t\t\t\t\t
\n\t\t\t\t\t\t\t\t\tName\n\t\t\t\t\t\t\t\t\t\n\t\t\t\t\t\t\t\tSizeModified
Go up——
deep/\n\t\t\t\t\t\t\t\t——
file2.txt\n\t\t\t\t\t\t\t\t6—
\n\t\t\t\t
\n\t\t\t
\n\t\t
\n\t\t\n\t\n\n" does not contain "file9.txt" Test: TestIndexChangedFiles --- FAIL: TestIndexChangedFiles (17.69s) === RUN TestIndexChangedDirTime run.go:198: Remote "Cloudinary root 'rclone-test-rimusag2kive'", Local "Local file system at /tmp/rclone878276083", Modify Window "876000h0m0s" 2026/10/01 04:29:53 DEBUG : index.json: size = 371 OK 2026/10/01 04:29:53 DEBUG : index.json: md5 = 80c8576d56cf9c71655d2831278b14e8 OK 2026/10/01 04:29:53 INFO : index.json: Copied (new) 2026/10/01 04:29:53 DEBUG : other/index.json: size = 140 OK 2026/10/01 04:29:53 DEBUG : other/index.json: md5 = cb2f92e760a8f9a174b2899d65b82b29 OK 2026/10/01 04:29:53 INFO : other/index.json: Copied (new) 2026/10/01 04:29:53 DEBUG : sub/deep/index.json: size = 139 OK 2026/10/01 04:29:53 DEBUG : sub/deep/index.json: md5 = 387520bde7c5f530a1ce4b5f0586df4b OK 2026/10/01 04:29:53 INFO : sub/deep/index.json: Copied (new) 2026/10/01 04:29:53 DEBUG : sub/index.json: size = 255 OK 2026/10/01 04:29:53 DEBUG : sub/index.json: md5 = 8d8295a08ca25ec8eb5f1d513ecdeb31 OK 2026/10/01 04:29:53 INFO : sub/index.json: Copied (new) 2026/10/01 04:29:54 INFO : Cloudinary root 'rclone-test-rimusag2kive': Partial index: listing 3 directories and walking 0 changed directories 2026/10/01 04:29:55 DEBUG : index.json: Dst hash empty - aborting Src hash check 2026/10/01 04:29:55 DEBUG : sub/index.json: Dst hash empty - aborting Src hash check 2026/10/01 04:29:56 DEBUG : index.json: size = 371 OK 2026/10/01 04:29:56 DEBUG : index.json: md5 = 04237410817a57b64680516849df27f1 OK 2026/10/01 04:29:56 INFO : index.json: Copied (replaced existing) 2026/10/01 04:29:56 DEBUG : sub/index.json: size = 255 OK 2026/10/01 04:29:56 DEBUG : sub/index.json: md5 = 65d125e8509ab6500fa9b5194fe92620 OK 2026/10/01 04:29:56 INFO : sub/index.json: Copied (replaced existing) 2026/10/01 04:29:56 DEBUG : sub/deep/index.json: size = 275 OK 2026/10/01 04:29:56 DEBUG : sub/deep/index.json: md5 = b5b7a1c9aaa2bd35027d9db1b6b8dd9d OK 2026/10/01 04:29:56 INFO : sub/deep/index.json: Copied (replaced existing) --- PASS: TestIndexChangedDirTime (12.71s) === RUN TestListDirSorted run.go:198: Remote "Cloudinary root 'rclone-test-rimusag2kive'", Local "Local file system at /tmp/rclone878276083", Modify Window "876000h0m0s" 2026/10/01 04:30:09 DEBUG : a.txt: Excluded (Size Filter) 2026/10/01 04:30:09 DEBUG : a.txt: Excluded 2026/10/01 04:30:10 DEBUG : sub dir/hello world2: Excluded (Size Filter) 2026/10/01 04:30:10 DEBUG : sub dir/hello world2: Excluded 2026/10/01 04:30:10 DEBUG : sub dir/hello world: Excluded (Size Filter) 2026/10/01 04:30:10 DEBUG : sub dir/hello world: Excluded 2026/10/01 04:30:11 DEBUG : sub dir/ignore dir: Excluded 2026/10/01 04:30:11 DEBUG : sub dir/hello world2: Excluded (Size Filter) 2026/10/01 04:30:11 DEBUG : sub dir/hello world2: Excluded 2026/10/01 04:30:11 DEBUG : sub dir/hello world: Excluded (Size Filter) 2026/10/01 04:30:11 DEBUG : sub dir/hello world: Excluded 2026/10/01 04:30:11 DEBUG : sub dir/ignore dir: Excluded --- PASS: TestListDirSorted (15.64s) === RUN TestListDirSortedFn run.go:198: Remote "Cloudinary root 'rclone-test-rimusag2kive'", Local "Local file system at /tmp/rclone878276083", Modify Window "876000h0m0s" 2026/10/01 04:30:24 DEBUG : a.txt: Excluded (Size Filter) 2026/10/01 04:30:24 DEBUG : a.txt: Excluded 2026/10/01 04:30:24 DEBUG : sub dir/hello world2: Excluded (Size Filter) 2026/10/01 04:30:24 DEBUG : sub dir/hello world2: Excluded 2026/10/01 04:30:24 DEBUG : sub dir/hello world: Excluded (Size Filter) 2026/10/01 04:30:24 DEBUG : sub dir/hello world: Excluded 2026/10/01 04:30:25 DEBUG : sub dir/ignore dir: Excluded 2026/10/01 04:30:25 DEBUG : sub dir/hello world2: Excluded (Size Filter) 2026/10/01 04:30:25 DEBUG : sub dir/hello world2: Excluded 2026/10/01 04:30:25 DEBUG : sub dir/hello world: Excluded (Size Filter) 2026/10/01 04:30:25 DEBUG : sub dir/hello world: Excluded 2026/10/01 04:30:25 DEBUG : sub dir/ignore dir: Excluded --- PASS: TestListDirSortedFn (13.50s) === RUN TestListJSON run.go:198: Remote "Cloudinary root 'rclone-test-rimusag2kive'", Local "Local file system at /tmp/rclone878276083", Modify Window "876000h0m0s" === RUN TestListJSON/Default === RUN TestListJSON/FilesOnly === RUN TestListJSON/DirsOnly === RUN TestListJSON/Recurse === RUN TestListJSON/SubDir === RUN TestListJSON/NoModTime === RUN TestListJSON/NoMimeType === RUN TestListJSON/ShowHash === RUN TestListJSON/HashTypes === RUN TestListJSON/Metadata --- PASS: TestListJSON (11.91s) --- PASS: TestListJSON/Default (0.35s) --- PASS: TestListJSON/FilesOnly (0.43s) --- PASS: TestListJSON/DirsOnly (0.46s) --- PASS: TestListJSON/Recurse (0.67s) --- PASS: TestListJSON/SubDir (0.39s) --- PASS: TestListJSON/NoModTime (0.34s) --- PASS: TestListJSON/NoMimeType (0.49s) --- PASS: TestListJSON/ShowHash (0.40s) --- PASS: TestListJSON/HashTypes (0.86s) --- PASS: TestListJSON/Metadata (2.14s) === RUN TestStatJSON run.go:198: Remote "Cloudinary root 'rclone-test-rimusag2kive'", Local "Local file system at /tmp/rclone878276083", Modify Window "876000h0m0s" === RUN TestStatJSON/Root === RUN TestStatJSON/RootFilesOnly === RUN TestStatJSON/RootDirsOnly === RUN TestStatJSON/Dir === RUN TestStatJSON/DirWithTrailingSlash === RUN TestStatJSON/File === RUN TestStatJSON/NotFound === RUN TestStatJSON/DirFilesOnly === RUN TestStatJSON/FileFilesOnly === RUN TestStatJSON/NotFoundFilesOnly === RUN TestStatJSON/DirDirsOnly === RUN TestStatJSON/FileDirsOnly === RUN TestStatJSON/NotFoundDirsOnly === RUN TestStatJSON/RootNotFound 2026/10/01 04:30:49 DEBUG : Creating backend with remote "TestCloudinary:rclone-test-rimusag2kive/notfound" --- PASS: TestStatJSON (8.89s) --- PASS: TestStatJSON/Root (0.32s) --- PASS: TestStatJSON/RootFilesOnly (0.00s) --- PASS: TestStatJSON/RootDirsOnly (0.40s) --- PASS: TestStatJSON/Dir (0.67s) --- PASS: TestStatJSON/DirWithTrailingSlash (0.36s) --- PASS: TestStatJSON/File (0.20s) --- PASS: TestStatJSON/NotFound (0.60s) --- PASS: TestStatJSON/DirFilesOnly (0.21s) --- PASS: TestStatJSON/FileFilesOnly (0.23s) --- PASS: TestStatJSON/NotFoundFilesOnly (0.16s) --- PASS: TestStatJSON/DirDirsOnly (0.40s) --- PASS: TestStatJSON/FileDirsOnly (0.37s) --- PASS: TestStatJSON/NotFoundDirsOnly (0.34s) --- PASS: TestStatJSON/RootNotFound (0.54s) === RUN TestStatJSONMemory 2026/10/01 04:30:52 DEBUG : Creating backend with remote ":memory:" 2026/10/01 04:30:52 DEBUG : Memory root '': File to upload is small (5 bytes), uploading instead of streaming 2026/10/01 04:30:52 DEBUG : sub/file1: size = 5 OK 2026/10/01 04:30:52 DEBUG : sub/file1: md5 = 5d41402abc4b2a76b9719d911017c592 OK 2026/10/01 04:30:52 DEBUG : sub/file1: Size and md5 of src and dst objects identical === RUN TestStatJSONMemory/Dir === RUN TestStatJSONMemory/DirWithTrailingSlash === RUN TestStatJSONMemory/File === RUN TestStatJSONMemory/NotFound --- PASS: TestStatJSONMemory (0.00s) --- PASS: TestStatJSONMemory/Dir (0.00s) --- PASS: TestStatJSONMemory/DirWithTrailingSlash (0.00s) --- PASS: TestStatJSONMemory/File (0.00s) --- PASS: TestStatJSONMemory/NotFound (0.00s) === RUN TestStatJSONConfinement --- PASS: TestStatJSONConfinement (0.00s) === RUN TestMkdir run.go:198: Remote "Cloudinary root 'rclone-test-rimusag2kive'", Local "Local file system at /tmp/rclone878276083", Modify Window "876000h0m0s" 2026/10/01 04:30:52 INFO : Cloudinary root 'rclone-test-rimusag2kive': Making directory 2026/10/01 04:30:52 INFO : Cloudinary root 'rclone-test-rimusag2kive': Making directory --- PASS: TestMkdir (1.23s) === RUN TestLsd run.go:198: Remote "Cloudinary root 'rclone-test-rimusag2kive'", Local "Local file system at /tmp/rclone878276083", Modify Window "876000h0m0s" --- PASS: TestLsd (3.43s) === RUN TestLs run.go:198: Remote "Cloudinary root 'rclone-test-rimusag2kive'", Local "Local file system at /tmp/rclone878276083", Modify Window "876000h0m0s" --- PASS: TestLs (3.69s) === RUN TestLsWithFilesFrom run.go:198: Remote "Cloudinary root 'rclone-test-rimusag2kive'", Local "Local file system at /tmp/rclone878276083", Modify Window "876000h0m0s" 2026/10/01 04:31:02 DEBUG : empty space: Excluded (FilesFrom Filter) 2026/10/01 04:31:02 DEBUG : empty space: Excluded operations_test.go:139: Error Trace: /home/rclone/go/src/github.com/rclone/rclone/fs/operations/operations_test.go:139 Error: Not equal: expected: " 60 potato2\n" actual : "" Diff: --- Expected +++ Actual @@ -1,2 +1 @@ - 60 potato2 Test: TestLsWithFilesFrom --- FAIL: TestLsWithFilesFrom (3.63s) === RUN TestLsLong run.go:198: Remote "Cloudinary root 'rclone-test-rimusag2kive'", Local "Local file system at /tmp/rclone878276083", Modify Window "876000h0m0s" --- PASS: TestLsLong (3.46s) === RUN TestHashSums run.go:198: Remote "Cloudinary root 'rclone-test-rimusag2kive'", Local "Local file system at /tmp/rclone878276083", Modify Window "876000h0m0s" === RUN TestHashSums/Md5 operations_test.go:284: Error Trace: /home/rclone/go/src/github.com/rclone/rclone/fs/operations/operations_test.go:284 Error: " empty space\n potato2\n" does not contain "336d5ebc5436534e61d16e63ddfca327 empty space\n" Test: TestHashSums/Md5 operations_test.go:284: Error Trace: /home/rclone/go/src/github.com/rclone/rclone/fs/operations/operations_test.go:284 Error: " empty space\n potato2\n" does not contain "d6548b156ea68a4e003e786df99eee76 potato2\n" Test: TestHashSums/Md5 === RUN TestHashSums/Md5Download --- FAIL: TestHashSums (4.32s) --- FAIL: TestHashSums/Md5 (0.33s) --- PASS: TestHashSums/Md5Download (0.77s) === RUN TestHashSumsWithErrors 2026/10/01 04:31:12 DEBUG : Creating backend with remote ":memory:" 2026/10/01 04:31:12 ERROR : sub/file1: hash unsupported: hash type not supported 2026/10/01 04:31:12 ERROR : file1: hash unsupported: hash type not supported 2026/10/01 04:31:12 ERROR : file1: hash unsupported: hash type not supported --- PASS: TestHashSumsWithErrors (0.00s) === RUN TestHashStream 2026/10/01 04:31:12 DEBUG : Creating md5 hash of 0 bytes read from input stream 2026/10/01 04:31:12 DEBUG : Creating md5 hash of 0 bytes read from input stream 2026/10/01 04:31:12 DEBUG : Creating sha1 hash of 0 bytes read from input stream 2026/10/01 04:31:12 DEBUG : Creating sha1 hash of 0 bytes read from input stream 2026/10/01 04:31:12 DEBUG : Creating md5 hash of 12 bytes read from input stream 2026/10/01 04:31:12 DEBUG : Creating md5 hash of 12 bytes read from input stream 2026/10/01 04:31:12 DEBUG : Creating sha1 hash of 12 bytes read from input stream 2026/10/01 04:31:12 DEBUG : Creating sha1 hash of 12 bytes read from input stream --- PASS: TestHashStream (0.00s) === RUN TestSuffixName --- PASS: TestSuffixName (0.00s) === RUN TestCount run.go:198: Remote "Cloudinary root 'rclone-test-rimusag2kive'", Local "Local file system at /tmp/rclone878276083", Modify Window "876000h0m0s" --- PASS: TestCount (5.25s) === RUN TestDelete run.go:198: Remote "Cloudinary root 'rclone-test-rimusag2kive'", Local "Local file system at /tmp/rclone878276083", Modify Window "876000h0m0s" 2026/10/01 04:31:19 DEBUG : Waiting for deletions to finish 2026/10/01 04:31:19 DEBUG : large: Excluded (Size Filter) 2026/10/01 04:31:19 DEBUG : large: Excluded 2026/10/01 04:31:20 INFO : small: Deleted 2026/10/01 04:31:20 INFO : medium: Deleted --- PASS: TestDelete (5.27s) === RUN TestDeleteFatalError run.go:198: Remote "Cloudinary root 'rclone-test-rimusag2kive'", Local "Local file system at /tmp/rclone878276083", Modify Window "876000h0m0s" 2026/10/01 04:31:33 DEBUG : Waiting for deletions to finish 2026/10/01 04:31:34 ERROR : file1: Got fatal error on delete: --max-delete threshold reached 2026/10/01 04:31:34 ERROR : file10: Got fatal error on delete: --max-delete threshold reached 2026/10/01 04:31:34 ERROR : file11: Got fatal error on delete: --max-delete threshold reached 2026/10/01 04:31:34 ERROR : file12: Got fatal error on delete: --max-delete threshold reached 2026/10/01 04:31:34 ERROR : file13: Got fatal error on delete: --max-delete threshold reached 2026/10/01 04:31:34 ERROR : file14: Got fatal error on delete: --max-delete threshold reached 2026/10/01 04:31:34 ERROR : file15: Got fatal error on delete: --max-delete threshold reached 2026/10/01 04:31:34 ERROR : file16: Got fatal error on delete: --max-delete threshold reached 2026/10/01 04:31:34 ERROR : file17: Got fatal error on delete: --max-delete threshold reached 2026/10/01 04:31:34 ERROR : file18: Got fatal error on delete: --max-delete threshold reached 2026/10/01 04:31:34 ERROR : file19: Got fatal error on delete: --max-delete threshold reached 2026/10/01 04:31:34 ERROR : file2: Got fatal error on delete: --max-delete threshold reached 2026/10/01 04:31:34 ERROR : file0: Got fatal error on delete: --max-delete threshold reached 2026/10/01 04:31:34 ERROR : file3: Got fatal error on delete: --max-delete threshold reached 2026/10/01 04:31:34 ERROR : file5: Got fatal error on delete: --max-delete threshold reached 2026/10/01 04:31:34 ERROR : file6: Got fatal error on delete: --max-delete threshold reached 2026/10/01 04:31:34 ERROR : file4: Got fatal error on delete: --max-delete threshold reached 2026/10/01 04:31:34 ERROR : file7: Got fatal error on delete: --max-delete threshold reached 2026/10/01 04:31:34 ERROR : file9: Got fatal error on delete: --max-delete threshold reached 2026/10/01 04:31:34 ERROR : file8: Got fatal error on delete: --max-delete threshold reached --- PASS: TestDeleteFatalError (22.48s) === RUN TestMaxDelete run.go:198: Remote "Cloudinary root 'rclone-test-rimusag2kive'", Local "Local file system at /tmp/rclone878276083", Modify Window "876000h0m0s" 2026/10/01 04:31:47 DEBUG : Waiting for deletions to finish 2026/10/01 04:31:47 ERROR : small: Got fatal error on delete: --max-delete threshold reached 2026/10/01 04:31:47 INFO : medium: Deleted 2026/10/01 04:31:47 INFO : large: Deleted --- PASS: TestMaxDelete (4.99s) === RUN TestMaxDeleteSizeLargeFile run.go:198: Remote "Cloudinary root 'rclone-test-rimusag2kive'", Local "Local file system at /tmp/rclone878276083", Modify Window "876000h0m0s" 2026/10/01 04:31:52 DEBUG : Waiting for deletions to finish 2026/10/01 04:31:52 ERROR : large: Got fatal error on delete: --max-delete-size threshold reached 2026/10/01 04:31:53 INFO : medium: Deleted 2026/10/01 04:31:53 INFO : small: Deleted --- PASS: TestMaxDeleteSizeLargeFile (5.13s) === RUN TestMaxDeleteSize run.go:198: Remote "Cloudinary root 'rclone-test-rimusag2kive'", Local "Local file system at /tmp/rclone878276083", Modify Window "876000h0m0s" 2026/10/01 04:31:57 DEBUG : Waiting for deletions to finish 2026/10/01 04:31:58 ERROR : small: Got fatal error on delete: --max-delete-size threshold reached 2026/10/01 04:31:58 INFO : medium: Deleted 2026/10/01 04:31:58 INFO : large: Deleted --- PASS: TestMaxDeleteSize (5.35s) === RUN TestReadFile run.go:198: Remote "Cloudinary root 'rclone-test-rimusag2kive'", Local "Local file system at /tmp/rclone878276083", Modify Window "876000h0m0s" operations_test.go:536: Error Trace: /home/rclone/go/src/github.com/rclone/rclone/fs/operations/operations_test.go:536 Error: Received unexpected error: object not found Test: TestReadFile --- FAIL: TestReadFile (3.65s) === RUN TestRetry 2026/10/01 04:32:04 DEBUG : Received error: Wrapped EOF is retriable: EOF - low level retry 1/5 2026/10/01 04:32:04 DEBUG : Received error: Wrapped EOF is retriable: EOF - low level retry 2/5 2026/10/01 04:32:04 DEBUG : Sleeping for 10ms (as indicated by the server) to obey Retry-After error: BANG: trying again in 10ms 2026/10/01 04:32:04 DEBUG : Sleeping for 10ms (as indicated by the server) to obey Retry-After error: BANG: trying again in 10ms 2026/10/01 04:32:04 DEBUG : Sleeping for 10ms (as indicated by the server) to obey Retry-After error: BANG: trying again in 10ms 2026/10/01 04:32:04 DEBUG : Sleeping for 10ms (as indicated by the server) to obey Retry-After error: BANG: trying again in 10ms --- PASS: TestRetry (0.04s) === RUN TestRetryAfterContextCancel 2026/10/01 04:32:04 DEBUG : Sleeping for 1h0m0s (as indicated by the server) to obey Retry-After error: BANG: trying again in 1h0m0s --- PASS: TestRetryAfterContextCancel (0.00s) === RUN TestRetryAfterLastTry --- PASS: TestRetryAfterLastTry (0.00s) === RUN TestCat run.go:198: Remote "Cloudinary root 'rclone-test-rimusag2kive'", Local "Local file system at /tmp/rclone878276083", Modify Window "876000h0m0s" --- PASS: TestCat (5.86s) === RUN TestPurge 2026/10/01 04:32:10 DEBUG : Creating backend with remote "TestCloudinary:rclone-test-nifihic1laga" 2026/10/01 04:32:10 DEBUG : Using config file from "/home/rclone/.rclone.conf" 2026/10/01 04:32:10 DEBUG : Creating backend with remote "/tmp/rclone1297421023" run.go:198: Remote "Cloudinary root 'rclone-test-nifihic1laga'", Local "Local file system at /tmp/rclone1297421023", Modify Window "876000h0m0s" 2026/10/01 04:32:11 INFO : A2: Making directory 2026/10/01 04:32:12 INFO : A1/B2: Making directory 2026/10/01 04:32:12 INFO : A1/B2/C2: Making directory 2026/10/01 04:32:12 INFO : A1/B1/C3: Making directory 2026/10/01 04:32:12 INFO : A3: Making directory 2026/10/01 04:32:12 INFO : A3/B3: Making directory 2026/10/01 04:32:13 INFO : A3/B3/C4: Making directory 2026/10/01 04:32:15 DEBUG : Waiting for deletions to finish 2026/10/01 04:32:16 INFO : A1/B1/C1/one: Deleted 2026/10/01 04:32:17 DEBUG : removing 2 level 3 directories 2026/10/01 04:32:17 INFO : A1/B1/C3: Removing directory 2026/10/01 04:32:17 INFO : A1/B1/C1: Removing directory 2026/10/01 04:32:17 DEBUG : removing 1 level 2 directories 2026/10/01 04:32:17 INFO : A1/B1: Removing directory 2026/10/01 04:32:19 DEBUG : Waiting for deletions to finish 2026/10/01 04:32:20 INFO : A1/two: Deleted 2026/10/01 04:32:22 DEBUG : removing 2 level 3 directories 2026/10/01 04:32:22 INFO : A3/B3/C4: Removing directory 2026/10/01 04:32:22 INFO : A1/B2/C2: Removing directory 2026/10/01 04:32:22 DEBUG : removing 2 level 2 directories 2026/10/01 04:32:22 INFO : A3/B3: Removing directory 2026/10/01 04:32:22 INFO : A1/B2: Removing directory 2026/10/01 04:32:23 DEBUG : removing 3 level 1 directories 2026/10/01 04:32:23 INFO : A3: Removing directory 2026/10/01 04:32:23 INFO : A1: Removing directory 2026/10/01 04:32:23 INFO : A2: Removing directory 2026/10/01 04:32:23 DEBUG : removing 1 level 0 directories 2026/10/01 04:32:23 INFO : Cloudinary root 'rclone-test-nifihic1laga': Removing directory 2026/10/01 04:32:24 ERROR : error listing: directory not found 2026/10/01 04:32:24 ERROR : error listing: directory not found 2026/10/01 04:32:24 DEBUG : Cloudinary root 'rclone-test-nifihic1laga': Purge dir "" 2026/10/01 04:32:24 NOTICE: purge failed to rmdir "": directory not found 2026/10/01 04:32:24 NOTICE: purge failed: directory not found --- PASS: TestPurge (14.13s) === RUN TestRmdirsNoLeaveRoot run.go:198: Remote "Cloudinary root 'rclone-test-rimusag2kive'", Local "Local file system at /tmp/rclone878276083", Modify Window "876000h0m0s" 2026/10/01 04:32:25 INFO : A2: Making directory 2026/10/01 04:32:25 INFO : A1/B2: Making directory 2026/10/01 04:32:25 INFO : A1/B2/C2: Making directory 2026/10/01 04:32:25 INFO : A1/B1/C3: Making directory 2026/10/01 04:32:25 INFO : A3: Making directory 2026/10/01 04:32:25 INFO : A3/B3: Making directory 2026/10/01 04:32:26 INFO : A3/B3/C4: Making directory 2026/10/01 04:32:28 DEBUG : removing 1 level 3 directories 2026/10/01 04:32:28 INFO : A3/B3/C4: Removing directory 2026/10/01 04:32:31 DEBUG : removing 2 level 3 directories 2026/10/01 04:32:31 INFO : A1/B2/C2: Removing directory 2026/10/01 04:32:31 INFO : A1/B1/C3: Removing directory 2026/10/01 04:32:32 DEBUG : removing 2 level 2 directories 2026/10/01 04:32:32 INFO : A3/B3: Removing directory 2026/10/01 04:32:32 INFO : A1/B2: Removing directory 2026/10/01 04:32:32 DEBUG : removing 2 level 1 directories 2026/10/01 04:32:32 INFO : A3: Removing directory 2026/10/01 04:32:32 INFO : A2: Removing directory 2026/10/01 04:32:37 DEBUG : removing 1 level 3 directories 2026/10/01 04:32:37 INFO : A1/B1/C1: Removing directory 2026/10/01 04:32:37 DEBUG : removing 1 level 2 directories 2026/10/01 04:32:37 INFO : A1/B1: Removing directory 2026/10/01 04:32:38 DEBUG : removing 1 level 1 directories 2026/10/01 04:32:38 INFO : A1: Removing directory 2026/10/01 04:32:39 DEBUG : removing 1 level 0 directories 2026/10/01 04:32:39 INFO : Cloudinary root 'rclone-test-rimusag2kive': Removing directory 2026/10/01 04:32:39 ERROR : error listing: directory not found 2026/10/01 04:32:40 ERROR : error listing: directory not found --- PASS: TestRmdirsNoLeaveRoot (15.80s) === RUN TestRmdirsLeaveRoot run.go:198: Remote "Cloudinary root 'rclone-test-rimusag2kive'", Local "Local file system at /tmp/rclone878276083", Modify Window "876000h0m0s" 2026/10/01 04:32:40 INFO : A1: Making directory 2026/10/01 04:32:40 INFO : A1/B1: Making directory 2026/10/01 04:32:40 INFO : A1/B1/C1: Making directory 2026/10/01 04:32:43 DEBUG : removing 1 level 3 directories 2026/10/01 04:32:43 INFO : A1/B1/C1: Removing directory 2026/10/01 04:32:43 DEBUG : removing 1 level 2 directories 2026/10/01 04:32:43 INFO : A1/B1: Removing directory --- PASS: TestRmdirsLeaveRoot (6.20s) === RUN TestRmdirsWithFilter run.go:198: Remote "Cloudinary root 'rclone-test-rimusag2kive'", Local "Local file system at /tmp/rclone878276083", Modify Window "876000h0m0s" 2026/10/01 04:32:46 INFO : A1: Making directory 2026/10/01 04:32:46 INFO : A1/B1: Making directory 2026/10/01 04:32:47 INFO : A1/B1/C1: Making directory 2026/10/01 04:32:49 DEBUG : removing 1 level 3 directories 2026/10/01 04:32:49 INFO : A1/B1/C1: Removing directory 2026/10/01 04:32:50 DEBUG : removing 1 level 2 directories 2026/10/01 04:32:50 INFO : A1/B1: Removing directory --- PASS: TestRmdirsWithFilter (6.25s) === RUN TestCopyURL run.go:198: Remote "Cloudinary root 'rclone-test-rimusag2kive'", Local "Local file system at /tmp/rclone878276083", Modify Window "876000h0m0s" 2026/10/01 04:32:53 DEBUG : file1: size = 14 OK 2026/10/01 04:32:53 DEBUG : file1: md5 = 081404b3d2ae5bf599add15b7445ac07 OK 2026/10/01 04:32:54 DEBUG : file1: size = 14 OK 2026/10/01 04:32:54 DEBUG : file1: md5 = 081404b3d2ae5bf599add15b7445ac07 OK operations_test.go:929: Error Trace: /home/rclone/go/src/github.com/rclone/rclone/fs/operations/operations_test.go:929 Error: An error is expected but got nil. Test: TestCopyURL --- FAIL: TestCopyURL (2.91s) === RUN TestCopyURLDownloadHeaders run.go:198: Remote "Cloudinary root 'rclone-test-rimusag2kive'", Local "Local file system at /tmp/rclone878276083", Modify Window "876000h0m0s" 2026/10/01 04:32:56 DEBUG : file1: size = 14 OK 2026/10/01 04:32:56 DEBUG : file1: md5 = 081404b3d2ae5bf599add15b7445ac07 OK --- PASS: TestCopyURLDownloadHeaders (1.45s) === RUN TestCopyURLToWriter --- PASS: TestCopyURLToWriter (0.00s) === RUN TestMoveFile run.go:198: Remote "Cloudinary root 'rclone-test-rimusag2kive'", Local "Local file system at /tmp/rclone878276083", Modify Window "876000h0m0s" 2026/10/01 04:32:57 DEBUG : file1: Need to transfer - File not found at Destination 2026/10/01 04:32:57 DEBUG : sub/file2: size = 14 OK 2026/10/01 04:32:57 DEBUG : file1: md5 = 0ef726ce9b1a7692357ff70dd321d595 OK 2026/10/01 04:32:57 INFO : file1: Copied (new) to: sub/file2 2026/10/01 04:32:57 INFO : file1: Deleted 2026/10/01 04:32:58 DEBUG : file1: Need to transfer - File not found at Destination 2026/10/01 04:32:59 DEBUG : sub/file2: size = 14 OK 2026/10/01 04:32:59 DEBUG : file1: md5 = 0ef726ce9b1a7692357ff70dd321d595 OK 2026/10/01 04:32:59 INFO : file1: Copied (new) to: sub/file2 2026/10/01 04:32:59 INFO : file1: Deleted 2026/10/01 04:32:59 DEBUG : Cloudinary root 'rclone-test-rimusag2kive': don't need to copy/move sub/file2, it is already at target location --- PASS: TestMoveFile (5.59s) === RUN TestMoveFileWithIgnoreExisting run.go:198: Remote "Cloudinary root 'rclone-test-rimusag2kive'", Local "Local file system at /tmp/rclone878276083", Modify Window "876000h0m0s" 2026/10/01 04:33:02 DEBUG : file1: Need to transfer - File not found at Destination 2026/10/01 04:33:03 DEBUG : file1: size = 14 OK 2026/10/01 04:33:03 DEBUG : file1: md5 = 0ef726ce9b1a7692357ff70dd321d595 OK 2026/10/01 04:33:03 INFO : file1: Copied (new) 2026/10/01 04:33:03 INFO : file1: Deleted 2026/10/01 04:33:04 DEBUG : file1: Need to transfer - File not found at Destination 2026/10/01 04:33:04 DEBUG : file1: size = 14 OK 2026/10/01 04:33:04 DEBUG : file1: md5 = 0708a3947e56ae531342f76f27275499 OK 2026/10/01 04:33:04 INFO : file1: Copied (new) 2026/10/01 04:33:04 INFO : file1: Deleted fstest.go:299: Sleeping for 1s for list eventual consistency: 1/5 fstest.go:299: Sleeping for 2s for list eventual consistency: 2/5 fstest.go:299: Sleeping for 4s for list eventual consistency: 3/5 fstest.go:299: Sleeping for 8s for list eventual consistency: 4/5 fstest.go:299: Sleeping for 16s for list eventual consistency: 5/5 fstest.go:306: Error Trace: /home/rclone/go/src/github.com/rclone/rclone/fstest/fstest.go:306 /home/rclone/go/src/github.com/rclone/rclone/fstest/fstest.go:339 /home/rclone/go/src/github.com/rclone/rclone/fstest/fstest.go:351 /home/rclone/go/src/github.com/rclone/rclone/fstest/run.go:352 /home/rclone/go/src/github.com/rclone/rclone/fs/operations/operations_test.go:1081 Error: Should be true Test: TestMoveFileWithIgnoreExisting Messages: listing wrong, want file1 (14) got fstest.go:204: Not found "file1" fstest.go:207: Error Trace: /home/rclone/go/src/github.com/rclone/rclone/fstest/fstest.go:207 /home/rclone/go/src/github.com/rclone/rclone/fstest/fstest.go:311 /home/rclone/go/src/github.com/rclone/rclone/fstest/fstest.go:339 /home/rclone/go/src/github.com/rclone/rclone/fstest/fstest.go:351 /home/rclone/go/src/github.com/rclone/rclone/fstest/run.go:352 /home/rclone/go/src/github.com/rclone/rclone/fs/operations/operations_test.go:1081 /usr/local/go/src/runtime/asm_amd64.s:1264 Error: Not equal: expected: 0 actual : 1 Test: TestMoveFileWithIgnoreExisting Messages: 1 objects not found --- FAIL: TestMoveFileWithIgnoreExisting (34.69s) === RUN TestMoveFileImmutable run.go:198: Remote "Cloudinary root 'rclone-test-rimusag2kive'", Local "Local file system at /tmp/rclone878276083", Modify Window "876000h0m0s" 2026/10/01 04:33:38 DEBUG : existing: Need to transfer - File not found at Destination 2026/10/01 04:33:39 DEBUG : existing: size = 8 OK 2026/10/01 04:33:39 DEBUG : existing: md5 = 53f8d64113036808686b056cc0b0f649 OK 2026/10/01 04:33:39 INFO : existing: Copied (new) 2026/10/01 04:33:39 INFO : existing: Deleted operations_test.go:1099: Error Trace: /home/rclone/go/src/github.com/rclone/rclone/fs/operations/operations_test.go:1099 Error: Expected error with "immutable file modified" in chain but got nil. Test: TestMoveFileImmutable fstest.go:299: Sleeping for 1s for list eventual consistency: 1/5 fstest.go:299: Sleeping for 2s for list eventual consistency: 2/5 fstest.go:299: Sleeping for 4s for list eventual consistency: 3/5 fstest.go:299: Sleeping for 8s for list eventual consistency: 4/5 fstest.go:299: Sleeping for 16s for list eventual consistency: 5/5 fstest.go:306: Error Trace: /home/rclone/go/src/github.com/rclone/rclone/fstest/fstest.go:306 /home/rclone/go/src/github.com/rclone/rclone/fstest/fstest.go:339 /home/rclone/go/src/github.com/rclone/rclone/fstest/fstest.go:351 /home/rclone/go/src/github.com/rclone/rclone/fstest/run.go:352 /home/rclone/go/src/github.com/rclone/rclone/fs/operations/operations_test.go:1100 Error: Should be true Test: TestMoveFileImmutable Messages: listing wrong, want existing (8) got fstest.go:204: Not found "existing" fstest.go:207: Error Trace: /home/rclone/go/src/github.com/rclone/rclone/fstest/fstest.go:207 /home/rclone/go/src/github.com/rclone/rclone/fstest/fstest.go:311 /home/rclone/go/src/github.com/rclone/rclone/fstest/fstest.go:339 /home/rclone/go/src/github.com/rclone/rclone/fstest/fstest.go:351 /home/rclone/go/src/github.com/rclone/rclone/fstest/run.go:352 /home/rclone/go/src/github.com/rclone/rclone/fs/operations/operations_test.go:1100 /usr/local/go/src/runtime/asm_amd64.s:1264 Error: Not equal: expected: 0 actual : 1 Test: TestMoveFileImmutable Messages: 1 objects not found fstest.go:299: Sleeping for 1s for list eventual consistency: 1/5 fstest.go:299: Sleeping for 2s for list eventual consistency: 2/5 fstest.go:299: Sleeping for 4s for list eventual consistency: 3/5 fstest.go:299: Sleeping for 8s for list eventual consistency: 4/5 fstest.go:299: Sleeping for 16s for list eventual consistency: 5/5 fstest.go:306: Error Trace: /home/rclone/go/src/github.com/rclone/rclone/fstest/fstest.go:306 /home/rclone/go/src/github.com/rclone/rclone/fstest/fstest.go:339 /home/rclone/go/src/github.com/rclone/rclone/fstest/fstest.go:351 /home/rclone/go/src/github.com/rclone/rclone/fstest/run.go:358 /home/rclone/go/src/github.com/rclone/rclone/fs/operations/operations_test.go:1101 Error: Should be true Test: TestMoveFileImmutable Messages: listing wrong, want existing (6) got existing (8) fstest.go:151: Error Trace: /home/rclone/go/src/github.com/rclone/rclone/fstest/fstest.go:151 /home/rclone/go/src/github.com/rclone/rclone/fstest/fstest.go:196 /home/rclone/go/src/github.com/rclone/rclone/fstest/fstest.go:309 /home/rclone/go/src/github.com/rclone/rclone/fstest/fstest.go:339 /home/rclone/go/src/github.com/rclone/rclone/fstest/fstest.go:351 /home/rclone/go/src/github.com/rclone/rclone/fstest/run.go:358 /home/rclone/go/src/github.com/rclone/rclone/fs/operations/operations_test.go:1101 Error: Not equal: expected: 6 actual : 8 Test: TestMoveFileImmutable Messages: existing: size incorrect file=6 vs obj=8 --- FAIL: TestMoveFileImmutable (66.89s) === RUN TestCaseInsensitiveMoveFile run.go:198: Remote "Cloudinary root 'rclone-test-rimusag2kive'", Local "Local file system at /tmp/rclone878276083", Modify Window "876000h0m0s" --- PASS: TestCaseInsensitiveMoveFile (0.61s) === RUN TestCaseInsensitiveMoveFileDryRun run.go:198: Remote "Cloudinary root 'rclone-test-rimusag2kive'", Local "Local file system at /tmp/rclone878276083", Modify Window "876000h0m0s" --- PASS: TestCaseInsensitiveMoveFileDryRun (0.63s) === RUN TestMoveFileBackupDir run.go:198: Remote "Cloudinary root 'rclone-test-rimusag2kive'", Local "Local file system at /tmp/rclone878276083", Modify Window "876000h0m0s" operations_test.go:1161: Skipping test as remote does not support server-side move or copy --- SKIP: TestMoveFileBackupDir (0.63s) === RUN TestSameConfig --- PASS: TestSameConfig (0.00s) === RUN TestSame --- PASS: TestSame (0.00s) === RUN TestOverlappingFilterCheckWithoutFilter --- PASS: TestOverlappingFilterCheckWithoutFilter (0.00s) === RUN TestOverlappingFilterCheckWithFilter --- PASS: TestOverlappingFilterCheckWithFilter (0.00s) === RUN TestListFormat --- PASS: TestListFormat (0.00s) === RUN TestDirMoveMoveError run.go:198: Remote "Cloudinary root 'rclone-test-rimusag2kive'", Local "Local file system at /tmp/rclone878276083", Modify Window "876000h0m0s" operations_test.go:1490: Skipping test on non local remote --- SKIP: TestDirMoveMoveError (21.97s) === RUN TestDirMoveContext run.go:198: Remote "Cloudinary root 'rclone-test-rimusag2kive'", Local "Local file system at /tmp/rclone878276083", Modify Window "876000h0m0s" operations_test.go:1490: Skipping test on non local remote --- SKIP: TestDirMoveContext (3.47s) === RUN TestDirMove run.go:198: Remote "Cloudinary root 'rclone-test-rimusag2kive'", Local "Local file system at /tmp/rclone878276083", Modify Window "876000h0m0s" 2026/10/01 04:35:15 INFO : A1/B2: Making directory 2026/10/01 04:35:15 INFO : A1/B1/C3: Making directory 2026/10/01 04:35:20 DEBUG : A2/B1/three: size = 5 OK 2026/10/01 04:35:20 DEBUG : A1/B1/three: Src hash empty - aborting Dst hash check 2026/10/01 04:35:20 INFO : A1/B1/three: Copied (new) to: A2/B1/three 2026/10/01 04:35:21 DEBUG : A2/one: size = 3 OK 2026/10/01 04:35:21 DEBUG : A1/one: Src hash empty - aborting Dst hash check 2026/10/01 04:35:21 INFO : A1/one: Copied (new) to: A2/one 2026/10/01 04:35:21 DEBUG : A2/two: size = 3 OK 2026/10/01 04:35:21 DEBUG : A1/two: Src hash empty - aborting Dst hash check 2026/10/01 04:35:21 INFO : A1/two: Copied (new) to: A2/two 2026/10/01 04:35:21 INFO : A1/B1/three: Deleted 2026/10/01 04:35:21 DEBUG : A2/B1/C1/four: size = 4 OK 2026/10/01 04:35:21 DEBUG : A1/B1/C1/four: Src hash empty - aborting Dst hash check 2026/10/01 04:35:21 INFO : A1/B1/C1/four: Copied (new) to: A2/B1/C1/four 2026/10/01 04:35:21 INFO : A1/two: Deleted 2026/10/01 04:35:21 INFO : A1/B1/C1/four: Deleted 2026/10/01 04:35:21 INFO : A1/one: Deleted 2026/10/01 04:35:21 DEBUG : A2/B1/C2/five: size = 4 OK 2026/10/01 04:35:21 DEBUG : A1/B1/C2/five: Src hash empty - aborting Dst hash check 2026/10/01 04:35:21 INFO : A1/B1/C2/five: Copied (new) to: A2/B1/C2/five 2026/10/01 04:35:21 INFO : A1/B1/C2/five: Deleted 2026/10/01 04:35:28 DEBUG : A3/B1/C1/four: size = 4 OK 2026/10/01 04:35:28 DEBUG : A2/B1/C1/four: Src hash empty - aborting Dst hash check 2026/10/01 04:35:28 INFO : A2/B1/C1/four: Copied (new) to: A3/B1/C1/four 2026/10/01 04:35:28 DEBUG : A3/two: size = 3 OK 2026/10/01 04:35:28 DEBUG : A2/two: Src hash empty - aborting Dst hash check 2026/10/01 04:35:28 INFO : A2/two: Copied (new) to: A3/two 2026/10/01 04:35:28 DEBUG : A3/B1/C2/five: size = 4 OK 2026/10/01 04:35:28 DEBUG : A2/B1/C2/five: Src hash empty - aborting Dst hash check 2026/10/01 04:35:28 INFO : A2/B1/C2/five: Copied (new) to: A3/B1/C2/five 2026/10/01 04:35:28 DEBUG : A3/B1/three: size = 5 OK 2026/10/01 04:35:28 DEBUG : A2/B1/three: Src hash empty - aborting Dst hash check 2026/10/01 04:35:28 INFO : A2/B1/three: Copied (new) to: A3/B1/three 2026/10/01 04:35:28 DEBUG : A3/one: size = 3 OK 2026/10/01 04:35:28 DEBUG : A2/one: Src hash empty - aborting Dst hash check 2026/10/01 04:35:28 INFO : A2/one: Copied (new) to: A3/one 2026/10/01 04:35:28 INFO : A2/B1/C2/five: Deleted 2026/10/01 04:35:28 INFO : A2/B1/C1/four: Deleted 2026/10/01 04:35:29 INFO : A2/two: Deleted 2026/10/01 04:35:29 INFO : A2/B1/three: Deleted 2026/10/01 04:35:29 INFO : A2/one: Deleted 2026/10/01 04:35:33 INFO : Cloudinary root 'rclone-test-rimusag2kive': Can't DirMove - falling back to file moves: can't move directory - incompatible remotes 2026/10/01 04:35:36 DEBUG : A4/one: size = 3 OK 2026/10/01 04:35:36 DEBUG : A3/one: Src hash empty - aborting Dst hash check 2026/10/01 04:35:36 INFO : A3/one: Copied (new) to: A4/one 2026/10/01 04:35:36 DEBUG : A4/two: size = 3 OK 2026/10/01 04:35:36 DEBUG : A3/two: Src hash empty - aborting Dst hash check 2026/10/01 04:35:36 INFO : A3/two: Copied (new) to: A4/two 2026/10/01 04:35:36 DEBUG : A4/B1/C2/five: size = 4 OK 2026/10/01 04:35:36 DEBUG : A3/B1/C2/five: Src hash empty - aborting Dst hash check 2026/10/01 04:35:36 INFO : A3/B1/C2/five: Copied (new) to: A4/B1/C2/five 2026/10/01 04:35:36 DEBUG : A4/B1/three: size = 5 OK 2026/10/01 04:35:36 DEBUG : A3/B1/three: Src hash empty - aborting Dst hash check 2026/10/01 04:35:36 INFO : A3/B1/three: Copied (new) to: A4/B1/three 2026/10/01 04:35:36 DEBUG : A4/B1/C1/four: size = 4 OK 2026/10/01 04:35:36 DEBUG : A3/B1/C1/four: Src hash empty - aborting Dst hash check 2026/10/01 04:35:36 INFO : A3/B1/C1/four: Copied (new) to: A4/B1/C1/four 2026/10/01 04:35:36 INFO : A3/two: Deleted 2026/10/01 04:35:36 INFO : A3/B1/C2/five: Deleted 2026/10/01 04:35:37 INFO : A3/one: Deleted 2026/10/01 04:35:37 INFO : A3/B1/three: Deleted 2026/10/01 04:35:37 INFO : A3/B1/C1/four: Deleted --- PASS: TestDirMove (35.43s) === RUN TestGetFsInfo run.go:198: Remote "Cloudinary root 'rclone-test-rimusag2kive'", Local "Local file system at /tmp/rclone878276083", Modify Window "876000h0m0s" --- PASS: TestGetFsInfo (0.51s) === RUN TestRcat === RUN TestRcat/withChecksum=false,ignoreChecksum=false run.go:198: Remote "Cloudinary root 'rclone-test-rimusag2kive'", Local "Local file system at /tmp/rclone878276083", Modify Window "876000h0m0s" 2026/10/01 04:35:47 DEBUG : Cloudinary root 'rclone-test-rimusag2kive': File to upload is small (34 bytes), uploading instead of streaming 2026/10/01 04:35:48 DEBUG : no_checksum_small_file_from_pipe: size = 34 OK 2026/10/01 04:35:48 DEBUG : no_checksum_small_file_from_pipe: md5 = 4c762bc6ec18f21b23fcae426c7863b5 OK 2026/10/01 04:35:48 DEBUG : no_checksum_small_file_from_pipe: Size and md5 of src and dst objects identical 2026/10/01 04:35:48 DEBUG : Cloudinary root 'rclone-test-rimusag2kive': Target remote doesn't support streaming uploads, creating temporary local FS to spool file 2026/10/01 04:35:48 DEBUG : no_checksum_big_file_from_pipe: size = 102401 OK 2026/10/01 04:35:48 DEBUG : no_checksum_big_file_from_pipe: md5 = fffc7956ba9a7b58a63c01b6ce1ddc45 OK 2026/10/01 04:35:48 DEBUG : no_checksum_big_file_from_pipe: Size and md5 of src and dst objects identical === RUN TestRcat/withChecksum=true,ignoreChecksum=false run.go:198: Remote "Cloudinary root 'rclone-test-rimusag2kive'", Local "Local file system at /tmp/rclone878276083", Modify Window "876000h0m0s" 2026/10/01 04:35:50 DEBUG : Cloudinary root 'rclone-test-rimusag2kive': File to upload is small (34 bytes), uploading instead of streaming 2026/10/01 04:35:51 DEBUG : with_checksum_small_file_from_pipe: size = 34 OK 2026/10/01 04:35:51 DEBUG : with_checksum_small_file_from_pipe: md5 = 4c762bc6ec18f21b23fcae426c7863b5 OK 2026/10/01 04:35:51 DEBUG : with_checksum_small_file_from_pipe: Size and md5 of src and dst objects identical 2026/10/01 04:35:51 DEBUG : Cloudinary root 'rclone-test-rimusag2kive': Target remote doesn't support streaming uploads, creating temporary local FS to spool file 2026/10/01 04:35:52 DEBUG : with_checksum_big_file_from_pipe: size = 102401 OK 2026/10/01 04:35:52 DEBUG : with_checksum_big_file_from_pipe: md5 = fffc7956ba9a7b58a63c01b6ce1ddc45 OK 2026/10/01 04:35:52 DEBUG : with_checksum_big_file_from_pipe: Size and md5 of src and dst objects identical === RUN TestRcat/withChecksum=false,ignoreChecksum=true run.go:198: Remote "Cloudinary root 'rclone-test-rimusag2kive'", Local "Local file system at /tmp/rclone878276083", Modify Window "876000h0m0s" 2026/10/01 04:35:54 DEBUG : Cloudinary root 'rclone-test-rimusag2kive': File to upload is small (34 bytes), uploading instead of streaming 2026/10/01 04:35:55 DEBUG : ignore_checksum_small_file_from_pipe: size = 34 OK 2026/10/01 04:35:55 DEBUG : ignore_checksum_small_file_from_pipe: Sizes identical 2026/10/01 04:35:55 DEBUG : Cloudinary root 'rclone-test-rimusag2kive': Target remote doesn't support streaming uploads, creating temporary local FS to spool file 2026/10/01 04:35:56 DEBUG : ignore_checksum_big_file_from_pipe: size = 102401 OK 2026/10/01 04:35:56 DEBUG : ignore_checksum_big_file_from_pipe: Sizes identical === RUN TestRcat/withChecksum=true,ignoreChecksum=true run.go:198: Remote "Cloudinary root 'rclone-test-rimusag2kive'", Local "Local file system at /tmp/rclone878276083", Modify Window "876000h0m0s" 2026/10/01 04:35:58 DEBUG : Cloudinary root 'rclone-test-rimusag2kive': File to upload is small (34 bytes), uploading instead of streaming 2026/10/01 04:35:58 DEBUG : ignore_checksum_small_file_from_pipe: size = 34 OK 2026/10/01 04:35:58 DEBUG : ignore_checksum_small_file_from_pipe: Src hash empty - aborting Dst hash check 2026/10/01 04:35:58 DEBUG : ignore_checksum_small_file_from_pipe: Size of src and dst objects identical 2026/10/01 04:35:58 DEBUG : Cloudinary root 'rclone-test-rimusag2kive': Target remote doesn't support streaming uploads, creating temporary local FS to spool file 2026/10/01 04:35:59 DEBUG : ignore_checksum_big_file_from_pipe: size = 102401 OK 2026/10/01 04:35:59 DEBUG : ignore_checksum_big_file_from_pipe: Src hash empty - aborting Dst hash check 2026/10/01 04:35:59 DEBUG : ignore_checksum_big_file_from_pipe: Size of src and dst objects identical --- PASS: TestRcat (13.91s) --- PASS: TestRcat/withChecksum=false,ignoreChecksum=false (3.14s) --- PASS: TestRcat/withChecksum=true,ignoreChecksum=false (4.07s) --- PASS: TestRcat/withChecksum=false,ignoreChecksum=true (3.22s) --- PASS: TestRcat/withChecksum=true,ignoreChecksum=true (3.48s) === RUN TestRcatMetadata run.go:198: Remote "Cloudinary root 'rclone-test-rimusag2kive'", Local "Local file system at /tmp/rclone878276083", Modify Window "876000h0m0s" operations_test.go:1745: Skipping as destination doesn't support user metadata --- SKIP: TestRcatMetadata (0.62s) === RUN TestRcatSize run.go:198: Remote "Cloudinary root 'rclone-test-rimusag2kive'", Local "Local file system at /tmp/rclone878276083", Modify Window "876000h0m0s" 2026/10/01 04:36:02 DEBUG : potato1: size = 60 OK 2026/10/01 04:36:02 DEBUG : potato1: md5 = d6548b156ea68a4e003e786df99eee76 OK 2026/10/01 04:36:02 DEBUG : Cloudinary root 'rclone-test-rimusag2kive': File to upload is small (60 bytes), uploading instead of streaming 2026/10/01 04:36:03 DEBUG : potato2: size = 60 OK 2026/10/01 04:36:03 DEBUG : potato2: md5 = d6548b156ea68a4e003e786df99eee76 OK 2026/10/01 04:36:03 DEBUG : potato2: Size and md5 of src and dst objects identical --- PASS: TestRcatSize (3.75s) === RUN TestRcatSizeShortEOF run.go:198: Remote "Cloudinary root 'rclone-test-rimusag2kive'", Local "Local file system at /tmp/rclone878276083", Modify Window "876000h0m0s" 2026/10/01 04:36:06 DEBUG : potato1: size = 120 (Cloudinary root 'rclone-test-rimusag2kive') 2026/10/01 04:36:06 DEBUG : potato1: size = 60 (Cloudinary root 'rclone-test-rimusag2kive') 2026/10/01 04:36:06 ERROR : potato1: corrupted on transfer: sizes differ src 120 vs dst(Cloudinary root 'rclone-test-rimusag2kive') 60 2026/10/01 04:36:06 INFO : potato1: Removing failed copy --- PASS: TestRcatSizeShortEOF (1.49s) === RUN TestRcatSizeMetadata run.go:198: Remote "Cloudinary root 'rclone-test-rimusag2kive'", Local "Local file system at /tmp/rclone878276083", Modify Window "876000h0m0s" operations_test.go:1838: Skipping as destination doesn't support user metadata --- SKIP: TestRcatSizeMetadata (0.63s) === RUN TestRcatSizeUploadHeaders run.go:198: Remote "Cloudinary root 'rclone-test-rimusag2kive'", Local "Local file system at /tmp/rclone878276083", Modify Window "876000h0m0s" 2026/10/01 04:36:08 DEBUG : potato1: size = 60 OK 2026/10/01 04:36:08 DEBUG : potato1: md5 = d6548b156ea68a4e003e786df99eee76 OK --- PASS: TestRcatSizeUploadHeaders (1.88s) === RUN TestRcatSizeChecksum === RUN TestRcatSizeChecksum/Corrupted run.go:198: Remote "Cloudinary root 'rclone-test-rimusag2kive'", Local "Local file system at /tmp/rclone878276083", Modify Window "876000h0m0s" 2026/10/01 04:36:10 DEBUG : potato1: size = 60 OK 2026/10/01 04:36:10 DEBUG : potato1: md5 = d6548b156ea68a4e003e786df99eee76 (Cloudinary root 'rclone-test-rimusag2kive') 2026/10/01 04:36:10 DEBUG : potato1: md5 = 771ba8b5f9b1a1201c9f9bb57bf74b99 (Cloudinary root 'rclone-test-rimusag2kive') 2026/10/01 04:36:10 ERROR : potato1: corrupted on transfer: md5 hashes differ src "d6548b156ea68a4e003e786df99eee76" vs dst(Cloudinary root 'rclone-test-rimusag2kive') "771ba8b5f9b1a1201c9f9bb57bf74b99" 2026/10/01 04:36:10 INFO : potato1: Removing failed copy === RUN TestRcatSizeChecksum/SizeDiffers run.go:198: Remote "Cloudinary root 'rclone-test-rimusag2kive'", Local "Local file system at /tmp/rclone878276083", Modify Window "876000h0m0s" 2026/10/01 04:36:11 DEBUG : potato4: size = 60 (Cloudinary root 'rclone-test-rimusag2kive') 2026/10/01 04:36:11 DEBUG : potato4: size = 59 (Cloudinary root 'rclone-test-rimusag2kive') 2026/10/01 04:36:11 ERROR : potato4: corrupted on transfer: sizes differ src 60 vs dst(Cloudinary root 'rclone-test-rimusag2kive') 59 2026/10/01 04:36:11 INFO : potato4: Removing failed copy === RUN TestRcatSizeChecksum/IgnoreChecksum run.go:198: Remote "Cloudinary root 'rclone-test-rimusag2kive'", Local "Local file system at /tmp/rclone878276083", Modify Window "876000h0m0s" 2026/10/01 04:36:13 DEBUG : potato2: size = 60 OK === RUN TestRcatSizeChecksum/NoHashes run.go:198: Remote "Cloudinary root 'rclone-test-rimusag2kive'", Local "Local file system at /tmp/rclone878276083", Modify Window "876000h0m0s" 2026/10/01 04:36:15 DEBUG : potato3: size = 60 OK --- PASS: TestRcatSizeChecksum (6.43s) --- PASS: TestRcatSizeChecksum/Corrupted (1.75s) --- PASS: TestRcatSizeChecksum/SizeDiffers (1.70s) --- PASS: TestRcatSizeChecksum/IgnoreChecksum (1.34s) --- PASS: TestRcatSizeChecksum/NoHashes (1.64s) === RUN TestTouchDir run.go:198: Remote "Cloudinary root 'rclone-test-rimusag2kive'", Local "Local file system at /tmp/rclone878276083", Modify Window "876000h0m0s" operations_test.go:2020: Skipping test as remote does not support modtime --- SKIP: TestTouchDir (0.55s) === RUN TestMkdirMetadata run.go:198: Remote "Cloudinary root 'rclone-test-rimusag2kive'", Local "Local file system at /tmp/rclone878276083", Modify Window "876000h0m0s" operations_test.go:2058: Skipping test as remote does not support MkdirMetadata --- SKIP: TestMkdirMetadata (0.53s) === RUN TestMkdirModTime run.go:198: Remote "Cloudinary root 'rclone-test-rimusag2kive'", Local "Local file system at /tmp/rclone878276083", Modify Window "876000h0m0s" operations_test.go:2079: Skipping test as remote does not support DirSetModTime or MkdirMetadata --- SKIP: TestMkdirModTime (0.51s) === RUN TestCopyDirMetadata run.go:198: Remote "Cloudinary root 'rclone-test-rimusag2kive'", Local "Local file system at /tmp/rclone878276083", Modify Window "876000h0m0s" operations_test.go:2123: Skipping test as remote does not support WriteDirMetadata or MkdirMetadata --- SKIP: TestCopyDirMetadata (0.56s) === RUN TestSetDirModTime run.go:198: Remote "Cloudinary root 'rclone-test-rimusag2kive'", Local "Local file system at /tmp/rclone878276083", Modify Window "876000h0m0s" operations_test.go:2161: Skipping test as remote does not support DirSetModTime or WriteDirSetModTime --- SKIP: TestSetDirModTime (0.63s) === RUN TestDirsEqual run.go:198: Remote "Cloudinary root 'rclone-test-rimusag2kive'", Local "Local file system at /tmp/rclone878276083", Modify Window "876000h0m0s" operations_test.go:2212: Skipping test as remote does not support WriteDirMetadata or MkdirMetadata --- SKIP: TestDirsEqual (0.58s) === RUN TestRemoveExisting run.go:198: Remote "Cloudinary root 'rclone-test-rimusag2kive'", Local "Local file system at /tmp/rclone878276083", Modify Window "876000h0m0s" operations_test.go:2281: Skipping as remote can't Move --- SKIP: TestRemoveExisting (0.59s) === RUN TestRcatInputFailurePreservesDestination 2026/10/01 04:36:20 DEBUG : Creating backend with remote "/tmp/TestRcatInputFailurePreservesDestination787704965/001" --- PASS: TestRcatInputFailurePreservesDestination (0.00s) === RUN TestRcAbout rc_test.go:31: Skipping test on non local remote --- SKIP: TestRcAbout (0.00s) === RUN TestRcCleanup rc_test.go:31: Skipping test on non local remote --- SKIP: TestRcCleanup (0.00s) === RUN TestRcCopyfile rc_test.go:31: Skipping test on non local remote --- SKIP: TestRcCopyfile (0.00s) === RUN TestRcCopyurl rc_test.go:31: Skipping test on non local remote --- SKIP: TestRcCopyurl (0.00s) === RUN TestRcDelete rc_test.go:31: Skipping test on non local remote --- SKIP: TestRcDelete (0.00s) === RUN TestRcDeletefile rc_test.go:31: Skipping test on non local remote --- SKIP: TestRcDeletefile (0.00s) === RUN TestRcList rc_test.go:31: Skipping test on non local remote --- SKIP: TestRcList (0.00s) === RUN TestRcStat rc_test.go:31: Skipping test on non local remote --- SKIP: TestRcStat (0.00s) === RUN TestRcSetTier rc_test.go:31: Skipping test on non local remote --- SKIP: TestRcSetTier (0.00s) === RUN TestRcSetTierFile rc_test.go:31: Skipping test on non local remote --- SKIP: TestRcSetTierFile (0.00s) === RUN TestRcMkdir rc_test.go:31: Skipping test on non local remote --- SKIP: TestRcMkdir (0.00s) === RUN TestRcMovefile rc_test.go:31: Skipping test on non local remote --- SKIP: TestRcMovefile (0.00s) === RUN TestRcPurge rc_test.go:31: Skipping test on non local remote --- SKIP: TestRcPurge (0.00s) === RUN TestRcRmdir rc_test.go:31: Skipping test on non local remote --- SKIP: TestRcRmdir (0.00s) === RUN TestRcRmdirs rc_test.go:31: Skipping test on non local remote --- SKIP: TestRcRmdirs (0.00s) === RUN TestRcSize rc_test.go:31: Skipping test on non local remote --- SKIP: TestRcSize (0.00s) === RUN TestRcPublicLink rc_test.go:31: Skipping test on non local remote --- SKIP: TestRcPublicLink (0.00s) === RUN TestRcFsInfo rc_test.go:31: Skipping test on non local remote --- SKIP: TestRcFsInfo (0.00s) === RUN TestUploadFile rc_test.go:31: Skipping test on non local remote --- SKIP: TestUploadFile (0.00s) === RUN TestRcCommand rc_test.go:31: Skipping test on non local remote --- SKIP: TestRcCommand (0.00s) === RUN TestRcDu rc_test.go:31: Skipping test on non local remote --- SKIP: TestRcDu (0.00s) === RUN TestRcCheck rc_test.go:31: Skipping test on non local remote --- SKIP: TestRcCheck (0.00s) === RUN TestRcHashsum rc_test.go:31: Skipping test on non local remote --- SKIP: TestRcHashsum (0.00s) === RUN TestRcHashsumSingleFile rc_test.go:31: Skipping test on non local remote --- SKIP: TestRcHashsumSingleFile (0.00s) === RUN TestRcHashsumFile rc_test.go:31: Skipping test on non local remote --- SKIP: TestRcHashsumFile (0.00s) === RUN TestRcGetFile rc_test.go:31: Skipping test on non local remote --- SKIP: TestRcGetFile (0.00s) FAIL 2026/10/01 04:36:20 DEBUG : Cloudinary root 'rclone-test-rimusag2kive': Purge dir "" "./operations.test -test.v -test.timeout 1h0m0s -remote TestCloudinary: -list-retries 5 -verbose" - Finished ERROR in 13m28.502260841s (try 1/5): exit status 1: Failed [TestIndex TestIndexMaxDepth TestIndexLinkIndex TestIndexDirTime TestIndexTemplate TestIndexChanged TestIndexChangedFiles TestLsWithFilesFrom]