"./operations.test -test.v -test.timeout 1h0m0s -remote TestCloudinary: -list-retries 5 -verbose" - Starting (try 1/5) 2026/09/30 01:49:49 DEBUG : Creating backend with remote "TestCloudinary:rclone-test-beyiday8luki" 2026/09/30 01:49:49 DEBUG : Using config file from "/home/rclone/.rclone.conf" 2026/09/30 01:49:50 DEBUG : Creating backend with remote "/tmp/rclone113397365" === RUN TestDoMultiThreadCopy --- PASS: TestDoMultiThreadCopy (0.00s) === RUN TestMultithreadCalculateNumChunks === RUN TestMultithreadCalculateNumChunks/{size:1_chunkSize:65536_wantNumChunks:1} === RUN TestMultithreadCalculateNumChunks/{size:1048576_chunkSize:1_wantNumChunks:1048576} === RUN TestMultithreadCalculateNumChunks/{size:1048576_chunkSize:2_wantNumChunks:524288} === RUN TestMultithreadCalculateNumChunks/{size:1048577_chunkSize:2_wantNumChunks:524289} === RUN TestMultithreadCalculateNumChunks/{size:1048575_chunkSize:2_wantNumChunks:524288} --- PASS: TestMultithreadCalculateNumChunks (0.00s) --- PASS: TestMultithreadCalculateNumChunks/{size:1_chunkSize:65536_wantNumChunks:1} (0.00s) --- PASS: TestMultithreadCalculateNumChunks/{size:1048576_chunkSize:1_wantNumChunks:1048576} (0.00s) --- PASS: TestMultithreadCalculateNumChunks/{size:1048576_chunkSize:2_wantNumChunks:524288} (0.00s) --- PASS: TestMultithreadCalculateNumChunks/{size:1048577_chunkSize:2_wantNumChunks:524289} (0.00s) --- PASS: TestMultithreadCalculateNumChunks/{size:1048575_chunkSize:2_wantNumChunks:524288} (0.00s) === RUN TestMultithreadCopy run.go:198: Remote "Cloudinary root 'rclone-test-beyiday8luki'", Local "Local file system at /tmp/rclone113397365", Modify Window "876000h0m0s" multithread_test.go:120: multithread writing not supported 2026/09/30 01:49:50 ERROR : error listing: directory not found --- SKIP: TestMultithreadCopy (0.15s) === RUN TestMultithreadCopyAbort run.go:198: Remote "Cloudinary root 'rclone-test-beyiday8luki'", Local "Local file system at /tmp/rclone113397365", Modify Window "876000h0m0s" multithread_test.go:120: multithread writing not supported 2026/09/30 01:49:50 ERROR : error listing: directory not found --- SKIP: TestMultithreadCopyAbort (0.19s) === RUN TestMultithreadCopyWriterAtErrors === RUN TestMultithreadCopyWriterAtErrors/open/fatal=false 2026/09/30 01:49:50 DEBUG : file.txt: multi-thread copy: disabling buffering because destination uses OpenWriterAt === RUN TestMultithreadCopyWriterAtErrors/open/fatal=true 2026/09/30 01:49:50 DEBUG : file.txt: multi-thread copy: disabling buffering because destination uses OpenWriterAt === RUN TestMultithreadCopyWriterAtErrors/write/fatal=false 2026/09/30 01:49:50 DEBUG : file.txt: multi-thread copy: disabling buffering because destination uses OpenWriterAt 2026/09/30 01:49:50 DEBUG : file.txt: Starting multi-thread copy with 4 chunks of size 4 with 2 parallel streams 2026/09/30 01:49:50 DEBUG : file.txt: multi-thread copy: chunk 2/4 (4-8) size 4 starting 2026/09/30 01:49:50 DEBUG : file.txt: writing chunk 1 2026/09/30 01:49:50 DEBUG : file.txt: multi-thread copy: chunk 1/4 (0-4) size 4 starting 2026/09/30 01:49:50 DEBUG : file.txt: multi-thread copy: chunk 2/4 failed: multi-thread copy: failed to write chunk: disk full 2026/09/30 01:49:50 DEBUG : file.txt: writing chunk 0 2026/09/30 01:49:50 DEBUG : file.txt: multi-thread copy: chunk 1/4 failed: multi-thread copy: failed to write chunk: disk full 2026/09/30 01:49:50 DEBUG : file.txt: multi-thread copy: chunk 3/4 (8-12) size 4 starting 2026/09/30 01:49:50 DEBUG : file.txt: writing chunk 2 2026/09/30 01:49:50 DEBUG : file.txt: multi-thread copy: chunk 3/4 failed: multi-thread copy: failed to write chunk: disk full 2026/09/30 01:49:50 DEBUG : file.txt: multi-thread copy: cancelling transfer on exit 2026/09/30 01:49:50 DEBUG : file.txt: multi-thread copy: abort failed: multi-thread copy: failed to find temp file when aborting chunk writer: object not found === RUN TestMultithreadCopyWriterAtErrors/write/fatal=true 2026/09/30 01:49:50 DEBUG : file.txt: multi-thread copy: disabling buffering because destination uses OpenWriterAt 2026/09/30 01:49:50 DEBUG : file.txt: Starting multi-thread copy with 4 chunks of size 4 with 2 parallel streams 2026/09/30 01:49:50 DEBUG : file.txt: multi-thread copy: chunk 2/4 (4-8) size 4 starting 2026/09/30 01:49:50 DEBUG : file.txt: writing chunk 1 2026/09/30 01:49:50 DEBUG : file.txt: multi-thread copy: chunk 2/4 failed: multi-thread copy: failed to write chunk: disk full 2026/09/30 01:49:50 DEBUG : file.txt: multi-thread copy: chunk 3/4 (8-12) size 4 starting 2026/09/30 01:49:50 DEBUG : file.txt: writing chunk 2 2026/09/30 01:49:50 DEBUG : file.txt: multi-thread copy: chunk 3/4 failed: multi-thread copy: failed to write chunk: disk full 2026/09/30 01:49:50 DEBUG : file.txt: multi-thread copy: chunk 1/4 (0-4) size 4 starting 2026/09/30 01:49:50 DEBUG : file.txt: writing chunk 0 2026/09/30 01:49:50 DEBUG : file.txt: multi-thread copy: chunk 1/4 failed: multi-thread copy: failed to write chunk: disk full 2026/09/30 01:49:50 DEBUG : file.txt: multi-thread copy: cancelling transfer on exit 2026/09/30 01:49:50 DEBUG : file.txt: multi-thread copy: abort failed: multi-thread copy: failed to find temp file when aborting chunk writer: object not found === RUN TestMultithreadCopyWriterAtErrors/close/fatal=false 2026/09/30 01:49:50 DEBUG : file.txt: multi-thread copy: disabling buffering because destination uses OpenWriterAt 2026/09/30 01:49:50 DEBUG : file.txt: Starting multi-thread copy with 4 chunks of size 4 with 2 parallel streams 2026/09/30 01:49:50 DEBUG : file.txt: multi-thread copy: chunk 2/4 (4-8) size 4 starting 2026/09/30 01:49:50 DEBUG : file.txt: writing chunk 1 2026/09/30 01:49:50 DEBUG : file.txt: multi-thread copy: chunk 2/4 (4-8) size 4 finished 2026/09/30 01:49:50 DEBUG : file.txt: multi-thread copy: chunk 3/4 (8-12) size 4 starting 2026/09/30 01:49:50 DEBUG : file.txt: writing chunk 2 2026/09/30 01:49:50 DEBUG : file.txt: multi-thread copy: chunk 3/4 (8-12) size 4 finished 2026/09/30 01:49:50 DEBUG : file.txt: multi-thread copy: chunk 1/4 (0-4) size 4 starting 2026/09/30 01:49:50 DEBUG : file.txt: multi-thread copy: chunk 4/4 (12-16) size 4 starting 2026/09/30 01:49:50 DEBUG : file.txt: writing chunk 0 2026/09/30 01:49:50 DEBUG : file.txt: writing chunk 3 2026/09/30 01:49:50 DEBUG : file.txt: multi-thread copy: chunk 1/4 (0-4) size 4 finished 2026/09/30 01:49:50 DEBUG : file.txt: multi-thread copy: chunk 4/4 (12-16) size 4 finished 2026/09/30 01:49:50 DEBUG : file.txt: multi-thread copy: cancelling transfer on exit 2026/09/30 01:49:50 DEBUG : file.txt: multi-thread copy: abort failed: multi-thread copy: failed to find temp file when aborting chunk writer: object not found === RUN TestMultithreadCopyWriterAtErrors/close/fatal=true 2026/09/30 01:49:50 DEBUG : file.txt: multi-thread copy: disabling buffering because destination uses OpenWriterAt 2026/09/30 01:49:50 DEBUG : file.txt: Starting multi-thread copy with 4 chunks of size 4 with 2 parallel streams 2026/09/30 01:49:50 DEBUG : file.txt: multi-thread copy: chunk 2/4 (4-8) size 4 starting 2026/09/30 01:49:50 DEBUG : file.txt: writing chunk 1 2026/09/30 01:49:50 DEBUG : file.txt: multi-thread copy: chunk 2/4 (4-8) size 4 finished 2026/09/30 01:49:50 DEBUG : file.txt: multi-thread copy: chunk 3/4 (8-12) size 4 starting 2026/09/30 01:49:50 DEBUG : file.txt: writing chunk 2 2026/09/30 01:49:50 DEBUG : file.txt: multi-thread copy: chunk 3/4 (8-12) size 4 finished 2026/09/30 01:49:50 DEBUG : file.txt: multi-thread copy: chunk 4/4 (12-16) size 4 starting 2026/09/30 01:49:50 DEBUG : file.txt: writing chunk 3 2026/09/30 01:49:50 DEBUG : file.txt: multi-thread copy: chunk 4/4 (12-16) size 4 finished 2026/09/30 01:49:50 DEBUG : file.txt: multi-thread copy: chunk 1/4 (0-4) size 4 starting 2026/09/30 01:49:50 DEBUG : file.txt: writing chunk 0 2026/09/30 01:49:50 DEBUG : file.txt: multi-thread copy: chunk 1/4 (0-4) size 4 finished 2026/09/30 01:49:50 DEBUG : file.txt: multi-thread copy: cancelling transfer on exit 2026/09/30 01:49:50 DEBUG : file.txt: multi-thread copy: abort failed: multi-thread copy: failed to find temp file when aborting chunk writer: object not found --- PASS: TestMultithreadCopyWriterAtErrors (0.00s) --- PASS: TestMultithreadCopyWriterAtErrors/open/fatal=false (0.00s) --- PASS: TestMultithreadCopyWriterAtErrors/open/fatal=true (0.00s) --- PASS: TestMultithreadCopyWriterAtErrors/write/fatal=false (0.00s) --- PASS: TestMultithreadCopyWriterAtErrors/write/fatal=true (0.00s) --- PASS: TestMultithreadCopyWriterAtErrors/close/fatal=false (0.00s) --- PASS: TestMultithreadCopyWriterAtErrors/close/fatal=true (0.00s) === RUN TestSizeDiffers 2026/09/30 01:49:50 DEBUG : a: size = 0 OK 2026/09/30 01:49:50 DEBUG : a: size = 1 (memory) 2026/09/30 01:49:50 DEBUG : a: size = 2 (memory) --- PASS: TestSizeDiffers (0.00s) === RUN TestDirTransferEntry --- PASS: TestDirTransferEntry (0.00s) === RUN TestReOpen === RUN TestReOpen/Normal === RUN TestReOpen/Normal/Basics 2026/09/30 01:49:50 DEBUG : potato: Seek from 10 to 0 === RUN TestReOpen/Normal/ErrorAtStart === RUN TestReOpen/Normal/WithErrors 2026/09/30 01:49:50 DEBUG : potato: Reopening on read failure after offset 2 bytes: retry 1/10: test error 2026/09/30 01:49:50 DEBUG : potato: Reopening on read failure after offset 3 bytes: retry 2/10: test error 2026/09/30 01:49:50 DEBUG : potato: Reopening on read failure after offset 6 bytes: retry 3/10: test error === RUN TestReOpen/Normal/TooManyErrors 2026/09/30 01:49:50 DEBUG : potato: Reopening on read failure after offset 2 bytes: retry 1/3: test error 2026/09/30 01:49:50 DEBUG : potato: Reopening on read failure after offset 3 bytes: retry 2/3: test error 2026/09/30 01:49:50 DEBUG : potato: Reopening on read failure after offset 6 bytes: retry 3/3: test error 2026/09/30 01:49:50 DEBUG : potato: Reopen failed after offset 6 bytes read: failed to reopen: too many retries === RUN TestReOpen/Normal/ReadAt 2026/09/30 01:49:50 DEBUG : potato: Reopening on read failure after offset 2 bytes: retry 0/10: test error 2026/09/30 01:49:50 DEBUG : potato: Reopening on read failure after offset 3 bytes: retry 1/10: test error 2026/09/30 01:49:50 DEBUG : potato: Seek from 5 to 1 === RUN TestReOpen/Normal/Seek 2026/09/30 01:49:50 DEBUG : potato: Reopening on read failure after offset 2 bytes: retry 0/10: test error 2026/09/30 01:49:50 DEBUG : potato: Reopening on read failure after offset 3 bytes: retry 1/10: test error 2026/09/30 01:49:50 DEBUG : potato: Seek from 5 to 2 === RUN TestReOpen/Normal/AccountRead === RUN TestReOpen/Normal/AccountReadDelay 2026/09/30 01:49:50 DEBUG : potato: Seek from 10 to 0 2026/09/30 01:49:50 DEBUG : potato: Seek from 10 to 0 2026/09/30 01:49:50 DEBUG : potato: Seek from 10 to 0 === RUN TestReOpen/Normal/AccountReadError === RUN TestReOpen/WithRangeOption === RUN TestReOpen/WithRangeOption/Basics 2026/09/30 01:49:50 DEBUG : potato: Seek from 7 to 0 === RUN TestReOpen/WithRangeOption/ErrorAtStart === RUN TestReOpen/WithRangeOption/WithErrors 2026/09/30 01:49:50 DEBUG : potato: Reopening on read failure after offset 2 bytes: retry 1/10: test error 2026/09/30 01:49:50 DEBUG : potato: Reopening on read failure after offset 3 bytes: retry 2/10: test error 2026/09/30 01:49:50 DEBUG : potato: Reopening on read failure after offset 6 bytes: retry 3/10: test error === RUN TestReOpen/WithRangeOption/TooManyErrors 2026/09/30 01:49:50 DEBUG : potato: Reopening on read failure after offset 2 bytes: retry 1/3: test error 2026/09/30 01:49:50 DEBUG : potato: Reopening on read failure after offset 3 bytes: retry 2/3: test error 2026/09/30 01:49:50 DEBUG : potato: Reopening on read failure after offset 6 bytes: retry 3/3: test error 2026/09/30 01:49:50 DEBUG : potato: Reopen failed after offset 6 bytes read: failed to reopen: too many retries === RUN TestReOpen/WithRangeOption/ReadAt 2026/09/30 01:49:50 DEBUG : potato: Reopening on read failure after offset 2 bytes: retry 0/10: test error 2026/09/30 01:49:50 DEBUG : potato: Reopening on read failure after offset 3 bytes: retry 1/10: test error 2026/09/30 01:49:50 DEBUG : potato: Seek from 5 to 1 === RUN TestReOpen/WithRangeOption/Seek 2026/09/30 01:49:50 DEBUG : potato: Reopening on read failure after offset 2 bytes: retry 0/10: test error 2026/09/30 01:49:50 DEBUG : potato: Reopening on read failure after offset 3 bytes: retry 1/10: test error 2026/09/30 01:49:50 DEBUG : potato: Seek from 5 to 2 2026/09/30 01:49:50 DEBUG : potato: Seek from 7 to 4 === RUN TestReOpen/WithRangeOption/AccountRead === RUN TestReOpen/WithRangeOption/AccountReadDelay 2026/09/30 01:49:50 DEBUG : potato: Seek from 7 to 0 2026/09/30 01:49:50 DEBUG : potato: Seek from 7 to 0 2026/09/30 01:49:50 DEBUG : potato: Seek from 7 to 0 === RUN TestReOpen/WithRangeOption/AccountReadError === RUN TestReOpen/WithSeekOption === RUN TestReOpen/WithSeekOption/Basics 2026/09/30 01:49:50 DEBUG : potato: Seek from 8 to 0 === RUN TestReOpen/WithSeekOption/ErrorAtStart === RUN TestReOpen/WithSeekOption/WithErrors 2026/09/30 01:49:50 DEBUG : potato: Reopening on read failure after offset 2 bytes: retry 1/10: test error 2026/09/30 01:49:50 DEBUG : potato: Reopening on read failure after offset 3 bytes: retry 2/10: test error 2026/09/30 01:49:50 DEBUG : potato: Reopening on read failure after offset 6 bytes: retry 3/10: test error === RUN TestReOpen/WithSeekOption/TooManyErrors 2026/09/30 01:49:50 DEBUG : potato: Reopening on read failure after offset 2 bytes: retry 1/3: test error 2026/09/30 01:49:50 DEBUG : potato: Reopening on read failure after offset 3 bytes: retry 2/3: test error 2026/09/30 01:49:50 DEBUG : potato: Reopening on read failure after offset 6 bytes: retry 3/3: test error 2026/09/30 01:49:50 DEBUG : potato: Reopen failed after offset 6 bytes read: failed to reopen: too many retries === RUN TestReOpen/WithSeekOption/ReadAt 2026/09/30 01:49:50 DEBUG : potato: Reopening on read failure after offset 2 bytes: retry 0/10: test error 2026/09/30 01:49:50 DEBUG : potato: Reopening on read failure after offset 3 bytes: retry 1/10: test error 2026/09/30 01:49:50 DEBUG : potato: Seek from 5 to 1 === RUN TestReOpen/WithSeekOption/Seek 2026/09/30 01:49:50 DEBUG : potato: Reopening on read failure after offset 2 bytes: retry 0/10: test error 2026/09/30 01:49:50 DEBUG : potato: Reopening on read failure after offset 3 bytes: retry 1/10: test error 2026/09/30 01:49:50 DEBUG : potato: Seek from 5 to 2 2026/09/30 01:49:50 DEBUG : potato: Seek from 7 to 5 === RUN TestReOpen/WithSeekOption/AccountRead === RUN TestReOpen/WithSeekOption/AccountReadDelay 2026/09/30 01:49:50 DEBUG : potato: Seek from 8 to 0 2026/09/30 01:49:50 DEBUG : potato: Seek from 8 to 0 2026/09/30 01:49:50 DEBUG : potato: Seek from 8 to 0 === RUN TestReOpen/WithSeekOption/AccountReadError === RUN TestReOpen/UnknownSize === RUN TestReOpen/UnknownSize/Basics 2026/09/30 01:49:50 DEBUG : potato: Seek from 9 to 0 === RUN TestReOpen/UnknownSize/ErrorAtStart === RUN TestReOpen/UnknownSize/WithErrors 2026/09/30 01:49:50 DEBUG : potato: Reopening on read failure after offset 2 bytes: retry 1/10: test error 2026/09/30 01:49:50 DEBUG : potato: Reopening on read failure after offset 3 bytes: retry 2/10: test error 2026/09/30 01:49:50 DEBUG : potato: Reopening on read failure after offset 6 bytes: retry 3/10: test error === RUN TestReOpen/UnknownSize/TooManyErrors 2026/09/30 01:49:50 DEBUG : potato: Reopening on read failure after offset 2 bytes: retry 1/3: test error 2026/09/30 01:49:50 DEBUG : potato: Reopening on read failure after offset 3 bytes: retry 2/3: test error 2026/09/30 01:49:50 DEBUG : potato: Reopening on read failure after offset 6 bytes: retry 3/3: test error 2026/09/30 01:49:50 DEBUG : potato: Reopen failed after offset 6 bytes read: failed to reopen: too many retries === RUN TestReOpen/UnknownSize/ReadAt 2026/09/30 01:49:50 DEBUG : potato: Reopening on read failure after offset 2 bytes: retry 0/10: test error 2026/09/30 01:49:50 DEBUG : potato: Reopening on read failure after offset 3 bytes: retry 1/10: test error 2026/09/30 01:49:50 DEBUG : potato: Seek from 5 to 1 === RUN TestReOpen/UnknownSize/Seek 2026/09/30 01:49:50 DEBUG : potato: Reopening on read failure after offset 2 bytes: retry 0/10: test error 2026/09/30 01:49:50 DEBUG : potato: Reopening on read failure after offset 3 bytes: retry 1/10: test error 2026/09/30 01:49:50 DEBUG : potato: Seek from 5 to 2 2026/09/30 01:49:50 DEBUG : potato: Seek from 7 to 6 === RUN TestReOpen/UnknownSize/AccountRead === RUN TestReOpen/UnknownSize/AccountReadDelay 2026/09/30 01:49:50 DEBUG : potato: Seek from 9 to 0 2026/09/30 01:49:50 DEBUG : potato: Seek from 9 to 0 2026/09/30 01:49:50 DEBUG : potato: Seek from 9 to 0 === RUN TestReOpen/UnknownSize/AccountReadError --- PASS: TestReOpen (0.00s) --- PASS: TestReOpen/Normal (0.00s) --- PASS: TestReOpen/Normal/Basics (0.00s) --- PASS: TestReOpen/Normal/ErrorAtStart (0.00s) --- PASS: TestReOpen/Normal/WithErrors (0.00s) --- PASS: TestReOpen/Normal/TooManyErrors (0.00s) --- PASS: TestReOpen/Normal/ReadAt (0.00s) --- PASS: TestReOpen/Normal/Seek (0.00s) --- PASS: TestReOpen/Normal/AccountRead (0.00s) --- PASS: TestReOpen/Normal/AccountReadDelay (0.00s) --- PASS: TestReOpen/Normal/AccountReadError (0.00s) --- PASS: TestReOpen/WithRangeOption (0.00s) --- PASS: TestReOpen/WithRangeOption/Basics (0.00s) --- PASS: TestReOpen/WithRangeOption/ErrorAtStart (0.00s) --- PASS: TestReOpen/WithRangeOption/WithErrors (0.00s) --- PASS: TestReOpen/WithRangeOption/TooManyErrors (0.00s) --- PASS: TestReOpen/WithRangeOption/ReadAt (0.00s) --- PASS: TestReOpen/WithRangeOption/Seek (0.00s) --- PASS: TestReOpen/WithRangeOption/AccountRead (0.00s) --- PASS: TestReOpen/WithRangeOption/AccountReadDelay (0.00s) --- PASS: TestReOpen/WithRangeOption/AccountReadError (0.00s) --- PASS: TestReOpen/WithSeekOption (0.00s) --- PASS: TestReOpen/WithSeekOption/Basics (0.00s) --- PASS: TestReOpen/WithSeekOption/ErrorAtStart (0.00s) --- PASS: TestReOpen/WithSeekOption/WithErrors (0.00s) --- PASS: TestReOpen/WithSeekOption/TooManyErrors (0.00s) --- PASS: TestReOpen/WithSeekOption/ReadAt (0.00s) --- PASS: TestReOpen/WithSeekOption/Seek (0.00s) --- PASS: TestReOpen/WithSeekOption/AccountRead (0.00s) --- PASS: TestReOpen/WithSeekOption/AccountReadDelay (0.00s) --- PASS: TestReOpen/WithSeekOption/AccountReadError (0.00s) --- PASS: TestReOpen/UnknownSize (0.00s) --- PASS: TestReOpen/UnknownSize/Basics (0.00s) --- PASS: TestReOpen/UnknownSize/ErrorAtStart (0.00s) --- PASS: TestReOpen/UnknownSize/WithErrors (0.00s) --- PASS: TestReOpen/UnknownSize/TooManyErrors (0.00s) --- PASS: TestReOpen/UnknownSize/ReadAt (0.00s) --- PASS: TestReOpen/UnknownSize/Seek (0.00s) --- PASS: TestReOpen/UnknownSize/AccountRead (0.00s) --- PASS: TestReOpen/UnknownSize/AccountReadDelay (0.00s) --- PASS: TestReOpen/UnknownSize/AccountReadError (0.00s) === RUN TestCheck run.go:198: Remote "Cloudinary root 'rclone-test-beyiday8luki'", Local "Local file system at /tmp/rclone113397365", Modify Window "876000h0m0s" === RUN TestCheck/1 === RUN TestCheck/2 === RUN TestCheck/3 === RUN TestCheck/4 === RUN TestCheck/5 === RUN TestCheck/6 === RUN TestCheck/7 --- PASS: TestCheck (10.43s) --- PASS: TestCheck/1 (0.46s) --- PASS: TestCheck/2 (0.43s) --- PASS: TestCheck/3 (0.43s) --- PASS: TestCheck/4 (0.40s) --- PASS: TestCheck/5 (0.38s) --- PASS: TestCheck/6 (0.45s) --- PASS: TestCheck/7 (0.44s) === RUN TestCheckFsError 2026/09/30 01:50:00 DEBUG : Creating backend with remote "nonexistent" 2026/09/30 01:50:00 DEBUG : Creating backend with remote "nonexistent" 2026/09/30 01:50:00 DEBUG : Local file system at nonexistent: Waiting for checks to finish 2026/09/30 01:50:00 ERROR : Local file system at nonexistent: error reading source root directory: directory not found 2026/09/30 01:50:00 NOTICE: Local file system at nonexistent: 0 differences found 2026/09/30 01:50:00 NOTICE: Local file system at nonexistent: 2 errors while checking --- PASS: TestCheckFsError (0.00s) === RUN TestCheckDownload run.go:198: Remote "Cloudinary root 'rclone-test-beyiday8luki'", Local "Local file system at /tmp/rclone113397365", Modify Window "876000h0m0s" === RUN TestCheckDownload/1 === RUN TestCheckDownload/2 === RUN TestCheckDownload/3 === RUN TestCheckDownload/4 === RUN TestCheckDownload/5 === RUN TestCheckDownload/6 === RUN TestCheckDownload/7 --- PASS: TestCheckDownload (10.12s) --- PASS: TestCheckDownload/1 (0.59s) --- PASS: TestCheckDownload/2 (0.64s) --- PASS: TestCheckDownload/3 (0.43s) --- PASS: TestCheckDownload/4 (0.44s) --- PASS: TestCheckDownload/5 (0.39s) --- PASS: TestCheckDownload/6 (0.50s) --- PASS: TestCheckDownload/7 (0.34s) === RUN TestCheckSizeOnly run.go:198: Remote "Cloudinary root 'rclone-test-beyiday8luki'", Local "Local file system at /tmp/rclone113397365", Modify Window "876000h0m0s" === RUN TestCheckSizeOnly/1 === RUN TestCheckSizeOnly/2 === RUN TestCheckSizeOnly/3 === RUN TestCheckSizeOnly/4 === RUN TestCheckSizeOnly/5 === RUN TestCheckSizeOnly/6 === RUN TestCheckSizeOnly/7 --- PASS: TestCheckSizeOnly (8.22s) --- PASS: TestCheckSizeOnly/1 (0.37s) --- PASS: TestCheckSizeOnly/2 (0.34s) --- PASS: TestCheckSizeOnly/3 (0.27s) --- PASS: TestCheckSizeOnly/4 (0.32s) --- PASS: TestCheckSizeOnly/5 (0.31s) --- PASS: TestCheckSizeOnly/6 (0.34s) --- PASS: TestCheckSizeOnly/7 (0.47s) === RUN TestCheckEqualReaders --- PASS: TestCheckEqualReaders (0.01s) === RUN TestParseSumFile run.go:198: Remote "Cloudinary root 'rclone-test-beyiday8luki'", Local "Local file system at /tmp/rclone113397365", Modify Window "876000h0m0s" fstest.go:542: Sleeping for 1s for findObject eventual consistency: 1/5 (object not found) 2026/09/30 01:50:21 NOTICE: test.sum: improperly formatted checksum line 4 2026/09/30 01:50:21 NOTICE: test.sum: improperly formatted checksum line 5 2026/09/30 01:50:21 NOTICE: test.sum: improperly formatted checksum line 6 2026/09/30 01:50:21 NOTICE: test.sum: 2 warning(s) suppressed... 2026/09/30 01:50:22 NOTICE: test.sum: improperly formatted checksum line 4 2026/09/30 01:50:22 NOTICE: test.sum: improperly formatted checksum line 5 2026/09/30 01:50:22 NOTICE: test.sum: improperly formatted checksum line 6 2026/09/30 01:50:22 NOTICE: test.sum: 2 warning(s) suppressed... --- PASS: TestParseSumFile (3.93s) === RUN TestCheckSum run.go:198: Remote "Cloudinary root 'rclone-test-beyiday8luki'", Local "Local file system at /tmp/rclone113397365", Modify Window "876000h0m0s" 2026/09/30 01:50:23 DEBUG : Creating backend with remote "TestCloudinary:rclone-test-beyiday8luki/data" === RUN TestCheckSum/subtest1 === NAME TestCheckSum check_test.go:408: Error Trace: /home/rclone/go/src/github.com/rclone/rclone/fs/operations/check_test.go:408 /home/rclone/go/src/github.com/rclone/rclone/fs/operations/check_test.go:432 Error: Received unexpected error: cannot open sum file: object not found Test: TestCheckSum Messages: unexpected error in run 1 check_test.go:417: Error Trace: /home/rclone/go/src/github.com/rclone/rclone/fs/operations/check_test.go:417 /home/rclone/go/src/github.com/rclone/rclone/fs/operations/check_test.go:432 Error: "" does not contain "matching files" Test: TestCheckSum Messages: missing matching files in run 1 check_test.go:419: Error Trace: /home/rclone/go/src/github.com/rclone/rclone/fs/operations/check_test.go:419 /home/rclone/go/src/github.com/rclone/rclone/fs/operations/check_test.go:432 Error: Not equal: expected: 1 actual : 0 Test: TestCheckSum Messages: wrong number of checks in run 1 check_test.go:388: Error Trace: /home/rclone/go/src/github.com/rclone/rclone/fs/operations/check_test.go:388 /home/rclone/go/src/github.com/rclone/rclone/fs/operations/check_test.go:421 /home/rclone/go/src/github.com/rclone/rclone/fs/operations/check_test.go:432 Error: Not equal: expected: []string{"", "= banana"} actual : []string{} Diff: --- Expected +++ Actual @@ -1,4 +1,2 @@ -([]string) (len=2) { - (string) "", - (string) (len=8) "= banana" +([]string) { } Test: TestCheckSum Messages: wrong combined result in run 1 check_test.go:388: Error Trace: /home/rclone/go/src/github.com/rclone/rclone/fs/operations/check_test.go:388 /home/rclone/go/src/github.com/rclone/rclone/fs/operations/check_test.go:424 /home/rclone/go/src/github.com/rclone/rclone/fs/operations/check_test.go:432 Error: Not equal: expected: []string{"", "banana"} actual : []string{} Diff: --- Expected +++ Actual @@ -1,4 +1,2 @@ -([]string) (len=2) { - (string) "", - (string) (len=6) "banana" +([]string) { } Test: TestCheckSum Messages: wrong match result in run 1 === RUN TestCheckSum/subtest2 === NAME TestCheckSum check_test.go:413: Error Trace: /home/rclone/go/src/github.com/rclone/rclone/fs/operations/check_test.go:413 /home/rclone/go/src/github.com/rclone/rclone/fs/operations/check_test.go:432 Error: Not equal: expected: 1 actual : 0 Test: TestCheckSum Messages: wrong error count in run 2 check_test.go:417: Error Trace: /home/rclone/go/src/github.com/rclone/rclone/fs/operations/check_test.go:417 /home/rclone/go/src/github.com/rclone/rclone/fs/operations/check_test.go:432 Error: "" does not contain "matching files" Test: TestCheckSum Messages: missing matching files in run 2 check_test.go:419: Error Trace: /home/rclone/go/src/github.com/rclone/rclone/fs/operations/check_test.go:419 /home/rclone/go/src/github.com/rclone/rclone/fs/operations/check_test.go:432 Error: Not equal: expected: 2 actual : 0 Test: TestCheckSum Messages: wrong number of checks in run 2 check_test.go:388: Error Trace: /home/rclone/go/src/github.com/rclone/rclone/fs/operations/check_test.go:388 /home/rclone/go/src/github.com/rclone/rclone/fs/operations/check_test.go:421 /home/rclone/go/src/github.com/rclone/rclone/fs/operations/check_test.go:432 Error: Not equal: expected: []string{"", "- potato", "= banana"} actual : []string{} Diff: --- Expected +++ Actual @@ -1,5 +1,2 @@ -([]string) (len=3) { - (string) "", - (string) (len=8) "- potato", - (string) (len=8) "= banana" +([]string) { } Test: TestCheckSum Messages: wrong combined result in run 2 check_test.go:388: Error Trace: /home/rclone/go/src/github.com/rclone/rclone/fs/operations/check_test.go:388 /home/rclone/go/src/github.com/rclone/rclone/fs/operations/check_test.go:422 /home/rclone/go/src/github.com/rclone/rclone/fs/operations/check_test.go:432 Error: Not equal: expected: []string{"", "potato"} actual : []string{} Diff: --- Expected +++ Actual @@ -1,4 +1,2 @@ -([]string) (len=2) { - (string) "", - (string) (len=6) "potato" +([]string) { } Test: TestCheckSum Messages: wrong missingonsrc result in run 2 check_test.go:388: Error Trace: /home/rclone/go/src/github.com/rclone/rclone/fs/operations/check_test.go:388 /home/rclone/go/src/github.com/rclone/rclone/fs/operations/check_test.go:424 /home/rclone/go/src/github.com/rclone/rclone/fs/operations/check_test.go:432 Error: Not equal: expected: []string{"", "banana"} actual : []string{} Diff: --- Expected +++ Actual @@ -1,4 +1,2 @@ -([]string) (len=2) { - (string) "", - (string) (len=6) "banana" +([]string) { } Test: TestCheckSum Messages: wrong match result in run 2 === RUN TestCheckSum/subtest3 === RUN TestCheckSum/subtest4 === NAME TestCheckSum check_test.go:411: Error Trace: /home/rclone/go/src/github.com/rclone/rclone/fs/operations/check_test.go:411 /home/rclone/go/src/github.com/rclone/rclone/fs/operations/check_test.go:432 Error: An error is expected but got nil. Test: TestCheckSum Messages: no expected error in run 4 check_test.go:413: Error Trace: /home/rclone/go/src/github.com/rclone/rclone/fs/operations/check_test.go:413 /home/rclone/go/src/github.com/rclone/rclone/fs/operations/check_test.go:432 Error: Not equal: expected: 1 actual : 0 Test: TestCheckSum Messages: wrong error count in run 4 check_test.go:388: Error Trace: /home/rclone/go/src/github.com/rclone/rclone/fs/operations/check_test.go:388 /home/rclone/go/src/github.com/rclone/rclone/fs/operations/check_test.go:421 /home/rclone/go/src/github.com/rclone/rclone/fs/operations/check_test.go:432 Error: Not equal: expected: []string{"", "* banana", "= potato"} actual : []string{"", "= banana", "= potato"} Diff: --- Expected +++ Actual @@ -2,3 +2,3 @@ (string) "", - (string) (len=8) "* banana", + (string) (len=8) "= banana", (string) (len=8) "= potato" Test: TestCheckSum Messages: wrong combined result in run 4 check_test.go:388: Error Trace: /home/rclone/go/src/github.com/rclone/rclone/fs/operations/check_test.go:388 /home/rclone/go/src/github.com/rclone/rclone/fs/operations/check_test.go:424 /home/rclone/go/src/github.com/rclone/rclone/fs/operations/check_test.go:432 Error: Not equal: expected: []string{"", "potato"} actual : []string{"", "banana", "potato"} Diff: --- Expected +++ Actual @@ -1,3 +1,4 @@ -([]string) (len=2) { +([]string) (len=3) { (string) "", + (string) (len=6) "banana", (string) (len=6) "potato" Test: TestCheckSum Messages: wrong match result in run 4 check_test.go:388: Error Trace: /home/rclone/go/src/github.com/rclone/rclone/fs/operations/check_test.go:388 /home/rclone/go/src/github.com/rclone/rclone/fs/operations/check_test.go:425 /home/rclone/go/src/github.com/rclone/rclone/fs/operations/check_test.go:432 Error: Not equal: expected: []string{"", "banana"} actual : []string{} Diff: --- Expected +++ Actual @@ -1,4 +1,2 @@ -([]string) (len=2) { - (string) "", - (string) (len=6) "banana" +([]string) { } Test: TestCheckSum Messages: wrong differ result in run 4 === RUN TestCheckSum/subtest5 === RUN TestCheckSum/subtest6 === NAME TestCheckSum check_test.go:413: Error Trace: /home/rclone/go/src/github.com/rclone/rclone/fs/operations/check_test.go:413 /home/rclone/go/src/github.com/rclone/rclone/fs/operations/check_test.go:432 Error: Not equal: expected: 2 actual : 1 Test: TestCheckSum Messages: wrong error count in run 6 check_test.go:388: Error Trace: /home/rclone/go/src/github.com/rclone/rclone/fs/operations/check_test.go:388 /home/rclone/go/src/github.com/rclone/rclone/fs/operations/check_test.go:421 /home/rclone/go/src/github.com/rclone/rclone/fs/operations/check_test.go:432 Error: Not equal: expected: []string{"", "* potato", "+ orange", "= banana"} actual : []string{"", "+ orange", "= banana", "= potato"} Diff: --- Expected +++ Actual @@ -2,5 +2,5 @@ (string) "", - (string) (len=8) "* potato", (string) (len=8) "+ orange", - (string) (len=8) "= banana" + (string) (len=8) "= banana", + (string) (len=8) "= potato" } Test: TestCheckSum Messages: wrong combined result in run 6 check_test.go:388: Error Trace: /home/rclone/go/src/github.com/rclone/rclone/fs/operations/check_test.go:388 /home/rclone/go/src/github.com/rclone/rclone/fs/operations/check_test.go:424 /home/rclone/go/src/github.com/rclone/rclone/fs/operations/check_test.go:432 Error: Not equal: expected: []string{"", "banana"} actual : []string{"", "banana", "potato"} Diff: --- Expected +++ Actual @@ -1,4 +1,5 @@ -([]string) (len=2) { +([]string) (len=3) { (string) "", - (string) (len=6) "banana" + (string) (len=6) "banana", + (string) (len=6) "potato" } Test: TestCheckSum Messages: wrong match result in run 6 check_test.go:388: Error Trace: /home/rclone/go/src/github.com/rclone/rclone/fs/operations/check_test.go:388 /home/rclone/go/src/github.com/rclone/rclone/fs/operations/check_test.go:425 /home/rclone/go/src/github.com/rclone/rclone/fs/operations/check_test.go:432 Error: Not equal: expected: []string{"", "potato"} actual : []string{} Diff: --- Expected +++ Actual @@ -1,4 +1,2 @@ -([]string) (len=2) { - (string) "", - (string) (len=6) "potato" +([]string) { } Test: TestCheckSum Messages: wrong differ result in run 6 === RUN TestCheckSum/subtest7 --- FAIL: TestCheckSum (18.26s) --- PASS: TestCheckSum/subtest1 (0.26s) --- PASS: TestCheckSum/subtest2 (0.16s) --- PASS: TestCheckSum/subtest3 (0.73s) --- PASS: TestCheckSum/subtest4 (0.77s) --- PASS: TestCheckSum/subtest5 (0.61s) --- PASS: TestCheckSum/subtest6 (0.83s) --- PASS: TestCheckSum/subtest7 (0.73s) === RUN TestCheckSumDownload run.go:198: Remote "Cloudinary root 'rclone-test-beyiday8luki'", Local "Local file system at /tmp/rclone113397365", Modify Window "876000h0m0s" 2026/09/30 01:50:41 DEBUG : Creating backend with remote "TestCloudinary:rclone-test-beyiday8luki/data" === RUN TestCheckSumDownload/subtest1 === NAME TestCheckSumDownload check_test.go:408: Error Trace: /home/rclone/go/src/github.com/rclone/rclone/fs/operations/check_test.go:408 /home/rclone/go/src/github.com/rclone/rclone/fs/operations/check_test.go:432 Error: Received unexpected error: cannot open sum file: object not found Test: TestCheckSumDownload Messages: unexpected error in run 1 check_test.go:417: Error Trace: /home/rclone/go/src/github.com/rclone/rclone/fs/operations/check_test.go:417 /home/rclone/go/src/github.com/rclone/rclone/fs/operations/check_test.go:432 Error: "" does not contain "matching files" Test: TestCheckSumDownload Messages: missing matching files in run 1 check_test.go:419: Error Trace: /home/rclone/go/src/github.com/rclone/rclone/fs/operations/check_test.go:419 /home/rclone/go/src/github.com/rclone/rclone/fs/operations/check_test.go:432 Error: Not equal: expected: 1 actual : 0 Test: TestCheckSumDownload Messages: wrong number of checks in run 1 check_test.go:388: Error Trace: /home/rclone/go/src/github.com/rclone/rclone/fs/operations/check_test.go:388 /home/rclone/go/src/github.com/rclone/rclone/fs/operations/check_test.go:421 /home/rclone/go/src/github.com/rclone/rclone/fs/operations/check_test.go:432 Error: Not equal: expected: []string{"", "= banana"} actual : []string{} Diff: --- Expected +++ Actual @@ -1,4 +1,2 @@ -([]string) (len=2) { - (string) "", - (string) (len=8) "= banana" +([]string) { } Test: TestCheckSumDownload Messages: wrong combined result in run 1 check_test.go:388: Error Trace: /home/rclone/go/src/github.com/rclone/rclone/fs/operations/check_test.go:388 /home/rclone/go/src/github.com/rclone/rclone/fs/operations/check_test.go:424 /home/rclone/go/src/github.com/rclone/rclone/fs/operations/check_test.go:432 Error: Not equal: expected: []string{"", "banana"} actual : []string{} Diff: --- Expected +++ Actual @@ -1,4 +1,2 @@ -([]string) (len=2) { - (string) "", - (string) (len=6) "banana" +([]string) { } Test: TestCheckSumDownload Messages: wrong match result in run 1 === RUN TestCheckSumDownload/subtest2 === RUN TestCheckSumDownload/subtest3 === NAME TestCheckSumDownload check_test.go:408: Error Trace: /home/rclone/go/src/github.com/rclone/rclone/fs/operations/check_test.go:408 /home/rclone/go/src/github.com/rclone/rclone/fs/operations/check_test.go:432 Error: Received unexpected error: 1 differences found Test: TestCheckSumDownload Messages: unexpected error in run 3 check_test.go:413: Error Trace: /home/rclone/go/src/github.com/rclone/rclone/fs/operations/check_test.go:413 /home/rclone/go/src/github.com/rclone/rclone/fs/operations/check_test.go:432 Error: Not equal: expected: 0 actual : 1 Test: TestCheckSumDownload Messages: wrong error count in run 3 check_test.go:388: Error Trace: /home/rclone/go/src/github.com/rclone/rclone/fs/operations/check_test.go:388 /home/rclone/go/src/github.com/rclone/rclone/fs/operations/check_test.go:421 /home/rclone/go/src/github.com/rclone/rclone/fs/operations/check_test.go:432 Error: Not equal: expected: []string{"", "= banana", "= potato"} actual : []string{"", "- potato", "= banana"} Diff: --- Expected +++ Actual @@ -2,4 +2,4 @@ (string) "", - (string) (len=8) "= banana", - (string) (len=8) "= potato" + (string) (len=8) "- potato", + (string) (len=8) "= banana" } Test: TestCheckSumDownload Messages: wrong combined result in run 3 check_test.go:388: Error Trace: /home/rclone/go/src/github.com/rclone/rclone/fs/operations/check_test.go:388 /home/rclone/go/src/github.com/rclone/rclone/fs/operations/check_test.go:422 /home/rclone/go/src/github.com/rclone/rclone/fs/operations/check_test.go:432 Error: Not equal: expected: []string{} actual : []string{"", "potato"} Diff: --- Expected +++ Actual @@ -1,2 +1,4 @@ -([]string) { +([]string) (len=2) { + (string) "", + (string) (len=6) "potato" } Test: TestCheckSumDownload Messages: wrong missingonsrc result in run 3 check_test.go:388: Error Trace: /home/rclone/go/src/github.com/rclone/rclone/fs/operations/check_test.go:388 /home/rclone/go/src/github.com/rclone/rclone/fs/operations/check_test.go:424 /home/rclone/go/src/github.com/rclone/rclone/fs/operations/check_test.go:432 Error: Not equal: expected: []string{"", "banana", "potato"} actual : []string{"", "banana"} Diff: --- Expected +++ Actual @@ -1,5 +1,4 @@ -([]string) (len=3) { +([]string) (len=2) { (string) "", - (string) (len=6) "banana", - (string) (len=6) "potato" + (string) (len=6) "banana" } Test: TestCheckSumDownload Messages: wrong match result in run 3 === RUN TestCheckSumDownload/subtest4 === NAME TestCheckSumDownload check_test.go:388: Error Trace: /home/rclone/go/src/github.com/rclone/rclone/fs/operations/check_test.go:388 /home/rclone/go/src/github.com/rclone/rclone/fs/operations/check_test.go:421 /home/rclone/go/src/github.com/rclone/rclone/fs/operations/check_test.go:432 Error: Not equal: expected: []string{"", "* banana", "= potato"} actual : []string{"", "- potato", "= banana"} Diff: --- Expected +++ Actual @@ -2,4 +2,4 @@ (string) "", - (string) (len=8) "* banana", - (string) (len=8) "= potato" + (string) (len=8) "- potato", + (string) (len=8) "= banana" } Test: TestCheckSumDownload Messages: wrong combined result in run 4 check_test.go:388: Error Trace: /home/rclone/go/src/github.com/rclone/rclone/fs/operations/check_test.go:388 /home/rclone/go/src/github.com/rclone/rclone/fs/operations/check_test.go:422 /home/rclone/go/src/github.com/rclone/rclone/fs/operations/check_test.go:432 Error: Not equal: expected: []string{} actual : []string{"", "potato"} Diff: --- Expected +++ Actual @@ -1,2 +1,4 @@ -([]string) { +([]string) (len=2) { + (string) "", + (string) (len=6) "potato" } Test: TestCheckSumDownload Messages: wrong missingonsrc result in run 4 check_test.go:388: Error Trace: /home/rclone/go/src/github.com/rclone/rclone/fs/operations/check_test.go:388 /home/rclone/go/src/github.com/rclone/rclone/fs/operations/check_test.go:424 /home/rclone/go/src/github.com/rclone/rclone/fs/operations/check_test.go:432 Error: Not equal: expected: []string{"", "potato"} actual : []string{"", "banana"} Diff: --- Expected +++ Actual @@ -2,3 +2,3 @@ (string) "", - (string) (len=6) "potato" + (string) (len=6) "banana" } Test: TestCheckSumDownload Messages: wrong match result in run 4 check_test.go:388: Error Trace: /home/rclone/go/src/github.com/rclone/rclone/fs/operations/check_test.go:388 /home/rclone/go/src/github.com/rclone/rclone/fs/operations/check_test.go:425 /home/rclone/go/src/github.com/rclone/rclone/fs/operations/check_test.go:432 Error: Not equal: expected: []string{"", "banana"} actual : []string{} Diff: --- Expected +++ Actual @@ -1,4 +1,2 @@ -([]string) (len=2) { - (string) "", - (string) (len=6) "banana" +([]string) { } Test: TestCheckSumDownload Messages: wrong differ result in run 4 === RUN TestCheckSumDownload/subtest5 === RUN TestCheckSumDownload/subtest6 === RUN TestCheckSumDownload/subtest7 --- FAIL: TestCheckSumDownload (17.88s) --- PASS: TestCheckSumDownload/subtest1 (0.16s) --- PASS: TestCheckSumDownload/subtest2 (1.05s) --- PASS: TestCheckSumDownload/subtest3 (0.53s) --- PASS: TestCheckSumDownload/subtest4 (0.52s) --- PASS: TestCheckSumDownload/subtest5 (1.00s) --- PASS: TestCheckSumDownload/subtest6 (0.66s) --- PASS: TestCheckSumDownload/subtest7 (0.68s) === RUN TestCheckSumConcurrency 2026/09/30 01:50:59 DEBUG : file0: md5 = 022eb0c0085c731f335df970fafa7446 OK 2026/09/30 01:50:59 DEBUG : file2: md5 = a58f09ae3db8ae4b943fdbaace096072 OK 2026/09/30 01:50:59 DEBUG : file1: md5 = 17fbabbccbdea0e6be9eb64c8c6fea41 OK 2026/09/30 01:50:59 DEBUG : file3: md5 = e0639b17e0744aca9a3ba29c049e59ee OK 2026/09/30 01:50:59 NOTICE: Mock file system at checkSum: 0 differences found 2026/09/30 01:50:59 NOTICE: Mock file system at checkSum: 4 matching files --- PASS: TestCheckSumConcurrency (0.00s) === RUN TestCheckSumDownloadConcurrency 2026/09/30 01:50:59 DEBUG : file0: md5 = 022eb0c0085c731f335df970fafa7446 OK 2026/09/30 01:50:59 DEBUG : file1: md5 = 17fbabbccbdea0e6be9eb64c8c6fea41 OK 2026/09/30 01:50:59 DEBUG : file2: md5 = a58f09ae3db8ae4b943fdbaace096072 OK 2026/09/30 01:50:59 DEBUG : file3: md5 = e0639b17e0744aca9a3ba29c049e59ee OK 2026/09/30 01:50:59 NOTICE: Mock file system at checkSum: 0 differences found 2026/09/30 01:50:59 NOTICE: Mock file system at checkSum: 4 matching files --- PASS: TestCheckSumDownloadConcurrency (0.00s) === RUN TestApplyTransforms 2026/09/30 01:50:59 DEBUG : Creating backend with remote "TestCloudinary:rclone-test-jasafef2gedo" 2026/09/30 01:50:59 DEBUG : Using config file from "/home/rclone/.rclone.conf" 2026/09/30 01:50:59 DEBUG : Creating backend with remote "/tmp/rclone273383610" run.go:198: Remote "Cloudinary root 'rclone-test-jasafef2gedo'", Local "Local file system at /tmp/rclone273383610", Modify Window "876000h0m0s" upper checkfile vs. lower remote (without normalization) 2026/09/30 01:51:01 ERROR : hello, world!: sum not found 2026/09/30 01:51:01 ERROR : HELLO, WORLD!: file not in Cloudinary root 'rclone-test-jasafef2gedo' 2026/09/30 01:51:01 NOTICE: Cloudinary root 'rclone-test-jasafef2gedo': 1 files missing 2026/09/30 01:51:01 NOTICE: 1 hashes missing 2026/09/30 01:51:01 NOTICE: Cloudinary root 'rclone-test-jasafef2gedo': 1 differences found 2026/09/30 01:51:01 NOTICE: Cloudinary root 'rclone-test-jasafef2gedo': 2 errors while checking upper checkfile vs. lower remote (with normalization) 2026/09/30 01:51:02 DEBUG : hello, world!: md5 = 65a8e27d8879283831b664bd8b7f0ad4 OK 2026/09/30 01:51:02 NOTICE: Cloudinary root 'rclone-test-jasafef2gedo': 0 differences found 2026/09/30 01:51:02 NOTICE: Cloudinary root 'rclone-test-jasafef2gedo': 1 matching files 2026/09/30 01:51:02 DEBUG : Creating backend with remote "TestCloudinary:rclone-test-yonotox6fozi" 2026/09/30 01:51:02 DEBUG : Using config file from "/home/rclone/.rclone.conf" 2026/09/30 01:51:02 DEBUG : Creating backend with remote "/tmp/rclone2292292993" run.go:198: Remote "Cloudinary root 'rclone-test-yonotox6fozi'", Local "Local file system at /tmp/rclone2292292993", Modify Window "876000h0m0s" lower checkfile vs. upper remote (without normalization) 2026/09/30 01:51:04 ERROR : HELLO, WORLD!: sum not found 2026/09/30 01:51:04 ERROR : hello, world!: file not in Cloudinary root 'rclone-test-yonotox6fozi' 2026/09/30 01:51:04 NOTICE: Cloudinary root 'rclone-test-yonotox6fozi': 1 files missing 2026/09/30 01:51:04 NOTICE: 1 hashes missing 2026/09/30 01:51:04 NOTICE: Cloudinary root 'rclone-test-yonotox6fozi': 1 differences found 2026/09/30 01:51:04 NOTICE: Cloudinary root 'rclone-test-yonotox6fozi': 2 errors while checking lower checkfile vs. upper remote (with normalization) 2026/09/30 01:51:04 DEBUG : HELLO, WORLD!: md5 = 65a8e27d8879283831b664bd8b7f0ad4 OK 2026/09/30 01:51:04 NOTICE: Cloudinary root 'rclone-test-yonotox6fozi': 0 differences found 2026/09/30 01:51:04 NOTICE: Cloudinary root 'rclone-test-yonotox6fozi': 1 matching files 2026/09/30 01:51:04 DEBUG : Creating backend with remote "TestCloudinary:rclone-test-besidal1leda" 2026/09/30 01:51:04 DEBUG : Using config file from "/home/rclone/.rclone.conf" 2026/09/30 01:51:05 DEBUG : Creating backend with remote "/tmp/rclone1238861079" run.go:198: Remote "Cloudinary root 'rclone-test-besidal1leda'", Local "Local file system at /tmp/rclone1238861079", Modify Window "876000h0m0s" lower checkfile vs. upperlowermixed remote (without normalization) 2026/09/30 01:51:06 ERROR : HeLlO, wOrLd!: sum not found 2026/09/30 01:51:06 ERROR : hello, world!: file not in Cloudinary root 'rclone-test-besidal1leda' 2026/09/30 01:51:06 NOTICE: Cloudinary root 'rclone-test-besidal1leda': 1 files missing 2026/09/30 01:51:06 NOTICE: 1 hashes missing 2026/09/30 01:51:06 NOTICE: Cloudinary root 'rclone-test-besidal1leda': 1 differences found 2026/09/30 01:51:06 NOTICE: Cloudinary root 'rclone-test-besidal1leda': 2 errors while checking lower checkfile vs. upperlowermixed remote (with normalization) 2026/09/30 01:51:07 DEBUG : HeLlO, wOrLd!: md5 = 65a8e27d8879283831b664bd8b7f0ad4 OK 2026/09/30 01:51:07 NOTICE: Cloudinary root 'rclone-test-besidal1leda': 0 differences found 2026/09/30 01:51:07 NOTICE: Cloudinary root 'rclone-test-besidal1leda': 1 matching files 2026/09/30 01:51:07 DEBUG : Creating backend with remote "TestCloudinary:rclone-test-colonaf1cafi" 2026/09/30 01:51:07 DEBUG : Using config file from "/home/rclone/.rclone.conf" 2026/09/30 01:51:08 DEBUG : Creating backend with remote "/tmp/rclone3928022342" run.go:198: Remote "Cloudinary root 'rclone-test-colonaf1cafi'", Local "Local file system at /tmp/rclone3928022342", Modify Window "876000h0m0s" upperlowermixed checkfile vs. upper remote (without normalization) 2026/09/30 01:51:09 ERROR : HELLO, WORLD!: sum not found 2026/09/30 01:51:09 ERROR : HeLlO, wOrLd!: file not in Cloudinary root 'rclone-test-colonaf1cafi' 2026/09/30 01:51:09 NOTICE: Cloudinary root 'rclone-test-colonaf1cafi': 1 files missing 2026/09/30 01:51:09 NOTICE: 1 hashes missing 2026/09/30 01:51:09 NOTICE: Cloudinary root 'rclone-test-colonaf1cafi': 1 differences found 2026/09/30 01:51:09 NOTICE: Cloudinary root 'rclone-test-colonaf1cafi': 2 errors while checking upperlowermixed checkfile vs. upper remote (with normalization) 2026/09/30 01:51:10 DEBUG : HELLO, WORLD!: md5 = 65a8e27d8879283831b664bd8b7f0ad4 OK 2026/09/30 01:51:10 NOTICE: Cloudinary root 'rclone-test-colonaf1cafi': 0 differences found 2026/09/30 01:51:10 NOTICE: Cloudinary root 'rclone-test-colonaf1cafi': 1 matching files 2026/09/30 01:51:10 DEBUG : Creating backend with remote "TestCloudinary:rclone-test-qadepit1sizi" 2026/09/30 01:51:10 DEBUG : Using config file from "/home/rclone/.rclone.conf" 2026/09/30 01:51:10 DEBUG : Creating backend with remote "/tmp/rclone1122781503" run.go:198: Remote "Cloudinary root 'rclone-test-qadepit1sizi'", Local "Local file system at /tmp/rclone1122781503", Modify Window "876000h0m0s" NFD checkfile vs. NFC remote (without normalization) 2026/09/30 01:51:12 ERROR : 測試_Русский___ě_áñ: sum not found 2026/09/30 01:51:12 ERROR : 測試_Русский___ě_áñ: file not in Cloudinary root 'rclone-test-qadepit1sizi' 2026/09/30 01:51:12 NOTICE: Cloudinary root 'rclone-test-qadepit1sizi': 1 files missing 2026/09/30 01:51:12 NOTICE: 1 hashes missing 2026/09/30 01:51:12 NOTICE: Cloudinary root 'rclone-test-qadepit1sizi': 1 differences found 2026/09/30 01:51:12 NOTICE: Cloudinary root 'rclone-test-qadepit1sizi': 2 errors while checking NFD checkfile vs. NFC remote (with normalization) 2026/09/30 01:51:12 DEBUG : 測試_Русский___ě_áñ: md5 = 65a8e27d8879283831b664bd8b7f0ad4 OK 2026/09/30 01:51:12 NOTICE: Cloudinary root 'rclone-test-qadepit1sizi': 0 differences found 2026/09/30 01:51:12 NOTICE: Cloudinary root 'rclone-test-qadepit1sizi': 1 matching files 2026/09/30 01:51:12 DEBUG : Creating backend with remote "TestCloudinary:rclone-test-juqufap1biji" 2026/09/30 01:51:12 DEBUG : Using config file from "/home/rclone/.rclone.conf" 2026/09/30 01:51:13 DEBUG : Creating backend with remote "/tmp/rclone1859625080" run.go:198: Remote "Cloudinary root 'rclone-test-juqufap1biji'", Local "Local file system at /tmp/rclone1859625080", Modify Window "876000h0m0s" NFC checkfile vs. NFD remote (without normalization) 2026/09/30 01:51:14 ERROR : 測試_Русский___ě_áñ: sum not found 2026/09/30 01:51:14 ERROR : 測試_Русский___ě_áñ: file not in Cloudinary root 'rclone-test-juqufap1biji' 2026/09/30 01:51:14 NOTICE: Cloudinary root 'rclone-test-juqufap1biji': 1 files missing 2026/09/30 01:51:14 NOTICE: 1 hashes missing 2026/09/30 01:51:14 NOTICE: Cloudinary root 'rclone-test-juqufap1biji': 1 differences found 2026/09/30 01:51:14 NOTICE: Cloudinary root 'rclone-test-juqufap1biji': 2 errors while checking NFC checkfile vs. NFD remote (with normalization) 2026/09/30 01:51:15 DEBUG : 測試_Русский___ě_áñ: md5 = 65a8e27d8879283831b664bd8b7f0ad4 OK 2026/09/30 01:51:15 NOTICE: Cloudinary root 'rclone-test-juqufap1biji': 0 differences found 2026/09/30 01:51:15 NOTICE: Cloudinary root 'rclone-test-juqufap1biji': 1 matching files 2026/09/30 01:51:15 DEBUG : Creating backend with remote "TestCloudinary:rclone-test-petutut7bibo" 2026/09/30 01:51:15 DEBUG : Using config file from "/home/rclone/.rclone.conf" 2026/09/30 01:51:16 DEBUG : Creating backend with remote "/tmp/rclone4209563839" run.go:198: Remote "Cloudinary root 'rclone-test-petutut7bibo'", Local "Local file system at /tmp/rclone4209563839", Modify Window "876000h0m0s" NFDx2 checkfile vs. both remote (without normalization) 2026/09/30 01:51:17 ERROR : 測試_Русский___ě_áñ測試_Русский___ě_áñ: sum not found 2026/09/30 01:51:17 ERROR : 測試_Русский___ě_áñ測試_Русский___ě_áñ: file not in Cloudinary root 'rclone-test-petutut7bibo' 2026/09/30 01:51:17 NOTICE: Cloudinary root 'rclone-test-petutut7bibo': 1 files missing 2026/09/30 01:51:17 NOTICE: 1 hashes missing 2026/09/30 01:51:17 NOTICE: Cloudinary root 'rclone-test-petutut7bibo': 1 differences found 2026/09/30 01:51:17 NOTICE: Cloudinary root 'rclone-test-petutut7bibo': 2 errors while checking NFDx2 checkfile vs. both remote (with normalization) 2026/09/30 01:51:18 DEBUG : 測試_Русский___ě_áñ測試_Русский___ě_áñ: md5 = 65a8e27d8879283831b664bd8b7f0ad4 OK 2026/09/30 01:51:18 NOTICE: Cloudinary root 'rclone-test-petutut7bibo': 0 differences found 2026/09/30 01:51:18 NOTICE: Cloudinary root 'rclone-test-petutut7bibo': 1 matching files 2026/09/30 01:51:18 DEBUG : Creating backend with remote "TestCloudinary:rclone-test-salicoq2zezo" 2026/09/30 01:51:18 DEBUG : Using config file from "/home/rclone/.rclone.conf" 2026/09/30 01:51:18 DEBUG : Creating backend with remote "/tmp/rclone1856161851" run.go:198: Remote "Cloudinary root 'rclone-test-salicoq2zezo'", Local "Local file system at /tmp/rclone1856161851", Modify Window "876000h0m0s" NFCx2 checkfile vs. both remote (without normalization) 2026/09/30 01:51:20 ERROR : 測試_Русский___ě_áñ測試_Русский___ě_áñ: sum not found 2026/09/30 01:51:20 ERROR : 測試_Русский___ě_áñ測試_Русский___ě_áñ: file not in Cloudinary root 'rclone-test-salicoq2zezo' 2026/09/30 01:51:20 NOTICE: Cloudinary root 'rclone-test-salicoq2zezo': 1 files missing 2026/09/30 01:51:20 NOTICE: 1 hashes missing 2026/09/30 01:51:20 NOTICE: Cloudinary root 'rclone-test-salicoq2zezo': 1 differences found 2026/09/30 01:51:20 NOTICE: Cloudinary root 'rclone-test-salicoq2zezo': 2 errors while checking NFCx2 checkfile vs. both remote (with normalization) 2026/09/30 01:51:21 DEBUG : 測試_Русский___ě_áñ測試_Русский___ě_áñ: md5 = 65a8e27d8879283831b664bd8b7f0ad4 OK 2026/09/30 01:51:21 NOTICE: Cloudinary root 'rclone-test-salicoq2zezo': 0 differences found 2026/09/30 01:51:21 NOTICE: Cloudinary root 'rclone-test-salicoq2zezo': 1 matching files 2026/09/30 01:51:21 DEBUG : Creating backend with remote "TestCloudinary:rclone-test-kezudit4sopu" 2026/09/30 01:51:21 DEBUG : Using config file from "/home/rclone/.rclone.conf" 2026/09/30 01:51:21 DEBUG : Creating backend with remote "/tmp/rclone151652547" run.go:198: Remote "Cloudinary root 'rclone-test-kezudit4sopu'", Local "Local file system at /tmp/rclone151652547", Modify Window "876000h0m0s" both checkfile vs. NFDx2 remote (without normalization) 2026/09/30 01:51:23 ERROR : 測試_Русский___ě_áñ測試_Русский___ě_áñ: sum not found 2026/09/30 01:51:23 ERROR : 測試_Русский___ě_áñ測試_Русский___ě_áñ: file not in Cloudinary root 'rclone-test-kezudit4sopu' 2026/09/30 01:51:23 NOTICE: Cloudinary root 'rclone-test-kezudit4sopu': 1 files missing 2026/09/30 01:51:23 NOTICE: 1 hashes missing 2026/09/30 01:51:23 NOTICE: Cloudinary root 'rclone-test-kezudit4sopu': 1 differences found 2026/09/30 01:51:23 NOTICE: Cloudinary root 'rclone-test-kezudit4sopu': 2 errors while checking both checkfile vs. NFDx2 remote (with normalization) 2026/09/30 01:51:24 DEBUG : 測試_Русский___ě_áñ測試_Русский___ě_áñ: md5 = 65a8e27d8879283831b664bd8b7f0ad4 OK 2026/09/30 01:51:24 NOTICE: Cloudinary root 'rclone-test-kezudit4sopu': 0 differences found 2026/09/30 01:51:24 NOTICE: Cloudinary root 'rclone-test-kezudit4sopu': 1 matching files 2026/09/30 01:51:24 DEBUG : Creating backend with remote "TestCloudinary:rclone-test-vuniqef6weta" 2026/09/30 01:51:24 DEBUG : Using config file from "/home/rclone/.rclone.conf" 2026/09/30 01:51:24 DEBUG : Creating backend with remote "/tmp/rclone2272021064" run.go:198: Remote "Cloudinary root 'rclone-test-vuniqef6weta'", Local "Local file system at /tmp/rclone2272021064", Modify Window "876000h0m0s" both checkfile vs. NFCx2 remote (without normalization) 2026/09/30 01:51:26 ERROR : 測試_Русский___ě_áñ測試_Русский___ě_áñ: sum not found 2026/09/30 01:51:26 ERROR : 測試_Русский___ě_áñ測試_Русский___ě_áñ: file not in Cloudinary root 'rclone-test-vuniqef6weta' 2026/09/30 01:51:26 NOTICE: Cloudinary root 'rclone-test-vuniqef6weta': 1 files missing 2026/09/30 01:51:26 NOTICE: 1 hashes missing 2026/09/30 01:51:26 NOTICE: Cloudinary root 'rclone-test-vuniqef6weta': 1 differences found 2026/09/30 01:51:26 NOTICE: Cloudinary root 'rclone-test-vuniqef6weta': 2 errors while checking both checkfile vs. NFCx2 remote (with normalization) 2026/09/30 01:51:26 DEBUG : 測試_Русский___ě_áñ測試_Русский___ě_áñ: md5 = 65a8e27d8879283831b664bd8b7f0ad4 OK 2026/09/30 01:51:26 NOTICE: Cloudinary root 'rclone-test-vuniqef6weta': 0 differences found 2026/09/30 01:51:26 NOTICE: Cloudinary root 'rclone-test-vuniqef6weta': 1 matching files 2026/09/30 01:51:27 DEBUG : Cloudinary root 'rclone-test-vuniqef6weta': Purge object "測試_Русский___ě_áñ測試_Русский___ě_áñ" 2026/09/30 01:51:27 DEBUG : Cloudinary root 'rclone-test-vuniqef6weta': Purge dir "" 2026/09/30 01:51:28 DEBUG : Cloudinary root 'rclone-test-kezudit4sopu': Purge object "測試_Русский___ě_áñ測試_Русский___ě_áñ" 2026/09/30 01:51:28 DEBUG : Cloudinary root 'rclone-test-kezudit4sopu': Purge dir "" 2026/09/30 01:51:29 DEBUG : Cloudinary root 'rclone-test-salicoq2zezo': Purge object "測試_Русский___ě_áñ測試_Русский___ě_áñ" 2026/09/30 01:51:29 DEBUG : Cloudinary root 'rclone-test-salicoq2zezo': Purge dir "" 2026/09/30 01:51:29 DEBUG : Cloudinary root 'rclone-test-petutut7bibo': Purge object "測試_Русский___ě_áñ測試_Русский___ě_áñ" 2026/09/30 01:51:30 DEBUG : Cloudinary root 'rclone-test-petutut7bibo': Purge dir "" 2026/09/30 01:51:30 DEBUG : Cloudinary root 'rclone-test-juqufap1biji': Purge object "測試_Русский___ě_áñ" 2026/09/30 01:51:31 DEBUG : Cloudinary root 'rclone-test-juqufap1biji': Purge dir "" 2026/09/30 01:51:31 DEBUG : Cloudinary root 'rclone-test-qadepit1sizi': Purge object "測試_Русский___ě_áñ" 2026/09/30 01:51:32 DEBUG : Cloudinary root 'rclone-test-qadepit1sizi': Purge dir "" 2026/09/30 01:51:32 DEBUG : Cloudinary root 'rclone-test-colonaf1cafi': Purge object "HELLO, WORLD!" 2026/09/30 01:51:33 DEBUG : Cloudinary root 'rclone-test-colonaf1cafi': Purge dir "" 2026/09/30 01:51:34 DEBUG : Cloudinary root 'rclone-test-besidal1leda': Purge object "HeLlO, wOrLd!" 2026/09/30 01:51:34 DEBUG : Cloudinary root 'rclone-test-besidal1leda': Purge dir "" 2026/09/30 01:51:35 DEBUG : Cloudinary root 'rclone-test-yonotox6fozi': Purge object "HELLO, WORLD!" 2026/09/30 01:51:35 DEBUG : Cloudinary root 'rclone-test-yonotox6fozi': Purge dir "" 2026/09/30 01:51:36 DEBUG : Cloudinary root 'rclone-test-jasafef2gedo': Purge object "hello, world!" 2026/09/30 01:51:36 DEBUG : Cloudinary root 'rclone-test-jasafef2gedo': Purge dir "" --- PASS: TestApplyTransforms (37.40s) === RUN TestTruncateString --- PASS: TestTruncateString (0.00s) === RUN TestCopyFile run.go:198: Remote "Cloudinary root 'rclone-test-beyiday8luki'", Local "Local file system at /tmp/rclone113397365", Modify Window "876000h0m0s" 2026/09/30 01:51:36 DEBUG : file1: Need to transfer - File not found at Destination 2026/09/30 01:51:37 DEBUG : sub/file2: size = 14 OK 2026/09/30 01:51:37 DEBUG : file1: md5 = 0ef726ce9b1a7692357ff70dd321d595 OK 2026/09/30 01:51:37 INFO : file1: Copied (new) to: sub/file2 2026/09/30 01:51:38 DEBUG : file1: Need to transfer - File not found at Destination 2026/09/30 01:51:38 DEBUG : sub/file2: size = 14 OK 2026/09/30 01:51:38 DEBUG : file1: md5 = 0ef726ce9b1a7692357ff70dd321d595 OK 2026/09/30 01:51:38 INFO : file1: Copied (new) to: sub/file2 2026/09/30 01:51:39 DEBUG : Cloudinary root 'rclone-test-beyiday8luki': don't need to copy/move sub/file2, it is already at target location --- PASS: TestCopyFile (4.85s) === RUN TestCopyFileImmutable run.go:198: Remote "Cloudinary root 'rclone-test-beyiday8luki'", Local "Local file system at /tmp/rclone113397365", Modify Window "876000h0m0s" 2026/09/30 01:51:41 DEBUG : existing: Need to transfer - File not found at Destination 2026/09/30 01:51:42 DEBUG : existing: size = 6 OK 2026/09/30 01:51:42 DEBUG : existing: md5 = 8ee2027983915ec78acc45027d874316 OK 2026/09/30 01:51:42 INFO : existing: Copied (new) 2026/09/30 01:51:43 DEBUG : existing: Need to transfer - File not found at Destination 2026/09/30 01:51:43 DEBUG : existing: size = 6 OK 2026/09/30 01:51:43 DEBUG : existing: md5 = 8ee2027983915ec78acc45027d874316 OK 2026/09/30 01:51:43 INFO : existing: Copied (new) 2026/09/30 01:51:43 DEBUG : existing: Need to transfer - File not found at Destination 2026/09/30 01:51:44 DEBUG : existing: size = 8 OK 2026/09/30 01:51:44 DEBUG : existing: md5 = 53f8d64113036808686b056cc0b0f649 OK 2026/09/30 01:51:44 INFO : existing: Copied (new) copy_test.go:153: Error Trace: /home/rclone/go/src/github.com/rclone/rclone/fs/operations/copy_test.go:153 Error: Expected error with "immutable file modified" in chain but got nil. Test: TestCopyFileImmutable fstest.go:299: Sleeping for 1s for list eventual consistency: 1/5 fstest.go:299: Sleeping for 2s for list eventual consistency: 2/5 fstest.go:299: Sleeping for 4s for list eventual consistency: 3/5 fstest.go:299: Sleeping for 8s for list eventual consistency: 4/5 fstest.go:299: Sleeping for 16s for list eventual consistency: 5/5 fstest.go:306: Error Trace: /home/rclone/go/src/github.com/rclone/rclone/fstest/fstest.go:306 /home/rclone/go/src/github.com/rclone/rclone/fstest/fstest.go:339 /home/rclone/go/src/github.com/rclone/rclone/fstest/fstest.go:351 /home/rclone/go/src/github.com/rclone/rclone/fstest/run.go:358 /home/rclone/go/src/github.com/rclone/rclone/fs/operations/copy_test.go:155 Error: Should be true Test: TestCopyFileImmutable Messages: listing wrong, want existing (6) got existing (8) fstest.go:151: Error Trace: /home/rclone/go/src/github.com/rclone/rclone/fstest/fstest.go:151 /home/rclone/go/src/github.com/rclone/rclone/fstest/fstest.go:196 /home/rclone/go/src/github.com/rclone/rclone/fstest/fstest.go:309 /home/rclone/go/src/github.com/rclone/rclone/fstest/fstest.go:339 /home/rclone/go/src/github.com/rclone/rclone/fstest/fstest.go:351 /home/rclone/go/src/github.com/rclone/rclone/fstest/run.go:358 /home/rclone/go/src/github.com/rclone/rclone/fs/operations/copy_test.go:155 Error: Not equal: expected: 6 actual : 8 Test: TestCopyFileImmutable Messages: existing: size incorrect file=6 vs obj=8 fstest.go:299: Sleeping for 1s for list eventual consistency: 1/5 fstest.go:299: Sleeping for 2s for list eventual consistency: 2/5 fstest.go:299: Sleeping for 4s for list eventual consistency: 3/5 fstest.go:299: Sleeping for 8s for list eventual consistency: 4/5 fstest.go:299: Sleeping for 16s for list eventual consistency: 5/5 fstest.go:306: Error Trace: /home/rclone/go/src/github.com/rclone/rclone/fstest/fstest.go:306 /home/rclone/go/src/github.com/rclone/rclone/fstest/fstest.go:339 /home/rclone/go/src/github.com/rclone/rclone/fstest/fstest.go:351 /home/rclone/go/src/github.com/rclone/rclone/fstest/run.go:358 /home/rclone/go/src/github.com/rclone/rclone/fs/operations/copy_test.go:160 Error: Should be true Test: TestCopyFileImmutable Messages: listing wrong, want existing (6) got existing (8) fstest.go:151: Error Trace: /home/rclone/go/src/github.com/rclone/rclone/fstest/fstest.go:151 /home/rclone/go/src/github.com/rclone/rclone/fstest/fstest.go:196 /home/rclone/go/src/github.com/rclone/rclone/fstest/fstest.go:309 /home/rclone/go/src/github.com/rclone/rclone/fstest/fstest.go:339 /home/rclone/go/src/github.com/rclone/rclone/fstest/fstest.go:351 /home/rclone/go/src/github.com/rclone/rclone/fstest/run.go:358 /home/rclone/go/src/github.com/rclone/rclone/fs/operations/copy_test.go:160 Error: Not equal: expected: 6 actual : 8 Test: TestCopyFileImmutable Messages: existing: size incorrect file=6 vs obj=8 --- FAIL: TestCopyFileImmutable (69.28s) === RUN TestCopyLongFile run.go:198: Remote "Cloudinary root 'rclone-test-beyiday8luki'", Local "Local file system at /tmp/rclone113397365", Modify Window "876000h0m0s" copy_test.go:188: Test only runs on local --- SKIP: TestCopyLongFile (0.53s) === RUN TestCopyFileBackupDir run.go:198: Remote "Cloudinary root 'rclone-test-beyiday8luki'", Local "Local file system at /tmp/rclone113397365", Modify Window "876000h0m0s" copy_test.go:208: Skipping test as remote does not support server-side move or copy --- SKIP: TestCopyFileBackupDir (0.64s) === RUN TestCopyFileCompareDest run.go:198: Remote "Cloudinary root 'rclone-test-beyiday8luki'", Local "Local file system at /tmp/rclone113397365", Modify Window "876000h0m0s" 2026/09/30 01:52:52 DEBUG : Creating backend with remote "TestCloudinary:rclone-test-beyiday8luki/dst" 2026/09/30 01:52:52 DEBUG : Creating backend with remote "TestCloudinary:rclone-test-beyiday8luki/CompareDest" 2026/09/30 01:52:53 DEBUG : one: Need to transfer - File not found at Destination 2026/09/30 01:52:53 DEBUG : one: size = 3 OK 2026/09/30 01:52:53 DEBUG : one: md5 = f97c5d29941bfb1b2fdab0874906ab82 OK 2026/09/30 01:52:53 INFO : one: Copied (new) 2026/09/30 01:52:55 DEBUG : one: Need to transfer - File not found at Destination 2026/09/30 01:52:56 DEBUG : one: size = 5 OK 2026/09/30 01:52:56 DEBUG : one: md5 = 07912d142f5d63ee918b34796b5a2432 OK 2026/09/30 01:52:56 INFO : one: Copied (new) 2026/09/30 01:52:58 DEBUG : one: size = 5 OK 2026/09/30 01:52:58 DEBUG : one: Sizes identical 2026/09/30 01:52:58 DEBUG : one: Unchanged skipping 2026/09/30 01:53:00 DEBUG : two: Need to transfer - File not found at Destination 2026/09/30 01:53:01 DEBUG : two: size = 3 OK 2026/09/30 01:53:01 DEBUG : two: md5 = b8a9f715dbb64fd5c56e7783c6820a61 OK 2026/09/30 01:53:01 INFO : two: Copied (new) fstest.go:299: Sleeping for 1s for list eventual consistency: 1/5 fstest.go:299: Sleeping for 2s for list eventual consistency: 2/5 fstest.go:299: Sleeping for 4s for list eventual consistency: 3/5 fstest.go:299: Sleeping for 8s for list eventual consistency: 4/5 fstest.go:299: Sleeping for 16s for list eventual consistency: 5/5 fstest.go:306: Error Trace: /home/rclone/go/src/github.com/rclone/rclone/fstest/fstest.go:306 /home/rclone/go/src/github.com/rclone/rclone/fstest/fstest.go:339 /home/rclone/go/src/github.com/rclone/rclone/fstest/fstest.go:351 /home/rclone/go/src/github.com/rclone/rclone/fstest/run.go:358 /home/rclone/go/src/github.com/rclone/rclone/fs/operations/copy_test.go:282 Error: Should be true Test: TestCopyFileCompareDest Messages: listing wrong, want CompareDest/one (5), CompareDest/two (3), dst/one (3) got CompareDest/one (5), CompareDest/two (3), dst/one (3), dst/two (3) fstest.go:192: Error Trace: /home/rclone/go/src/github.com/rclone/rclone/fstest/fstest.go:192 /home/rclone/go/src/github.com/rclone/rclone/fstest/fstest.go:309 /home/rclone/go/src/github.com/rclone/rclone/fstest/fstest.go:339 /home/rclone/go/src/github.com/rclone/rclone/fstest/fstest.go:351 /home/rclone/go/src/github.com/rclone/rclone/fstest/run.go:358 /home/rclone/go/src/github.com/rclone/rclone/fs/operations/copy_test.go:282 /usr/local/go/src/runtime/asm_amd64.s:1264 Error: Should be true Test: TestCopyFileCompareDest Messages: Unexpected file "dst/two" 2026/09/30 01:53:36 DEBUG : two: size = 3 OK 2026/09/30 01:53:36 DEBUG : two: Sizes identical 2026/09/30 01:53:36 DEBUG : two: Unchanged skipping fstest.go:299: Sleeping for 1s for list eventual consistency: 1/5 fstest.go:299: Sleeping for 2s for list eventual consistency: 2/5 fstest.go:299: Sleeping for 4s for list eventual consistency: 3/5 fstest.go:299: Sleeping for 8s for list eventual consistency: 4/5 fstest.go:299: Sleeping for 16s for list eventual consistency: 5/5 fstest.go:306: Error Trace: /home/rclone/go/src/github.com/rclone/rclone/fstest/fstest.go:306 /home/rclone/go/src/github.com/rclone/rclone/fstest/fstest.go:339 /home/rclone/go/src/github.com/rclone/rclone/fstest/fstest.go:351 /home/rclone/go/src/github.com/rclone/rclone/fstest/run.go:358 /home/rclone/go/src/github.com/rclone/rclone/fs/operations/copy_test.go:288 Error: Should be true Test: TestCopyFileCompareDest Messages: listing wrong, want CompareDest/one (5), CompareDest/two (3), dst/one (3) got CompareDest/one (5), CompareDest/two (3), dst/one (3), dst/two (3) fstest.go:192: Error Trace: /home/rclone/go/src/github.com/rclone/rclone/fstest/fstest.go:192 /home/rclone/go/src/github.com/rclone/rclone/fstest/fstest.go:309 /home/rclone/go/src/github.com/rclone/rclone/fstest/fstest.go:339 /home/rclone/go/src/github.com/rclone/rclone/fstest/fstest.go:351 /home/rclone/go/src/github.com/rclone/rclone/fstest/run.go:358 /home/rclone/go/src/github.com/rclone/rclone/fs/operations/copy_test.go:288 /usr/local/go/src/runtime/asm_amd64.s:1264 Error: Should be true Test: TestCopyFileCompareDest Messages: Unexpected file "dst/two" fstest.go:299: Sleeping for 1s for list eventual consistency: 1/5 fstest.go:299: Sleeping for 2s for list eventual consistency: 2/5 fstest.go:299: Sleeping for 4s for list eventual consistency: 3/5 fstest.go:299: Sleeping for 8s for list eventual consistency: 4/5 fstest.go:299: Sleeping for 16s for list eventual consistency: 5/5 fstest.go:306: Error Trace: /home/rclone/go/src/github.com/rclone/rclone/fstest/fstest.go:306 /home/rclone/go/src/github.com/rclone/rclone/fstest/fstest.go:339 /home/rclone/go/src/github.com/rclone/rclone/fstest/fstest.go:351 /home/rclone/go/src/github.com/rclone/rclone/fstest/run.go:358 /home/rclone/go/src/github.com/rclone/rclone/fs/operations/copy_test.go:292 Error: Should be true Test: TestCopyFileCompareDest Messages: listing wrong, want CompareDest/one (5), CompareDest/two (3), dst/one (3) got CompareDest/one (5), CompareDest/two (3), dst/one (3), dst/two (3) fstest.go:192: Error Trace: /home/rclone/go/src/github.com/rclone/rclone/fstest/fstest.go:192 /home/rclone/go/src/github.com/rclone/rclone/fstest/fstest.go:309 /home/rclone/go/src/github.com/rclone/rclone/fstest/fstest.go:339 /home/rclone/go/src/github.com/rclone/rclone/fstest/fstest.go:351 /home/rclone/go/src/github.com/rclone/rclone/fstest/run.go:358 /home/rclone/go/src/github.com/rclone/rclone/fs/operations/copy_test.go:292 /usr/local/go/src/runtime/asm_amd64.s:1264 Error: Should be true Test: TestCopyFileCompareDest Messages: Unexpected file "dst/two" 2026/09/30 01:54:45 DEBUG : two: size = 5 (Local file system at /tmp/rclone113397365) 2026/09/30 01:54:45 DEBUG : two: size = 3 (Cloudinary root 'rclone-test-beyiday8luki/dst') 2026/09/30 01:54:45 DEBUG : two: Sizes differ 2026/09/30 01:54:45 DEBUG : two: size = 5 (Local file system at /tmp/rclone113397365) 2026/09/30 01:54:45 DEBUG : two: size = 3 (Cloudinary root 'rclone-test-beyiday8luki/CompareDest') 2026/09/30 01:54:45 DEBUG : two: Sizes differ 2026/09/30 01:54:46 DEBUG : two: size = 5 OK 2026/09/30 01:54:46 DEBUG : two: md5 = 2379e4ce8c3380e996ab0509f17069ad OK 2026/09/30 01:54:46 INFO : two: Copied (replaced existing) --- FAIL: TestCopyFileCompareDest (118.79s) === RUN TestCopyFileCopyDestImmutable run.go:198: Remote "Cloudinary root 'rclone-test-beyiday8luki'", Local "Local file system at /tmp/rclone113397365", Modify Window "876000h0m0s" copy_test.go:312: Skipping test as remote does not support server-side copy --- SKIP: TestCopyFileCopyDestImmutable (0.54s) === RUN TestCopyFileCopyDest run.go:198: Remote "Cloudinary root 'rclone-test-beyiday8luki'", Local "Local file system at /tmp/rclone113397365", Modify Window "876000h0m0s" copy_test.go:340: Skipping test as remote does not support server-side copy --- SKIP: TestCopyFileCopyDest (0.52s) === RUN TestCopyInplace run.go:198: Remote "Cloudinary root 'rclone-test-beyiday8luki'", Local "Local file system at /tmp/rclone113397365", Modify Window "876000h0m0s" copy_test.go:434: Partial uploads not supported --- SKIP: TestCopyInplace (0.55s) === RUN TestCopyLongFileName run.go:198: Remote "Cloudinary root 'rclone-test-beyiday8luki'", Local "Local file system at /tmp/rclone113397365", Modify Window "876000h0m0s" copy_test.go:467: Partial uploads not supported --- SKIP: TestCopyLongFileName (0.60s) === RUN TestCopyLongFileNameCollision run.go:198: Remote "Cloudinary root 'rclone-test-beyiday8luki'", Local "Local file system at /tmp/rclone113397365", Modify Window "876000h0m0s" copy_test.go:500: Partial uploads not supported --- SKIP: TestCopyLongFileNameCollision (0.54s) === RUN TestCopyFileMaxTransfer run.go:198: Remote "Cloudinary root 'rclone-test-beyiday8luki'", Local "Local file system at /tmp/rclone113397365", Modify Window "876000h0m0s" 2026/09/30 01:54:53 DEBUG : TestCopyFileMaxTransfer/file1: Need to transfer - File not found at Destination 2026/09/30 01:54:54 DEBUG : TestCopyFileMaxTransfer/file1: size = 14 OK 2026/09/30 01:54:54 DEBUG : TestCopyFileMaxTransfer/file1: md5 = 0ef726ce9b1a7692357ff70dd321d595 OK 2026/09/30 01:54:54 INFO : TestCopyFileMaxTransfer/file1: Copied (new) 2026/09/30 01:54:55 DEBUG : TestCopyFileMaxTransfer/file2: Need to transfer - File not found at Destination 2026/09/30 01:54:55 NOTICE: io: read/write on closed pipe 2026/09/30 01:54:55 ERROR : TestCopyFileMaxTransfer/file2: Failed to copy: failed to upload to Cloudinary: Post "https://api.cloudinary.com/v1_1/durakvfdu/auto/upload": max transfer limit reached as set by --max-transfer 2026/09/30 01:54:56 DEBUG : TestCopyFileMaxTransfer/file3: Need to transfer - File not found at Destination 2026/09/30 01:54:57 DEBUG : TestCopyFileMaxTransfer/file4: Need to transfer - File not found at Destination 2026/09/30 01:54:57 DEBUG : TestCopyFileMaxTransfer/file4: size = 2062 OK 2026/09/30 01:54:57 DEBUG : TestCopyFileMaxTransfer/file4: md5 = 7db3fdd1088d9cd10e52ad91e6e819b6 OK 2026/09/30 01:54:57 INFO : TestCopyFileMaxTransfer/file4: Copied (new) --- PASS: TestCopyFileMaxTransfer (6.72s) === RUN TestDeduplicateInteractive run.go:198: Remote "Cloudinary root 'rclone-test-beyiday8luki'", Local "Local file system at /tmp/rclone113397365", Modify Window "876000h0m0s" dedupe_test.go:25: Can't test deduplicate - no duplicate files possible --- SKIP: TestDeduplicateInteractive (0.61s) === RUN TestDeduplicateSkip run.go:198: Remote "Cloudinary root 'rclone-test-beyiday8luki'", Local "Local file system at /tmp/rclone113397365", Modify Window "876000h0m0s" dedupe_test.go:25: Can't test deduplicate - no duplicate files possible --- SKIP: TestDeduplicateSkip (0.54s) === RUN TestDeduplicateSizeOnly run.go:198: Remote "Cloudinary root 'rclone-test-beyiday8luki'", Local "Local file system at /tmp/rclone113397365", Modify Window "876000h0m0s" dedupe_test.go:25: Can't test deduplicate - no duplicate files possible --- SKIP: TestDeduplicateSizeOnly (0.59s) === RUN TestDeduplicateFirst run.go:198: Remote "Cloudinary root 'rclone-test-beyiday8luki'", Local "Local file system at /tmp/rclone113397365", Modify Window "876000h0m0s" dedupe_test.go:25: Can't test deduplicate - no duplicate files possible --- SKIP: TestDeduplicateFirst (0.64s) === RUN TestDeduplicateNewest run.go:198: Remote "Cloudinary root 'rclone-test-beyiday8luki'", Local "Local file system at /tmp/rclone113397365", Modify Window "876000h0m0s" dedupe_test.go:25: Can't test deduplicate - no duplicate files possible --- SKIP: TestDeduplicateNewest (0.58s) === RUN TestDeduplicateNewestByHash run.go:198: Remote "Cloudinary root 'rclone-test-beyiday8luki'", Local "Local file system at /tmp/rclone113397365", Modify Window "876000h0m0s" dedupe_test.go:43: Can't run this test without modtimes --- SKIP: TestDeduplicateNewestByHash (0.62s) === RUN TestDeduplicateOldest run.go:198: Remote "Cloudinary root 'rclone-test-beyiday8luki'", Local "Local file system at /tmp/rclone113397365", Modify Window "876000h0m0s" dedupe_test.go:25: Can't test deduplicate - no duplicate files possible --- SKIP: TestDeduplicateOldest (0.53s) === RUN TestDeduplicateLargest run.go:198: Remote "Cloudinary root 'rclone-test-beyiday8luki'", Local "Local file system at /tmp/rclone113397365", Modify Window "876000h0m0s" dedupe_test.go:25: Can't test deduplicate - no duplicate files possible --- SKIP: TestDeduplicateLargest (0.58s) === RUN TestDeduplicateSmallest run.go:198: Remote "Cloudinary root 'rclone-test-beyiday8luki'", Local "Local file system at /tmp/rclone113397365", Modify Window "876000h0m0s" dedupe_test.go:25: Can't test deduplicate - no duplicate files possible --- SKIP: TestDeduplicateSmallest (0.54s) === RUN TestDeduplicateRename run.go:198: Remote "Cloudinary root 'rclone-test-beyiday8luki'", Local "Local file system at /tmp/rclone113397365", Modify Window "876000h0m0s" dedupe_test.go:25: Can't test deduplicate - no duplicate files possible --- SKIP: TestDeduplicateRename (0.67s) === RUN TestDeduplicateRenameManyExisting run.go:198: Remote "Cloudinary root 'rclone-test-beyiday8luki'", Local "Local file system at /tmp/rclone113397365", Modify Window "876000h0m0s" dedupe_test.go:25: Can't test deduplicate - no duplicate files possible --- SKIP: TestDeduplicateRenameManyExisting (0.53s) === RUN TestMergeDirs run.go:198: Remote "Cloudinary root 'rclone-test-beyiday8luki'", Local "Local file system at /tmp/rclone113397365", Modify Window "876000h0m0s" dedupe_test.go:294: Can't merge directories --- SKIP: TestMergeDirs (0.53s) === RUN TestIndex run.go:198: Remote "Cloudinary root 'rclone-test-beyiday8luki'", Local "Local file system at /tmp/rclone113397365", Modify Window "876000h0m0s" 2026/09/30 01:55:10 DEBUG : caddy.json: size = 259 OK 2026/09/30 01:55:10 DEBUG : caddy.json: md5 = dc6a0a75ac6ca4c5c4d67ce9cc07c967 OK 2026/09/30 01:55:10 INFO : caddy.json: Copied (new) 2026/09/30 01:55:10 DEBUG : index.json: size = 213 OK 2026/09/30 01:55:10 DEBUG : index.json: md5 = 6d9005410c2c0151ea1f793aac08f065 OK 2026/09/30 01:55:10 INFO : index.json: Copied (new) 2026/09/30 01:55:10 DEBUG : sub/deep/index.html: size = 12085 OK 2026/09/30 01:55:10 DEBUG : sub/deep/index.html: md5 = f9b704c93e42e798f2cf5a233f5e351e OK 2026/09/30 01:55:10 INFO : sub/deep/index.html: Copied (new) 2026/09/30 01:55:11 DEBUG : index.html: size = 12143 OK 2026/09/30 01:55:11 DEBUG : index.html: md5 = edef1f0d40d281287ee0893f5b8e0374 OK 2026/09/30 01:55:11 INFO : index.html: Copied (new) 2026/09/30 01:55:11 DEBUG : sub/deep/index.json: size = 119 OK 2026/09/30 01:55:11 DEBUG : sub/deep/index.json: md5 = 7e871c8a7baa48027dd34c724a216943 OK 2026/09/30 01:55:11 INFO : sub/deep/index.json: Copied (new) 2026/09/30 01:55:11 DEBUG : sub/deep/caddy.json: size = 131 OK 2026/09/30 01:55:11 DEBUG : sub/deep/caddy.json: md5 = d85deaaa7d227b303a0247bb5c1690a8 OK 2026/09/30 01:55:11 INFO : sub/deep/caddy.json: Copied (new) 2026/09/30 01:55:11 DEBUG : sub/index.html: size = 12302 OK 2026/09/30 01:55:11 DEBUG : sub/index.html: md5 = 7be1a83356895216299f37e5e7e582ca OK 2026/09/30 01:55:11 INFO : sub/index.html: Copied (new) 2026/09/30 01:55:11 DEBUG : sub/index.json: size = 215 OK 2026/09/30 01:55:11 DEBUG : sub/index.json: md5 = a2268aa29c5a00e765e4612e571decea OK 2026/09/30 01:55:11 INFO : sub/index.json: Copied (new) 2026/09/30 01:55:11 DEBUG : sub/caddy.json: size = 261 OK 2026/09/30 01:55:11 DEBUG : sub/caddy.json: md5 = 75c950ebaddffd546d2416be7d12398e OK 2026/09/30 01:55:11 INFO : sub/caddy.json: Copied (new) index_test.go:62: Error Trace: /home/rclone/go/src/github.com/rclone/rclone/fs/operations/index_test.go:62 /home/rclone/go/src/github.com/rclone/rclone/fs/operations/index_test.go:123 Error: Received unexpected error: object not found Test: TestIndex Messages: index.html --- FAIL: TestIndex (12.96s) === RUN TestIndexDelete run.go:198: Remote "Cloudinary root 'rclone-test-beyiday8luki'", Local "Local file system at /tmp/rclone113397365", Modify Window "876000h0m0s" 2026/09/30 01:55:23 DEBUG : sub/index.html: size = 12302 OK 2026/09/30 01:55:23 DEBUG : sub/index.html: md5 = 7be1a83356895216299f37e5e7e582ca OK 2026/09/30 01:55:23 INFO : sub/index.html: Copied (new) 2026/09/30 01:55:23 DEBUG : index.html: size = 12143 OK 2026/09/30 01:55:23 DEBUG : index.html: md5 = edef1f0d40d281287ee0893f5b8e0374 OK 2026/09/30 01:55:23 INFO : index.html: Copied (new) 2026/09/30 01:55:24 DEBUG : sub/deep/index.html: size = 12085 OK 2026/09/30 01:55:24 DEBUG : sub/deep/index.html: md5 = f9b704c93e42e798f2cf5a233f5e351e OK 2026/09/30 01:55:24 INFO : sub/deep/index.html: Copied (new) 2026/09/30 01:55:25 DEBUG : index.html: Dst hash empty - aborting Src hash check 2026/09/30 01:55:25 DEBUG : sub/index.html: Dst hash empty - aborting Src hash check 2026/09/30 01:55:25 DEBUG : index.html: Unchanged skipping 2026/09/30 01:55:25 DEBUG : sub/index.html: Unchanged skipping 2026/09/30 01:55:26 DEBUG : sub/deep/index.html: size = 11829 OK 2026/09/30 01:55:26 DEBUG : sub/deep/index.html: md5 = d6b54f56fe3c56d0e46dc7cef27afea2 OK 2026/09/30 01:55:26 INFO : sub/deep/index.html: Copied (replaced existing) --- PASS: TestIndexDelete (11.40s) === RUN TestIndexFilter run.go:198: Remote "Cloudinary root 'rclone-test-beyiday8luki'", Local "Local file system at /tmp/rclone113397365", Modify Window "876000h0m0s" 2026/09/30 01:55:35 DEBUG : other/notes.md: Excluded (Path Filter) 2026/09/30 01:55:36 DEBUG : sub/index.html: size = 12054 OK 2026/09/30 01:55:36 DEBUG : sub/index.html: md5 = fdc7f5f00e973af5be8b908657612986 OK 2026/09/30 01:55:36 INFO : sub/index.html: Copied (new) 2026/09/30 01:55:36 DEBUG : index.html: size = 12393 OK 2026/09/30 01:55:36 DEBUG : index.html: md5 = 14719709c900c06b71c10f08d336fb56 OK 2026/09/30 01:55:36 INFO : index.html: Copied (new) 2026/09/30 01:55:36 DEBUG : other/index.html: size = 11802 OK 2026/09/30 01:55:36 DEBUG : other/index.html: md5 = 1fbd534a06e1d3387ab22be5de393e5f OK 2026/09/30 01:55:36 INFO : other/index.html: Copied (new) index_test.go:62: Error Trace: /home/rclone/go/src/github.com/rclone/rclone/fs/operations/index_test.go:62 /home/rclone/go/src/github.com/rclone/rclone/fs/operations/index_test.go:219 Error: Received unexpected error: object not found Test: TestIndexFilter Messages: sub/index.html --- FAIL: TestIndexFilter (11.10s) === RUN TestIndexRules run.go:198: Remote "Cloudinary root 'rclone-test-beyiday8luki'", Local "Local file system at /tmp/rclone113397365", Modify Window "876000h0m0s" 2026/09/30 01:55:46 DEBUG : index.html: size = 12143 OK 2026/09/30 01:55:46 DEBUG : index.html: md5 = edef1f0d40d281287ee0893f5b8e0374 OK 2026/09/30 01:55:46 INFO : index.html: Copied (new) 2026/09/30 01:55:46 DEBUG : sub/index.html: size = 12302 OK 2026/09/30 01:55:46 DEBUG : sub/index.html: md5 = 7be1a83356895216299f37e5e7e582ca OK 2026/09/30 01:55:46 INFO : sub/index.html: Copied (new) index_test.go:62: Error Trace: /home/rclone/go/src/github.com/rclone/rclone/fs/operations/index_test.go:62 /home/rclone/go/src/github.com/rclone/rclone/fs/operations/index_test.go:240 Error: Received unexpected error: object not found Test: TestIndexRules Messages: sub/deep/index.html --- FAIL: TestIndexRules (8.89s) === RUN TestIndexMaxDepth run.go:198: Remote "Cloudinary root 'rclone-test-beyiday8luki'", Local "Local file system at /tmp/rclone113397365", Modify Window "876000h0m0s" 2026/09/30 01:55:54 DEBUG : index.html: size = 12143 OK 2026/09/30 01:55:54 DEBUG : index.html: md5 = edef1f0d40d281287ee0893f5b8e0374 OK 2026/09/30 01:55:54 INFO : index.html: Copied (new) index_test.go:62: Error Trace: /home/rclone/go/src/github.com/rclone/rclone/fs/operations/index_test.go:62 /home/rclone/go/src/github.com/rclone/rclone/fs/operations/index_test.go:259 Error: Received unexpected error: object not found Test: TestIndexMaxDepth Messages: index.html --- FAIL: TestIndexMaxDepth (8.05s) === RUN TestIndexLinkIndex run.go:198: Remote "Cloudinary root 'rclone-test-beyiday8luki'", Local "Local file system at /tmp/rclone113397365", Modify Window "876000h0m0s" 2026/09/30 01:56:03 DEBUG : index.html: size = 12163 OK 2026/09/30 01:56:03 DEBUG : index.html: md5 = 0f04494f30d7593e31b122dd4ed454da OK 2026/09/30 01:56:03 INFO : index.html: Copied (new) 2026/09/30 01:56:03 DEBUG : sub/index.html: size = 12343 OK 2026/09/30 01:56:03 DEBUG : sub/index.html: md5 = 35418f4eddf331dbfd9af133008a4d2a OK 2026/09/30 01:56:03 INFO : sub/index.html: Copied (new) 2026/09/30 01:56:03 DEBUG : sub/deep/index.html: size = 12126 OK 2026/09/30 01:56:03 DEBUG : sub/deep/index.html: md5 = 018dec619a1bca052ce8c976387f9b51 OK 2026/09/30 01:56:03 INFO : sub/deep/index.html: Copied (new) index_test.go:62: Error Trace: /home/rclone/go/src/github.com/rclone/rclone/fs/operations/index_test.go:62 /home/rclone/go/src/github.com/rclone/rclone/fs/operations/index_test.go:266 Error: Received unexpected error: object not found Test: TestIndexLinkIndex Messages: index.html --- FAIL: TestIndexLinkIndex (7.79s) === RUN TestIndexDirTime run.go:198: Remote "Cloudinary root 'rclone-test-beyiday8luki'", Local "Local file system at /tmp/rclone113397365", Modify Window "876000h0m0s" 2026/09/30 01:56:10 DEBUG : sub/deep/index.json: size = 139 OK 2026/09/30 01:56:10 DEBUG : sub/deep/index.json: md5 = df8ca7c5fe62a631f6930d275d31a78b OK 2026/09/30 01:56:10 INFO : sub/deep/index.json: Copied (new) 2026/09/30 01:56:10 DEBUG : sub/index.json: size = 255 OK 2026/09/30 01:56:10 DEBUG : sub/index.json: md5 = 8b91941f85b00911bb762a7e1b086174 OK 2026/09/30 01:56:10 INFO : sub/index.json: Copied (new) 2026/09/30 01:56:10 DEBUG : index.json: size = 253 OK 2026/09/30 01:56:10 DEBUG : index.json: md5 = b4e51b2d9ad13e48df154bc0f77c6374 OK 2026/09/30 01:56:10 INFO : index.json: Copied (new) index_test.go:62: Error Trace: /home/rclone/go/src/github.com/rclone/rclone/fs/operations/index_test.go:62 /home/rclone/go/src/github.com/rclone/rclone/fs/operations/index_test.go:278 /home/rclone/go/src/github.com/rclone/rclone/fs/operations/index_test.go:300 Error: Received unexpected error: object not found Test: TestIndexDirTime Messages: index.json --- FAIL: TestIndexDirTime (7.33s) === RUN TestIndexTemplate run.go:198: Remote "Cloudinary root 'rclone-test-beyiday8luki'", Local "Local file system at /tmp/rclone113397365", Modify Window "876000h0m0s" 2026/09/30 01:56:17 DEBUG : sub/list.txt: size = 64 OK 2026/09/30 01:56:17 DEBUG : sub/list.txt: md5 = 392b31a0b76dfeac344bfc90519f71cf OK 2026/09/30 01:56:17 INFO : sub/list.txt: Copied (new) 2026/09/30 01:56:18 DEBUG : sub/deep/list.txt: size = 47 OK 2026/09/30 01:56:18 DEBUG : sub/deep/list.txt: md5 = dc1cc2d7ce7f5592c21ea35204e8c55f OK 2026/09/30 01:56:18 INFO : sub/deep/list.txt: Copied (new) 2026/09/30 01:56:18 DEBUG : list.txt: size = 59 OK 2026/09/30 01:56:18 DEBUG : list.txt: md5 = 7be1c5ff53c6c4db1785ba69f82a3a65 OK 2026/09/30 01:56:18 INFO : list.txt: Copied (new) index_test.go:62: Error Trace: /home/rclone/go/src/github.com/rclone/rclone/fs/operations/index_test.go:62 /home/rclone/go/src/github.com/rclone/rclone/fs/operations/index_test.go:327 Error: Received unexpected error: object not found Test: TestIndexTemplate Messages: sub/list.txt --- FAIL: TestIndexTemplate (8.27s) === RUN TestIndexTemplateBuiltin --- PASS: TestIndexTemplateBuiltin (0.00s) === RUN TestRcIndex rc_test.go:31: Skipping test on non local remote --- SKIP: TestRcIndex (0.00s) === RUN TestIndexNoHash index_test.go:371: Skipping test on non local remote --- SKIP: TestIndexNoHash (0.00s) === RUN TestIndexChanged run.go:198: Remote "Cloudinary root 'rclone-test-beyiday8luki'", Local "Local file system at /tmp/rclone113397365", Modify Window "876000h0m0s" 2026/09/30 01:56:26 DEBUG : sub/index.html: size = 12302 OK 2026/09/30 01:56:26 DEBUG : sub/index.html: md5 = 7be1a83356895216299f37e5e7e582ca OK 2026/09/30 01:56:26 INFO : sub/index.html: Copied (new) 2026/09/30 01:56:26 DEBUG : other/index.html: size = 12056 OK 2026/09/30 01:56:26 DEBUG : other/index.html: md5 = dbfce24e1111f4d28dcdead7bd95c5ed OK 2026/09/30 01:56:26 INFO : other/index.html: Copied (new) 2026/09/30 01:56:26 DEBUG : index.html: size = 12393 OK 2026/09/30 01:56:26 DEBUG : index.html: md5 = 14719709c900c06b71c10f08d336fb56 OK 2026/09/30 01:56:26 INFO : index.html: Copied (new) 2026/09/30 01:56:26 DEBUG : sub/deep/index.html: size = 12085 OK 2026/09/30 01:56:26 DEBUG : sub/deep/index.html: md5 = f9b704c93e42e798f2cf5a233f5e351e OK 2026/09/30 01:56:26 INFO : sub/deep/index.html: Copied (new) 2026/09/30 01:56:27 INFO : Cloudinary root 'rclone-test-beyiday8luki': Partial index: listing 3 directories and walking 0 changed directories 2026/09/30 01:56:28 DEBUG : index.html: Dst hash empty - aborting Src hash check 2026/09/30 01:56:28 DEBUG : sub/index.html: Dst hash empty - aborting Src hash check 2026/09/30 01:56:28 DEBUG : index.html: Unchanged skipping 2026/09/30 01:56:28 DEBUG : sub/index.html: Unchanged skipping 2026/09/30 01:56:28 DEBUG : sub/deep/index.html: size = 12342 OK 2026/09/30 01:56:28 DEBUG : sub/deep/index.html: md5 = 06deb82d8eabfa54d83e909e0da00b55 OK 2026/09/30 01:56:28 INFO : sub/deep/index.html: Copied (replaced existing) 2026/09/30 01:56:30 INFO : Cloudinary root 'rclone-test-beyiday8luki': Partial index: listing 3 directories and walking 0 changed directories 2026/09/30 01:56:31 DEBUG : index.html: Dst hash empty - aborting Src hash check 2026/09/30 01:56:31 DEBUG : index.html: Unchanged skipping 2026/09/30 01:56:32 DEBUG : sub/new/index.html: size = 12083 OK 2026/09/30 01:56:32 DEBUG : sub/new/index.html: md5 = 268c90baf87bcf818d8966b1e630773d OK 2026/09/30 01:56:32 INFO : sub/new/index.html: Copied (new) 2026/09/30 01:56:32 DEBUG : sub/index.html: size = 12548 OK 2026/09/30 01:56:32 DEBUG : sub/index.html: md5 = 0d8a3d9009939e940c6308a73b0f6e59 OK 2026/09/30 01:56:32 INFO : sub/index.html: Copied (replaced existing) index_test.go:411: Error Trace: /home/rclone/go/src/github.com/rclone/rclone/fs/operations/index_test.go:411 Error: "\n\n\n\n\t\n\t\t/sub\n\t\t\n\t\t\n\t\t\n\n\t\n\t\n\t\t\n\t\t\t\n\t\t\t\t\n\t\t\t\t\n\t\t\t\t\n\t\t\t\t\n\t\t\t\n\t\t\n\t\t
\n\t\t\t
Folder path
\n\t\t\t

/sub/\n\t\t\t

\n\t\t
\n\t\t
\n\t\t\t
\n\t\t\t\t
\n\t\t\t\t\t\n\t\t\t\t\t\n\t\t\t\t\t6 total\n\t\t\t\t
\n\t\t\t\t
\n\t\t\t\t\t\n\t\t\t\t\t\t\n\t\t\t\t\t\t\t\n\t\t\t\t\t\t\t\t\n\t\t\t\t\t\t\t\t\n\t\t\t\t\t\t\t\t\n\t\t\t\t\t\t\t\n\t\t\t\t\t\t\n\t\t\t\t\t\t\n\t\t\t\t\t\t\t\n\t\t\t\t\t\t\t\n\t\t\t\t\t\t\t\t\n\t\t\t\t\t\t\t\t\n\t\t\t\t\t\t\t\t\n\t\t\t\t\t\t\t\n\t\t\t\t\t\t\t\n\t\t\t\t\t\t\t\t\n\t\t\t\t\t\t\t\t\n\t\t\t\t\t\t\t\t\n\t\t\t\t\t\t\t\n\t\t\t\t\t\t\t\n\t\t\t\t\t\t\n\t\t\t\t\t
\n\t\t\t\t\t\t\t\t\tName\n\t\t\t\t\t\t\t\t\t\n\t\t\t\t\t\t\t\tSizeModified
Go up——
deep/\n\t\t\t\t\t\t\t\t——
file2.txt\n\t\t\t\t\t\t\t\t6—
\n\t\t\t\t
\n\t\t\t
\n\t\t
\n\t\t\n\t\n\n" does not contain "new/" Test: TestIndexChanged index_test.go:62: Error Trace: /home/rclone/go/src/github.com/rclone/rclone/fs/operations/index_test.go:62 /home/rclone/go/src/github.com/rclone/rclone/fs/operations/index_test.go:412 Error: Received unexpected error: object not found Test: TestIndexChanged Messages: sub/new/index.html --- FAIL: TestIndexChanged (17.56s) === RUN TestIndexChangedDelete run.go:198: Remote "Cloudinary root 'rclone-test-beyiday8luki'", Local "Local file system at /tmp/rclone113397365", Modify Window "876000h0m0s" 2026/09/30 01:56:43 DEBUG : sub/deep/index.html: size = 12085 OK 2026/09/30 01:56:43 DEBUG : sub/deep/index.html: md5 = f9b704c93e42e798f2cf5a233f5e351e OK 2026/09/30 01:56:43 INFO : sub/deep/index.html: Copied (new) 2026/09/30 01:56:43 DEBUG : index.html: size = 12143 OK 2026/09/30 01:56:43 DEBUG : index.html: md5 = edef1f0d40d281287ee0893f5b8e0374 OK 2026/09/30 01:56:43 INFO : index.html: Copied (new) 2026/09/30 01:56:43 DEBUG : sub/index.html: size = 12302 OK 2026/09/30 01:56:43 DEBUG : sub/index.html: md5 = 7be1a83356895216299f37e5e7e582ca OK 2026/09/30 01:56:43 INFO : sub/index.html: Copied (new) index_test.go:473: Error Trace: /home/rclone/go/src/github.com/rclone/rclone/fs/operations/index_test.go:473 Error: Received unexpected error: object not found Test: TestIndexChangedDelete --- FAIL: TestIndexChangedDelete (7.54s) === RUN TestIndexChangedFiles run.go:198: Remote "Cloudinary root 'rclone-test-beyiday8luki'", Local "Local file system at /tmp/rclone113397365", Modify Window "876000h0m0s" 2026/09/30 01:56:51 DEBUG : index.html: size = 12395 OK 2026/09/30 01:56:51 DEBUG : index.html: md5 = 699b968318ac6fe092681d9a3155676f OK 2026/09/30 01:56:51 INFO : index.html: Copied (new) 2026/09/30 01:56:51 DEBUG : sub/deep/index.html: size = 12085 OK 2026/09/30 01:56:51 DEBUG : sub/deep/index.html: md5 = f9b704c93e42e798f2cf5a233f5e351e OK 2026/09/30 01:56:51 INFO : sub/deep/index.html: Copied (new) 2026/09/30 01:56:51 DEBUG : sub/index.html: size = 12302 OK 2026/09/30 01:56:51 DEBUG : sub/index.html: md5 = 7be1a83356895216299f37e5e7e582ca OK 2026/09/30 01:56:51 INFO : sub/index.html: Copied (new) 2026/09/30 01:56:52 DEBUG : - odd/index.html: size = 12056 OK 2026/09/30 01:56:52 DEBUG : - odd/index.html: md5 = 23e09afb28c84aa96946e09333ed01d4 OK 2026/09/30 01:56:52 INFO : - odd/index.html: Copied (new) 2026/09/30 01:56:53 INFO : Cloudinary root 'rclone-test-beyiday8luki': Partial index: listing 2 directories and walking 0 changed directories 2026/09/30 01:56:53 DEBUG : index.html: Dst hash empty - aborting Src hash check 2026/09/30 01:56:53 DEBUG : index.html: Unchanged skipping 2026/09/30 01:56:54 DEBUG : - odd/index.html: size = 12312 OK 2026/09/30 01:56:54 DEBUG : - odd/index.html: md5 = 9c022df10f73c4918707a06d7aae63a9 OK 2026/09/30 01:56:54 INFO : - odd/index.html: Copied (replaced existing) 2026/09/30 01:56:55 INFO : Cloudinary root 'rclone-test-beyiday8luki': Partial index: listing 4 directories and walking 0 changed directories 2026/09/30 01:56:56 DEBUG : index.html: Dst hash empty - aborting Src hash check 2026/09/30 01:56:56 DEBUG : - odd/index.html: Dst hash empty - aborting Src hash check 2026/09/30 01:56:56 DEBUG : sub/deep/index.html: Dst hash empty - aborting Src hash check 2026/09/30 01:56:56 DEBUG : index.html: Unchanged skipping 2026/09/30 01:56:56 DEBUG : - odd/index.html: Unchanged skipping 2026/09/30 01:56:56 DEBUG : sub/deep/index.html: Unchanged skipping 2026/09/30 01:56:57 DEBUG : sub/index.html: size = 12559 OK 2026/09/30 01:56:57 DEBUG : sub/index.html: md5 = 5307142294fcd01c14dc4350bbd0c8c8 OK 2026/09/30 01:56:57 INFO : sub/index.html: Copied (replaced existing) index_test.go:519: Error Trace: /home/rclone/go/src/github.com/rclone/rclone/fs/operations/index_test.go:519 Error: "\n\n\n\n\t\n\t\t/sub\n\t\t\n\t\t\n\t\t\n\n\t\n\t\n\t\t\n\t\t\t\n\t\t\t\t\n\t\t\t\t\n\t\t\t\t\n\t\t\t\t\n\t\t\t\n\t\t\n\t\t
\n\t\t\t
Folder path
\n\t\t\t

/sub/\n\t\t\t

\n\t\t
\n\t\t
\n\t\t\t
\n\t\t\t\t
\n\t\t\t\t\t\n\t\t\t\t\t\n\t\t\t\t\t6 total\n\t\t\t\t
\n\t\t\t\t
\n\t\t\t\t\t\n\t\t\t\t\t\t\n\t\t\t\t\t\t\t\n\t\t\t\t\t\t\t\t\n\t\t\t\t\t\t\t\t\n\t\t\t\t\t\t\t\t\n\t\t\t\t\t\t\t\n\t\t\t\t\t\t\n\t\t\t\t\t\t\n\t\t\t\t\t\t\t\n\t\t\t\t\t\t\t\n\t\t\t\t\t\t\t\t\n\t\t\t\t\t\t\t\t\n\t\t\t\t\t\t\t\t\n\t\t\t\t\t\t\t\n\t\t\t\t\t\t\t\n\t\t\t\t\t\t\t\t\n\t\t\t\t\t\t\t\t\n\t\t\t\t\t\t\t\t\n\t\t\t\t\t\t\t\n\t\t\t\t\t\t\t\n\t\t\t\t\t\t\n\t\t\t\t\t
\n\t\t\t\t\t\t\t\t\tName\n\t\t\t\t\t\t\t\t\t\n\t\t\t\t\t\t\t\tSizeModified
Go up——
deep/\n\t\t\t\t\t\t\t\t——
file2.txt\n\t\t\t\t\t\t\t\t6—
\n\t\t\t\t
\n\t\t\t
\n\t\t
\n\t\t\n\t\n\n" does not contain "file9.txt" Test: TestIndexChangedFiles --- FAIL: TestIndexChangedFiles (15.10s) === RUN TestIndexChangedDirTime run.go:198: Remote "Cloudinary root 'rclone-test-beyiday8luki'", Local "Local file system at /tmp/rclone113397365", Modify Window "876000h0m0s" 2026/09/30 01:57:06 DEBUG : sub/index.json: size = 255 OK 2026/09/30 01:57:06 DEBUG : sub/index.json: md5 = 899dc3b501fc6f60ba857af091f9a652 OK 2026/09/30 01:57:06 INFO : sub/index.json: Copied (new) 2026/09/30 01:57:06 DEBUG : sub/deep/index.json: size = 139 OK 2026/09/30 01:57:06 DEBUG : sub/deep/index.json: md5 = b8403b9d7655abe235c6c4fbf06e0450 OK 2026/09/30 01:57:06 INFO : sub/deep/index.json: Copied (new) 2026/09/30 01:57:06 DEBUG : index.json: size = 371 OK 2026/09/30 01:57:06 DEBUG : index.json: md5 = cb78d37bfeef28dcc47d5107d1f18ff2 OK 2026/09/30 01:57:06 INFO : index.json: Copied (new) 2026/09/30 01:57:07 DEBUG : other/index.json: size = 140 OK 2026/09/30 01:57:07 DEBUG : other/index.json: md5 = f164d29db4dcfa3135e354be2e3b4839 OK 2026/09/30 01:57:07 INFO : other/index.json: Copied (new) 2026/09/30 01:57:07 INFO : Cloudinary root 'rclone-test-beyiday8luki': Partial index: listing 3 directories and walking 0 changed directories 2026/09/30 01:57:08 DEBUG : index.json: Dst hash empty - aborting Src hash check 2026/09/30 01:57:08 DEBUG : sub/index.json: Dst hash empty - aborting Src hash check 2026/09/30 01:57:09 DEBUG : sub/deep/index.json: size = 275 OK 2026/09/30 01:57:09 DEBUG : sub/deep/index.json: md5 = 1557e49088a707ba4f95b544020af407 OK 2026/09/30 01:57:09 INFO : sub/deep/index.json: Copied (replaced existing) 2026/09/30 01:57:09 DEBUG : index.json: size = 371 OK 2026/09/30 01:57:09 DEBUG : index.json: md5 = b167612c24b3da521b04f347fffc2528 OK 2026/09/30 01:57:09 INFO : index.json: Copied (replaced existing) 2026/09/30 01:57:09 DEBUG : sub/index.json: size = 255 OK 2026/09/30 01:57:09 DEBUG : sub/index.json: md5 = d44f066a8b183dc83bbcb9a31d717391 OK 2026/09/30 01:57:09 INFO : sub/index.json: Copied (replaced existing) --- PASS: TestIndexChangedDirTime (11.87s) === RUN TestListDirSorted run.go:198: Remote "Cloudinary root 'rclone-test-beyiday8luki'", Local "Local file system at /tmp/rclone113397365", Modify Window "876000h0m0s" 2026/09/30 01:57:20 DEBUG : a.txt: Excluded (Size Filter) 2026/09/30 01:57:20 DEBUG : a.txt: Excluded 2026/09/30 01:57:21 DEBUG : sub dir/hello world2: Excluded (Size Filter) 2026/09/30 01:57:21 DEBUG : sub dir/hello world2: Excluded 2026/09/30 01:57:21 DEBUG : sub dir/hello world: Excluded (Size Filter) 2026/09/30 01:57:21 DEBUG : sub dir/hello world: Excluded 2026/09/30 01:57:21 DEBUG : sub dir/ignore dir: Excluded 2026/09/30 01:57:21 DEBUG : sub dir/hello world2: Excluded (Size Filter) 2026/09/30 01:57:21 DEBUG : sub dir/hello world2: Excluded 2026/09/30 01:57:21 DEBUG : sub dir/hello world: Excluded (Size Filter) 2026/09/30 01:57:21 DEBUG : sub dir/hello world: Excluded 2026/09/30 01:57:22 DEBUG : sub dir/ignore dir: Excluded --- PASS: TestListDirSorted (12.34s) === RUN TestListDirSortedFn run.go:198: Remote "Cloudinary root 'rclone-test-beyiday8luki'", Local "Local file system at /tmp/rclone113397365", Modify Window "876000h0m0s" 2026/09/30 01:57:32 DEBUG : a.txt: Excluded (Size Filter) 2026/09/30 01:57:32 DEBUG : a.txt: Excluded 2026/09/30 01:57:33 DEBUG : sub dir/hello world2: Excluded (Size Filter) 2026/09/30 01:57:33 DEBUG : sub dir/hello world2: Excluded 2026/09/30 01:57:33 DEBUG : sub dir/hello world: Excluded (Size Filter) 2026/09/30 01:57:33 DEBUG : sub dir/hello world: Excluded 2026/09/30 01:57:33 DEBUG : sub dir/ignore dir: Excluded 2026/09/30 01:57:33 DEBUG : sub dir/hello world2: Excluded (Size Filter) 2026/09/30 01:57:33 DEBUG : sub dir/hello world2: Excluded 2026/09/30 01:57:33 DEBUG : sub dir/hello world: Excluded (Size Filter) 2026/09/30 01:57:33 DEBUG : sub dir/hello world: Excluded 2026/09/30 01:57:34 DEBUG : sub dir/ignore dir: Excluded --- PASS: TestListDirSortedFn (12.24s) === RUN TestListJSON run.go:198: Remote "Cloudinary root 'rclone-test-beyiday8luki'", Local "Local file system at /tmp/rclone113397365", Modify Window "876000h0m0s" === RUN TestListJSON/Default === RUN TestListJSON/FilesOnly === RUN TestListJSON/DirsOnly === RUN TestListJSON/Recurse === RUN TestListJSON/SubDir === RUN TestListJSON/NoModTime === RUN TestListJSON/NoMimeType === RUN TestListJSON/ShowHash === RUN TestListJSON/HashTypes === RUN TestListJSON/Metadata --- PASS: TestListJSON (6.71s) --- PASS: TestListJSON/Default (0.40s) --- PASS: TestListJSON/FilesOnly (0.27s) --- PASS: TestListJSON/DirsOnly (0.27s) --- PASS: TestListJSON/Recurse (0.61s) --- PASS: TestListJSON/SubDir (0.26s) --- PASS: TestListJSON/NoModTime (0.27s) --- PASS: TestListJSON/NoMimeType (0.29s) --- PASS: TestListJSON/ShowHash (0.34s) --- PASS: TestListJSON/HashTypes (0.30s) --- PASS: TestListJSON/Metadata (0.26s) === RUN TestStatJSON run.go:198: Remote "Cloudinary root 'rclone-test-beyiday8luki'", Local "Local file system at /tmp/rclone113397365", Modify Window "876000h0m0s" === RUN TestStatJSON/Root === RUN TestStatJSON/RootFilesOnly === RUN TestStatJSON/RootDirsOnly === RUN TestStatJSON/Dir === RUN TestStatJSON/DirWithTrailingSlash === RUN TestStatJSON/File === RUN TestStatJSON/NotFound === RUN TestStatJSON/DirFilesOnly === RUN TestStatJSON/FileFilesOnly === RUN TestStatJSON/NotFoundFilesOnly === RUN TestStatJSON/DirDirsOnly === RUN TestStatJSON/FileDirsOnly === RUN TestStatJSON/NotFoundDirsOnly === RUN TestStatJSON/RootNotFound 2026/09/30 01:57:51 DEBUG : Creating backend with remote "TestCloudinary:rclone-test-beyiday8luki/notfound" 2026/09/30 01:57:51 DEBUG : Config file has changed externally - reloading --- PASS: TestStatJSON (7.55s) --- PASS: TestStatJSON/Root (0.30s) --- PASS: TestStatJSON/RootFilesOnly (0.00s) --- PASS: TestStatJSON/RootDirsOnly (0.30s) --- PASS: TestStatJSON/Dir (0.64s) --- PASS: TestStatJSON/DirWithTrailingSlash (0.29s) --- PASS: TestStatJSON/File (0.24s) --- PASS: TestStatJSON/NotFound (0.49s) --- PASS: TestStatJSON/DirFilesOnly (0.14s) --- PASS: TestStatJSON/FileFilesOnly (0.16s) --- PASS: TestStatJSON/NotFoundFilesOnly (0.14s) --- PASS: TestStatJSON/DirDirsOnly (0.27s) --- PASS: TestStatJSON/FileDirsOnly (0.30s) --- PASS: TestStatJSON/NotFoundDirsOnly (0.27s) --- PASS: TestStatJSON/RootNotFound (0.54s) === RUN TestStatJSONMemory 2026/09/30 01:57:53 DEBUG : Creating backend with remote ":memory:" 2026/09/30 01:57:53 DEBUG : Memory root '': File to upload is small (5 bytes), uploading instead of streaming 2026/09/30 01:57:53 DEBUG : sub/file1: size = 5 OK 2026/09/30 01:57:53 DEBUG : sub/file1: md5 = 5d41402abc4b2a76b9719d911017c592 OK 2026/09/30 01:57:53 DEBUG : sub/file1: Size and md5 of src and dst objects identical === RUN TestStatJSONMemory/Dir === RUN TestStatJSONMemory/DirWithTrailingSlash === RUN TestStatJSONMemory/File === RUN TestStatJSONMemory/NotFound --- PASS: TestStatJSONMemory (0.00s) --- PASS: TestStatJSONMemory/Dir (0.00s) --- PASS: TestStatJSONMemory/DirWithTrailingSlash (0.00s) --- PASS: TestStatJSONMemory/File (0.00s) --- PASS: TestStatJSONMemory/NotFound (0.00s) === RUN TestStatJSONConfinement --- PASS: TestStatJSONConfinement (0.00s) === RUN TestMkdir run.go:198: Remote "Cloudinary root 'rclone-test-beyiday8luki'", Local "Local file system at /tmp/rclone113397365", Modify Window "876000h0m0s" 2026/09/30 01:57:53 INFO : Cloudinary root 'rclone-test-beyiday8luki': Making directory 2026/09/30 01:57:54 INFO : Cloudinary root 'rclone-test-beyiday8luki': Making directory --- PASS: TestMkdir (1.14s) === RUN TestLsd run.go:198: Remote "Cloudinary root 'rclone-test-beyiday8luki'", Local "Local file system at /tmp/rclone113397365", Modify Window "876000h0m0s" --- PASS: TestLsd (4.50s) === RUN TestLs run.go:198: Remote "Cloudinary root 'rclone-test-beyiday8luki'", Local "Local file system at /tmp/rclone113397365", Modify Window "876000h0m0s" --- PASS: TestLs (2.85s) === RUN TestLsWithFilesFrom run.go:198: Remote "Cloudinary root 'rclone-test-beyiday8luki'", Local "Local file system at /tmp/rclone113397365", Modify Window "876000h0m0s" 2026/09/30 01:58:04 DEBUG : empty space: Excluded (FilesFrom Filter) 2026/09/30 01:58:04 DEBUG : empty space: Excluded operations_test.go:139: Error Trace: /home/rclone/go/src/github.com/rclone/rclone/fs/operations/operations_test.go:139 Error: Not equal: expected: " 60 potato2\n" actual : "" Diff: --- Expected +++ Actual @@ -1,2 +1 @@ - 60 potato2 Test: TestLsWithFilesFrom --- FAIL: TestLsWithFilesFrom (3.30s) === RUN TestLsLong run.go:198: Remote "Cloudinary root 'rclone-test-beyiday8luki'", Local "Local file system at /tmp/rclone113397365", Modify Window "876000h0m0s" --- PASS: TestLsLong (3.92s) === RUN TestHashSums run.go:198: Remote "Cloudinary root 'rclone-test-beyiday8luki'", Local "Local file system at /tmp/rclone113397365", Modify Window "876000h0m0s" === RUN TestHashSums/Md5 operations_test.go:284: Error Trace: /home/rclone/go/src/github.com/rclone/rclone/fs/operations/operations_test.go:284 Error: " empty space\n potato2\n" does not contain "336d5ebc5436534e61d16e63ddfca327 empty space\n" Test: TestHashSums/Md5 operations_test.go:284: Error Trace: /home/rclone/go/src/github.com/rclone/rclone/fs/operations/operations_test.go:284 Error: " empty space\n potato2\n" does not contain "d6548b156ea68a4e003e786df99eee76 potato2\n" Test: TestHashSums/Md5 === RUN TestHashSums/Md5Download --- FAIL: TestHashSums (3.40s) --- FAIL: TestHashSums/Md5 (0.31s) --- PASS: TestHashSums/Md5Download (0.64s) === RUN TestHashSumsWithErrors 2026/09/30 01:58:13 DEBUG : Creating backend with remote ":memory:" 2026/09/30 01:58:13 DEBUG : Config file has changed externally - reloading 2026/09/30 01:58:13 ERROR : file1: hash unsupported: hash type not supported 2026/09/30 01:58:13 ERROR : sub/file1: hash unsupported: hash type not supported 2026/09/30 01:58:13 ERROR : file1: hash unsupported: hash type not supported --- PASS: TestHashSumsWithErrors (0.00s) === RUN TestHashStream 2026/09/30 01:58:13 DEBUG : Creating md5 hash of 0 bytes read from input stream 2026/09/30 01:58:13 DEBUG : Creating md5 hash of 0 bytes read from input stream 2026/09/30 01:58:13 DEBUG : Creating sha1 hash of 0 bytes read from input stream 2026/09/30 01:58:13 DEBUG : Creating sha1 hash of 0 bytes read from input stream 2026/09/30 01:58:13 DEBUG : Creating md5 hash of 12 bytes read from input stream 2026/09/30 01:58:13 DEBUG : Creating md5 hash of 12 bytes read from input stream 2026/09/30 01:58:13 DEBUG : Creating sha1 hash of 12 bytes read from input stream 2026/09/30 01:58:13 DEBUG : Creating sha1 hash of 12 bytes read from input stream --- PASS: TestHashStream (0.00s) === RUN TestSuffixName --- PASS: TestSuffixName (0.00s) === RUN TestCount run.go:198: Remote "Cloudinary root 'rclone-test-beyiday8luki'", Local "Local file system at /tmp/rclone113397365", Modify Window "876000h0m0s" --- PASS: TestCount (5.01s) === RUN TestDelete run.go:198: Remote "Cloudinary root 'rclone-test-beyiday8luki'", Local "Local file system at /tmp/rclone113397365", Modify Window "876000h0m0s" 2026/09/30 01:58:19 DEBUG : Waiting for deletions to finish 2026/09/30 01:58:20 DEBUG : large: Excluded (Size Filter) 2026/09/30 01:58:20 DEBUG : large: Excluded 2026/09/30 01:58:20 INFO : small: Deleted 2026/09/30 01:58:20 INFO : medium: Deleted --- PASS: TestDelete (3.79s) === RUN TestDeleteFatalError run.go:198: Remote "Cloudinary root 'rclone-test-beyiday8luki'", Local "Local file system at /tmp/rclone113397365", Modify Window "876000h0m0s" 2026/09/30 01:58:32 DEBUG : Waiting for deletions to finish 2026/09/30 01:58:32 ERROR : file1: Got fatal error on delete: --max-delete threshold reached 2026/09/30 01:58:32 ERROR : file10: Got fatal error on delete: --max-delete threshold reached 2026/09/30 01:58:32 ERROR : file0: Got fatal error on delete: --max-delete threshold reached 2026/09/30 01:58:32 ERROR : file12: Got fatal error on delete: --max-delete threshold reached 2026/09/30 01:58:32 ERROR : file13: Got fatal error on delete: --max-delete threshold reached 2026/09/30 01:58:32 ERROR : file14: Got fatal error on delete: --max-delete threshold reached 2026/09/30 01:58:32 ERROR : file15: Got fatal error on delete: --max-delete threshold reached 2026/09/30 01:58:32 ERROR : file16: Got fatal error on delete: --max-delete threshold reached 2026/09/30 01:58:32 ERROR : file17: Got fatal error on delete: --max-delete threshold reached 2026/09/30 01:58:32 ERROR : file18: Got fatal error on delete: --max-delete threshold reached 2026/09/30 01:58:32 ERROR : file11: Got fatal error on delete: --max-delete threshold reached 2026/09/30 01:58:32 ERROR : file19: Got fatal error on delete: --max-delete threshold reached 2026/09/30 01:58:32 ERROR : file2: Got fatal error on delete: --max-delete threshold reached 2026/09/30 01:58:32 ERROR : file3: Got fatal error on delete: --max-delete threshold reached 2026/09/30 01:58:32 ERROR : file4: Got fatal error on delete: --max-delete threshold reached 2026/09/30 01:58:32 ERROR : file6: Got fatal error on delete: --max-delete threshold reached 2026/09/30 01:58:32 ERROR : file7: Got fatal error on delete: --max-delete threshold reached 2026/09/30 01:58:32 ERROR : file8: Got fatal error on delete: --max-delete threshold reached 2026/09/30 01:58:32 ERROR : file9: Got fatal error on delete: --max-delete threshold reached 2026/09/30 01:58:32 ERROR : file5: Got fatal error on delete: --max-delete threshold reached --- PASS: TestDeleteFatalError (17.86s) === RUN TestMaxDelete run.go:198: Remote "Cloudinary root 'rclone-test-beyiday8luki'", Local "Local file system at /tmp/rclone113397365", Modify Window "876000h0m0s" 2026/09/30 01:58:41 DEBUG : Waiting for deletions to finish 2026/09/30 01:58:41 ERROR : small: Got fatal error on delete: --max-delete threshold reached 2026/09/30 01:58:41 INFO : medium: Deleted 2026/09/30 01:58:42 INFO : large: Deleted --- PASS: TestMaxDelete (4.27s) === RUN TestMaxDeleteSizeLargeFile run.go:198: Remote "Cloudinary root 'rclone-test-beyiday8luki'", Local "Local file system at /tmp/rclone113397365", Modify Window "876000h0m0s" 2026/09/30 01:58:46 DEBUG : Waiting for deletions to finish 2026/09/30 01:58:46 ERROR : large: Got fatal error on delete: --max-delete-size threshold reached 2026/09/30 01:58:47 INFO : small: Deleted 2026/09/30 01:58:47 INFO : medium: Deleted --- PASS: TestMaxDeleteSizeLargeFile (5.09s) === RUN TestMaxDeleteSize run.go:198: Remote "Cloudinary root 'rclone-test-beyiday8luki'", Local "Local file system at /tmp/rclone113397365", Modify Window "876000h0m0s" 2026/09/30 01:58:50 DEBUG : Waiting for deletions to finish 2026/09/30 01:58:51 ERROR : small: Got fatal error on delete: --max-delete-size threshold reached 2026/09/30 01:58:51 INFO : large: Deleted 2026/09/30 01:58:51 INFO : medium: Deleted --- PASS: TestMaxDeleteSize (4.43s) === RUN TestReadFile run.go:198: Remote "Cloudinary root 'rclone-test-beyiday8luki'", Local "Local file system at /tmp/rclone113397365", Modify Window "876000h0m0s" operations_test.go:536: Error Trace: /home/rclone/go/src/github.com/rclone/rclone/fs/operations/operations_test.go:536 Error: Received unexpected error: object not found Test: TestReadFile --- FAIL: TestReadFile (2.42s) === RUN TestRetry 2026/09/30 01:58:55 DEBUG : Received error: Wrapped EOF is retriable: EOF - low level retry 1/5 2026/09/30 01:58:55 DEBUG : Received error: Wrapped EOF is retriable: EOF - low level retry 2/5 2026/09/30 01:58:55 DEBUG : Sleeping for 10ms (as indicated by the server) to obey Retry-After error: BANG: trying again in 10ms 2026/09/30 01:58:55 DEBUG : Sleeping for 10ms (as indicated by the server) to obey Retry-After error: BANG: trying again in 10ms 2026/09/30 01:58:55 DEBUG : Sleeping for 10ms (as indicated by the server) to obey Retry-After error: BANG: trying again in 10ms 2026/09/30 01:58:55 DEBUG : Sleeping for 10ms (as indicated by the server) to obey Retry-After error: BANG: trying again in 10ms --- PASS: TestRetry (0.04s) === RUN TestRetryAfterContextCancel 2026/09/30 01:58:55 DEBUG : Sleeping for 1h0m0s (as indicated by the server) to obey Retry-After error: BANG: trying again in 1h0m0s --- PASS: TestRetryAfterContextCancel (0.00s) === RUN TestRetryAfterLastTry --- PASS: TestRetryAfterLastTry (0.00s) === RUN TestCat run.go:198: Remote "Cloudinary root 'rclone-test-beyiday8luki'", Local "Local file system at /tmp/rclone113397365", Modify Window "876000h0m0s" --- PASS: TestCat (4.36s) === RUN TestPurge 2026/09/30 01:59:00 DEBUG : Creating backend with remote "TestCloudinary:rclone-test-vemepiz7bepa" 2026/09/30 01:59:00 DEBUG : Using config file from "/home/rclone/.rclone.conf" 2026/09/30 01:59:00 DEBUG : Creating backend with remote "/tmp/rclone64074313" run.go:198: Remote "Cloudinary root 'rclone-test-vemepiz7bepa'", Local "Local file system at /tmp/rclone64074313", Modify Window "876000h0m0s" 2026/09/30 01:59:01 INFO : A2: Making directory 2026/09/30 01:59:01 INFO : A1/B2: Making directory 2026/09/30 01:59:02 INFO : A1/B2/C2: Making directory 2026/09/30 01:59:02 INFO : A1/B1/C3: Making directory 2026/09/30 01:59:02 INFO : A3: Making directory 2026/09/30 01:59:02 INFO : A3/B3: Making directory 2026/09/30 01:59:02 INFO : A3/B3/C4: Making directory 2026/09/30 01:59:05 DEBUG : Waiting for deletions to finish 2026/09/30 01:59:06 INFO : A1/B1/C1/one: Deleted 2026/09/30 01:59:06 DEBUG : removing 2 level 3 directories 2026/09/30 01:59:06 INFO : A1/B1/C3: Removing directory 2026/09/30 01:59:06 INFO : A1/B1/C1: Removing directory 2026/09/30 01:59:07 DEBUG : removing 1 level 2 directories 2026/09/30 01:59:07 INFO : A1/B1: Removing directory 2026/09/30 01:59:08 DEBUG : Waiting for deletions to finish 2026/09/30 01:59:09 INFO : A1/two: Deleted 2026/09/30 01:59:11 DEBUG : removing 2 level 3 directories 2026/09/30 01:59:11 INFO : A3/B3/C4: Removing directory 2026/09/30 01:59:11 INFO : A1/B2/C2: Removing directory 2026/09/30 01:59:11 DEBUG : removing 2 level 2 directories 2026/09/30 01:59:11 INFO : A3/B3: Removing directory 2026/09/30 01:59:11 INFO : A1/B2: Removing directory 2026/09/30 01:59:12 DEBUG : removing 3 level 1 directories 2026/09/30 01:59:12 INFO : A3: Removing directory 2026/09/30 01:59:12 INFO : A1: Removing directory 2026/09/30 01:59:12 INFO : A2: Removing directory 2026/09/30 01:59:12 DEBUG : removing 1 level 0 directories 2026/09/30 01:59:12 INFO : Cloudinary root 'rclone-test-vemepiz7bepa': Removing directory 2026/09/30 01:59:13 ERROR : error listing: directory not found 2026/09/30 01:59:13 ERROR : error listing: directory not found 2026/09/30 01:59:13 DEBUG : Cloudinary root 'rclone-test-vemepiz7bepa': Purge dir "" 2026/09/30 01:59:13 NOTICE: purge failed to rmdir "": directory not found 2026/09/30 01:59:13 NOTICE: purge failed: directory not found --- PASS: TestPurge (13.05s) === RUN TestRmdirsNoLeaveRoot run.go:198: Remote "Cloudinary root 'rclone-test-beyiday8luki'", Local "Local file system at /tmp/rclone113397365", Modify Window "876000h0m0s" 2026/09/30 01:59:14 INFO : A2: Making directory 2026/09/30 01:59:14 INFO : A1/B2: Making directory 2026/09/30 01:59:14 INFO : A1/B2/C2: Making directory 2026/09/30 01:59:14 INFO : A1/B1/C3: Making directory 2026/09/30 01:59:14 INFO : A3: Making directory 2026/09/30 01:59:14 INFO : A3/B3: Making directory 2026/09/30 01:59:15 INFO : A3/B3/C4: Making directory 2026/09/30 01:59:17 DEBUG : removing 1 level 3 directories 2026/09/30 01:59:17 INFO : A3/B3/C4: Removing directory 2026/09/30 01:59:20 DEBUG : removing 2 level 3 directories 2026/09/30 01:59:20 INFO : A1/B2/C2: Removing directory 2026/09/30 01:59:20 INFO : A1/B1/C3: Removing directory 2026/09/30 01:59:21 DEBUG : removing 2 level 2 directories 2026/09/30 01:59:21 INFO : A3/B3: Removing directory 2026/09/30 01:59:21 INFO : A1/B2: Removing directory 2026/09/30 01:59:21 DEBUG : removing 2 level 1 directories 2026/09/30 01:59:21 INFO : A3: Removing directory 2026/09/30 01:59:21 INFO : A2: Removing directory 2026/09/30 01:59:25 DEBUG : removing 1 level 3 directories 2026/09/30 01:59:25 INFO : A1/B1/C1: Removing directory 2026/09/30 01:59:26 DEBUG : removing 1 level 2 directories 2026/09/30 01:59:26 INFO : A1/B1: Removing directory 2026/09/30 01:59:26 DEBUG : removing 1 level 1 directories 2026/09/30 01:59:26 INFO : A1: Removing directory 2026/09/30 01:59:26 DEBUG : removing 1 level 0 directories 2026/09/30 01:59:26 INFO : Cloudinary root 'rclone-test-beyiday8luki': Removing directory 2026/09/30 01:59:27 ERROR : error listing: directory not found 2026/09/30 01:59:27 ERROR : error listing: directory not found --- PASS: TestRmdirsNoLeaveRoot (14.09s) === RUN TestRmdirsLeaveRoot run.go:198: Remote "Cloudinary root 'rclone-test-beyiday8luki'", Local "Local file system at /tmp/rclone113397365", Modify Window "876000h0m0s" 2026/09/30 01:59:27 INFO : A1: Making directory 2026/09/30 01:59:27 INFO : A1/B1: Making directory 2026/09/30 01:59:27 INFO : A1/B1/C1: Making directory operations_test.go:827: Error Trace: /home/rclone/go/src/github.com/rclone/rclone/fs/operations/operations_test.go:827 Error: Received unexpected error: invalid character '<' looking for beginning of value Test: TestRmdirsLeaveRoot --- FAIL: TestRmdirsLeaveRoot (2.77s) === RUN TestRmdirsWithFilter run.go:198: Remote "Cloudinary root 'rclone-test-beyiday8luki'", Local "Local file system at /tmp/rclone113397365", Modify Window "876000h0m0s" 2026/09/30 01:59:30 INFO : A1: Making directory 2026/09/30 01:59:30 INFO : A1/B1: Making directory 2026/09/30 01:59:30 INFO : A1/B1/C1: Making directory 2026/09/30 01:59:33 DEBUG : removing 1 level 3 directories 2026/09/30 01:59:33 INFO : A1/B1/C1: Removing directory 2026/09/30 01:59:33 DEBUG : removing 1 level 2 directories 2026/09/30 01:59:33 INFO : A1/B1: Removing directory --- PASS: TestRmdirsWithFilter (5.93s) === RUN TestCopyURL run.go:198: Remote "Cloudinary root 'rclone-test-beyiday8luki'", Local "Local file system at /tmp/rclone113397365", Modify Window "876000h0m0s" 2026/09/30 01:59:36 DEBUG : file1: size = 14 OK 2026/09/30 01:59:36 DEBUG : file1: md5 = 081404b3d2ae5bf599add15b7445ac07 OK 2026/09/30 01:59:37 DEBUG : file1: size = 14 OK 2026/09/30 01:59:37 DEBUG : file1: md5 = 081404b3d2ae5bf599add15b7445ac07 OK operations_test.go:929: Error Trace: /home/rclone/go/src/github.com/rclone/rclone/fs/operations/operations_test.go:929 Error: An error is expected but got nil. Test: TestCopyURL --- FAIL: TestCopyURL (2.86s) === RUN TestCopyURLDownloadHeaders run.go:198: Remote "Cloudinary root 'rclone-test-beyiday8luki'", Local "Local file system at /tmp/rclone113397365", Modify Window "876000h0m0s" 2026/09/30 01:59:39 DEBUG : file1: size = 14 OK 2026/09/30 01:59:39 DEBUG : file1: md5 = 081404b3d2ae5bf599add15b7445ac07 OK --- PASS: TestCopyURLDownloadHeaders (1.52s) === RUN TestCopyURLToWriter --- PASS: TestCopyURLToWriter (0.00s) === RUN TestMoveFile run.go:198: Remote "Cloudinary root 'rclone-test-beyiday8luki'", Local "Local file system at /tmp/rclone113397365", Modify Window "876000h0m0s" 2026/09/30 01:59:40 DEBUG : file1: Need to transfer - File not found at Destination 2026/09/30 01:59:41 DEBUG : sub/file2: size = 14 OK 2026/09/30 01:59:41 DEBUG : file1: md5 = 0ef726ce9b1a7692357ff70dd321d595 OK 2026/09/30 01:59:41 INFO : file1: Copied (new) to: sub/file2 2026/09/30 01:59:41 INFO : file1: Deleted 2026/09/30 01:59:42 DEBUG : file1: Need to transfer - File not found at Destination 2026/09/30 01:59:42 DEBUG : sub/file2: size = 14 OK 2026/09/30 01:59:42 DEBUG : file1: md5 = 0ef726ce9b1a7692357ff70dd321d595 OK 2026/09/30 01:59:42 INFO : file1: Copied (new) to: sub/file2 2026/09/30 01:59:42 INFO : file1: Deleted 2026/09/30 01:59:43 DEBUG : Cloudinary root 'rclone-test-beyiday8luki': don't need to copy/move sub/file2, it is already at target location --- PASS: TestMoveFile (5.72s) === RUN TestMoveFileWithIgnoreExisting run.go:198: Remote "Cloudinary root 'rclone-test-beyiday8luki'", Local "Local file system at /tmp/rclone113397365", Modify Window "876000h0m0s" 2026/09/30 01:59:46 DEBUG : file1: Need to transfer - File not found at Destination 2026/09/30 01:59:46 DEBUG : file1: size = 14 OK 2026/09/30 01:59:46 DEBUG : file1: md5 = 0ef726ce9b1a7692357ff70dd321d595 OK 2026/09/30 01:59:46 INFO : file1: Copied (new) 2026/09/30 01:59:46 INFO : file1: Deleted 2026/09/30 01:59:47 DEBUG : file1: Destination exists, skipping 2026/09/30 01:59:47 DEBUG : file1: Not removing source file as destination file exists and --ignore-existing is set --- PASS: TestMoveFileWithIgnoreExisting (2.81s) === RUN TestMoveFileImmutable run.go:198: Remote "Cloudinary root 'rclone-test-beyiday8luki'", Local "Local file system at /tmp/rclone113397365", Modify Window "876000h0m0s" 2026/09/30 01:59:50 DEBUG : existing: Need to transfer - File not found at Destination 2026/09/30 01:59:50 DEBUG : existing: size = 8 OK 2026/09/30 01:59:50 DEBUG : existing: md5 = 53f8d64113036808686b056cc0b0f649 OK 2026/09/30 01:59:50 INFO : existing: Copied (new) 2026/09/30 01:59:50 INFO : existing: Deleted operations_test.go:1099: Error Trace: /home/rclone/go/src/github.com/rclone/rclone/fs/operations/operations_test.go:1099 Error: Expected error with "immutable file modified" in chain but got nil. Test: TestMoveFileImmutable fstest.go:299: Sleeping for 1s for list eventual consistency: 1/5 fstest.go:299: Sleeping for 2s for list eventual consistency: 2/5 fstest.go:299: Sleeping for 4s for list eventual consistency: 3/5 fstest.go:299: Sleeping for 8s for list eventual consistency: 4/5 fstest.go:299: Sleeping for 16s for list eventual consistency: 5/5 fstest.go:306: Error Trace: /home/rclone/go/src/github.com/rclone/rclone/fstest/fstest.go:306 /home/rclone/go/src/github.com/rclone/rclone/fstest/fstest.go:339 /home/rclone/go/src/github.com/rclone/rclone/fstest/fstest.go:351 /home/rclone/go/src/github.com/rclone/rclone/fstest/run.go:352 /home/rclone/go/src/github.com/rclone/rclone/fs/operations/operations_test.go:1100 Error: Should be true Test: TestMoveFileImmutable Messages: listing wrong, want existing (8) got fstest.go:204: Not found "existing" fstest.go:207: Error Trace: /home/rclone/go/src/github.com/rclone/rclone/fstest/fstest.go:207 /home/rclone/go/src/github.com/rclone/rclone/fstest/fstest.go:311 /home/rclone/go/src/github.com/rclone/rclone/fstest/fstest.go:339 /home/rclone/go/src/github.com/rclone/rclone/fstest/fstest.go:351 /home/rclone/go/src/github.com/rclone/rclone/fstest/run.go:352 /home/rclone/go/src/github.com/rclone/rclone/fs/operations/operations_test.go:1100 /usr/local/go/src/runtime/asm_amd64.s:1264 Error: Not equal: expected: 0 actual : 1 Test: TestMoveFileImmutable Messages: 1 objects not found fstest.go:299: Sleeping for 1s for list eventual consistency: 1/5 fstest.go:299: Sleeping for 2s for list eventual consistency: 2/5 fstest.go:299: Sleeping for 4s for list eventual consistency: 3/5 fstest.go:299: Sleeping for 8s for list eventual consistency: 4/5 fstest.go:299: Sleeping for 16s for list eventual consistency: 5/5 fstest.go:306: Error Trace: /home/rclone/go/src/github.com/rclone/rclone/fstest/fstest.go:306 /home/rclone/go/src/github.com/rclone/rclone/fstest/fstest.go:339 /home/rclone/go/src/github.com/rclone/rclone/fstest/fstest.go:351 /home/rclone/go/src/github.com/rclone/rclone/fstest/run.go:358 /home/rclone/go/src/github.com/rclone/rclone/fs/operations/operations_test.go:1101 Error: Should be true Test: TestMoveFileImmutable Messages: listing wrong, want existing (6) got existing (8) fstest.go:151: Error Trace: /home/rclone/go/src/github.com/rclone/rclone/fstest/fstest.go:151 /home/rclone/go/src/github.com/rclone/rclone/fstest/fstest.go:196 /home/rclone/go/src/github.com/rclone/rclone/fstest/fstest.go:309 /home/rclone/go/src/github.com/rclone/rclone/fstest/fstest.go:339 /home/rclone/go/src/github.com/rclone/rclone/fstest/fstest.go:351 /home/rclone/go/src/github.com/rclone/rclone/fstest/run.go:358 /home/rclone/go/src/github.com/rclone/rclone/fs/operations/operations_test.go:1101 Error: Not equal: expected: 6 actual : 8 Test: TestMoveFileImmutable Messages: existing: size incorrect file=6 vs obj=8 --- FAIL: TestMoveFileImmutable (67.86s) === RUN TestCaseInsensitiveMoveFile run.go:198: Remote "Cloudinary root 'rclone-test-beyiday8luki'", Local "Local file system at /tmp/rclone113397365", Modify Window "876000h0m0s" --- PASS: TestCaseInsensitiveMoveFile (0.87s) === RUN TestCaseInsensitiveMoveFileDryRun run.go:198: Remote "Cloudinary root 'rclone-test-beyiday8luki'", Local "Local file system at /tmp/rclone113397365", Modify Window "876000h0m0s" --- PASS: TestCaseInsensitiveMoveFileDryRun (0.76s) === RUN TestMoveFileBackupDir run.go:198: Remote "Cloudinary root 'rclone-test-beyiday8luki'", Local "Local file system at /tmp/rclone113397365", Modify Window "876000h0m0s" operations_test.go:1161: Skipping test as remote does not support server-side move or copy --- SKIP: TestMoveFileBackupDir (0.80s) === RUN TestSameConfig --- PASS: TestSameConfig (0.00s) === RUN TestSame --- PASS: TestSame (0.00s) === RUN TestOverlappingFilterCheckWithoutFilter --- PASS: TestOverlappingFilterCheckWithoutFilter (0.00s) === RUN TestOverlappingFilterCheckWithFilter --- PASS: TestOverlappingFilterCheckWithFilter (0.00s) === RUN TestListFormat --- PASS: TestListFormat (0.00s) === RUN TestDirMoveMoveError run.go:198: Remote "Cloudinary root 'rclone-test-beyiday8luki'", Local "Local file system at /tmp/rclone113397365", Modify Window "876000h0m0s" operations_test.go:1490: Skipping test on non local remote --- SKIP: TestDirMoveMoveError (21.09s) === RUN TestDirMoveContext run.go:198: Remote "Cloudinary root 'rclone-test-beyiday8luki'", Local "Local file system at /tmp/rclone113397365", Modify Window "876000h0m0s" operations_test.go:1490: Skipping test on non local remote --- SKIP: TestDirMoveContext (3.28s) === RUN TestDirMove run.go:198: Remote "Cloudinary root 'rclone-test-beyiday8luki'", Local "Local file system at /tmp/rclone113397365", Modify Window "876000h0m0s" 2026/09/30 02:01:27 INFO : A1/B2: Making directory 2026/09/30 02:01:27 INFO : A1/B1/C3: Making directory 2026/09/30 02:01:32 DEBUG : A2/B1/three: size = 5 OK 2026/09/30 02:01:32 DEBUG : A1/B1/three: Src hash empty - aborting Dst hash check 2026/09/30 02:01:32 INFO : A1/B1/three: Copied (new) to: A2/B1/three 2026/09/30 02:01:33 DEBUG : A2/two: size = 3 OK 2026/09/30 02:01:33 DEBUG : A1/two: Src hash empty - aborting Dst hash check 2026/09/30 02:01:33 INFO : A1/two: Copied (new) to: A2/two 2026/09/30 02:01:33 DEBUG : A2/B1/C2/five: size = 4 OK 2026/09/30 02:01:33 DEBUG : A1/B1/C2/five: Src hash empty - aborting Dst hash check 2026/09/30 02:01:33 INFO : A1/B1/C2/five: Copied (new) to: A2/B1/C2/five 2026/09/30 02:01:33 DEBUG : A2/B1/C1/four: size = 4 OK 2026/09/30 02:01:33 DEBUG : A1/B1/C1/four: Src hash empty - aborting Dst hash check 2026/09/30 02:01:33 INFO : A1/B1/C1/four: Copied (new) to: A2/B1/C1/four 2026/09/30 02:01:33 INFO : A1/B1/three: Deleted 2026/09/30 02:01:33 DEBUG : A2/one: size = 3 OK 2026/09/30 02:01:33 DEBUG : A1/one: Src hash empty - aborting Dst hash check 2026/09/30 02:01:33 INFO : A1/one: Copied (new) to: A2/one 2026/09/30 02:01:33 INFO : A1/B1/C2/five: Deleted 2026/09/30 02:01:33 INFO : A1/B1/C1/four: Deleted 2026/09/30 02:01:33 INFO : A1/one: Deleted 2026/09/30 02:01:33 INFO : A1/two: Deleted 2026/09/30 02:01:44 DEBUG : A3/one: size = 3 OK 2026/09/30 02:01:44 DEBUG : A2/one: Src hash empty - aborting Dst hash check 2026/09/30 02:01:44 INFO : A2/one: Copied (new) to: A3/one 2026/09/30 02:01:44 DEBUG : A3/B1/C1/four: size = 4 OK 2026/09/30 02:01:44 DEBUG : A2/B1/C1/four: Src hash empty - aborting Dst hash check 2026/09/30 02:01:44 INFO : A2/B1/C1/four: Copied (new) to: A3/B1/C1/four 2026/09/30 02:01:44 DEBUG : A3/B1/three: size = 5 OK 2026/09/30 02:01:44 DEBUG : A2/B1/three: Src hash empty - aborting Dst hash check 2026/09/30 02:01:44 INFO : A2/B1/three: Copied (new) to: A3/B1/three 2026/09/30 02:01:44 INFO : A2/one: Deleted 2026/09/30 02:01:44 DEBUG : A3/B1/C2/five: size = 4 OK 2026/09/30 02:01:44 DEBUG : A2/B1/C2/five: Src hash empty - aborting Dst hash check 2026/09/30 02:01:44 INFO : A2/B1/C2/five: Copied (new) to: A3/B1/C2/five 2026/09/30 02:01:45 INFO : A2/B1/C1/four: Deleted 2026/09/30 02:01:45 DEBUG : A3/two: size = 3 OK 2026/09/30 02:01:45 DEBUG : A2/two: Src hash empty - aborting Dst hash check 2026/09/30 02:01:45 INFO : A2/two: Copied (new) to: A3/two 2026/09/30 02:01:45 INFO : A2/B1/C2/five: Deleted 2026/09/30 02:01:45 INFO : A2/B1/three: Deleted 2026/09/30 02:01:45 INFO : A2/two: Deleted 2026/09/30 02:01:49 INFO : Cloudinary root 'rclone-test-beyiday8luki': Can't DirMove - falling back to file moves: can't move directory - incompatible remotes 2026/09/30 02:01:52 DEBUG : A4/B1/C2/five: size = 4 OK 2026/09/30 02:01:52 DEBUG : A3/B1/C2/five: Src hash empty - aborting Dst hash check 2026/09/30 02:01:52 INFO : A3/B1/C2/five: Copied (new) to: A4/B1/C2/five 2026/09/30 02:01:52 DEBUG : A4/one: size = 3 OK 2026/09/30 02:01:52 DEBUG : A3/one: Src hash empty - aborting Dst hash check 2026/09/30 02:01:52 INFO : A3/one: Copied (new) to: A4/one 2026/09/30 02:01:52 DEBUG : A4/B1/C1/four: size = 4 OK 2026/09/30 02:01:52 DEBUG : A3/B1/C1/four: Src hash empty - aborting Dst hash check 2026/09/30 02:01:52 INFO : A3/B1/C1/four: Copied (new) to: A4/B1/C1/four 2026/09/30 02:01:53 DEBUG : A4/two: size = 3 OK 2026/09/30 02:01:53 DEBUG : A3/two: Src hash empty - aborting Dst hash check 2026/09/30 02:01:53 INFO : A3/two: Copied (new) to: A4/two 2026/09/30 02:01:53 INFO : A3/B1/C2/five: Deleted 2026/09/30 02:01:53 DEBUG : A4/B1/three: size = 5 OK 2026/09/30 02:01:53 DEBUG : A3/B1/three: Src hash empty - aborting Dst hash check 2026/09/30 02:01:53 INFO : A3/B1/three: Copied (new) to: A4/B1/three 2026/09/30 02:01:53 INFO : A3/one: Deleted 2026/09/30 02:01:53 INFO : A3/two: Deleted 2026/09/30 02:01:53 INFO : A3/B1/C1/four: Deleted 2026/09/30 02:01:53 INFO : A3/B1/three: Deleted --- PASS: TestDirMove (39.84s) === RUN TestGetFsInfo run.go:198: Remote "Cloudinary root 'rclone-test-beyiday8luki'", Local "Local file system at /tmp/rclone113397365", Modify Window "876000h0m0s" --- PASS: TestGetFsInfo (0.63s) === RUN TestRcat === RUN TestRcat/withChecksum=false,ignoreChecksum=false run.go:198: Remote "Cloudinary root 'rclone-test-beyiday8luki'", Local "Local file system at /tmp/rclone113397365", Modify Window "876000h0m0s" 2026/09/30 02:02:04 DEBUG : Cloudinary root 'rclone-test-beyiday8luki': File to upload is small (34 bytes), uploading instead of streaming 2026/09/30 02:02:04 DEBUG : no_checksum_small_file_from_pipe: size = 34 OK 2026/09/30 02:02:04 DEBUG : no_checksum_small_file_from_pipe: md5 = 4c762bc6ec18f21b23fcae426c7863b5 OK 2026/09/30 02:02:04 DEBUG : no_checksum_small_file_from_pipe: Size and md5 of src and dst objects identical 2026/09/30 02:02:05 DEBUG : Cloudinary root 'rclone-test-beyiday8luki': Target remote doesn't support streaming uploads, creating temporary local FS to spool file 2026/09/30 02:02:05 DEBUG : no_checksum_big_file_from_pipe: size = 102401 OK 2026/09/30 02:02:05 DEBUG : no_checksum_big_file_from_pipe: md5 = fffc7956ba9a7b58a63c01b6ce1ddc45 OK 2026/09/30 02:02:05 DEBUG : no_checksum_big_file_from_pipe: Size and md5 of src and dst objects identical === RUN TestRcat/withChecksum=true,ignoreChecksum=false run.go:198: Remote "Cloudinary root 'rclone-test-beyiday8luki'", Local "Local file system at /tmp/rclone113397365", Modify Window "876000h0m0s" 2026/09/30 02:02:08 DEBUG : Cloudinary root 'rclone-test-beyiday8luki': File to upload is small (34 bytes), uploading instead of streaming 2026/09/30 02:02:08 DEBUG : with_checksum_small_file_from_pipe: size = 34 OK 2026/09/30 02:02:08 DEBUG : with_checksum_small_file_from_pipe: md5 = 4c762bc6ec18f21b23fcae426c7863b5 OK 2026/09/30 02:02:08 DEBUG : with_checksum_small_file_from_pipe: Size and md5 of src and dst objects identical 2026/09/30 02:02:08 DEBUG : Cloudinary root 'rclone-test-beyiday8luki': Target remote doesn't support streaming uploads, creating temporary local FS to spool file 2026/09/30 02:02:09 DEBUG : with_checksum_big_file_from_pipe: size = 102401 OK 2026/09/30 02:02:09 DEBUG : with_checksum_big_file_from_pipe: md5 = fffc7956ba9a7b58a63c01b6ce1ddc45 OK 2026/09/30 02:02:09 DEBUG : with_checksum_big_file_from_pipe: Size and md5 of src and dst objects identical === RUN TestRcat/withChecksum=false,ignoreChecksum=true run.go:198: Remote "Cloudinary root 'rclone-test-beyiday8luki'", Local "Local file system at /tmp/rclone113397365", Modify Window "876000h0m0s" 2026/09/30 02:02:11 DEBUG : Cloudinary root 'rclone-test-beyiday8luki': File to upload is small (34 bytes), uploading instead of streaming 2026/09/30 02:02:12 DEBUG : ignore_checksum_small_file_from_pipe: size = 34 OK 2026/09/30 02:02:12 DEBUG : ignore_checksum_small_file_from_pipe: Sizes identical 2026/09/30 02:02:12 DEBUG : Cloudinary root 'rclone-test-beyiday8luki': Target remote doesn't support streaming uploads, creating temporary local FS to spool file 2026/09/30 02:02:12 DEBUG : ignore_checksum_big_file_from_pipe: size = 102401 OK 2026/09/30 02:02:12 DEBUG : ignore_checksum_big_file_from_pipe: Sizes identical === RUN TestRcat/withChecksum=true,ignoreChecksum=true run.go:198: Remote "Cloudinary root 'rclone-test-beyiday8luki'", Local "Local file system at /tmp/rclone113397365", Modify Window "876000h0m0s" 2026/09/30 02:02:14 DEBUG : Cloudinary root 'rclone-test-beyiday8luki': File to upload is small (34 bytes), uploading instead of streaming 2026/09/30 02:02:15 DEBUG : ignore_checksum_small_file_from_pipe: size = 34 OK 2026/09/30 02:02:15 DEBUG : ignore_checksum_small_file_from_pipe: Src hash empty - aborting Dst hash check 2026/09/30 02:02:15 DEBUG : ignore_checksum_small_file_from_pipe: Size of src and dst objects identical 2026/09/30 02:02:15 DEBUG : Cloudinary root 'rclone-test-beyiday8luki': Target remote doesn't support streaming uploads, creating temporary local FS to spool file 2026/09/30 02:02:16 DEBUG : ignore_checksum_big_file_from_pipe: size = 102401 OK 2026/09/30 02:02:16 DEBUG : ignore_checksum_big_file_from_pipe: Src hash empty - aborting Dst hash check 2026/09/30 02:02:16 DEBUG : ignore_checksum_big_file_from_pipe: Size of src and dst objects identical --- PASS: TestRcat (13.91s) --- PASS: TestRcat/withChecksum=false,ignoreChecksum=false (3.54s) --- PASS: TestRcat/withChecksum=true,ignoreChecksum=false (3.58s) --- PASS: TestRcat/withChecksum=false,ignoreChecksum=true (3.33s) --- PASS: TestRcat/withChecksum=true,ignoreChecksum=true (3.46s) === RUN TestRcatMetadata run.go:198: Remote "Cloudinary root 'rclone-test-beyiday8luki'", Local "Local file system at /tmp/rclone113397365", Modify Window "876000h0m0s" operations_test.go:1745: Skipping as destination doesn't support user metadata --- SKIP: TestRcatMetadata (0.65s) === RUN TestRcatSize run.go:198: Remote "Cloudinary root 'rclone-test-beyiday8luki'", Local "Local file system at /tmp/rclone113397365", Modify Window "876000h0m0s" 2026/09/30 02:02:19 DEBUG : potato1: size = 60 OK 2026/09/30 02:02:19 DEBUG : potato1: md5 = d6548b156ea68a4e003e786df99eee76 OK 2026/09/30 02:02:19 DEBUG : Cloudinary root 'rclone-test-beyiday8luki': File to upload is small (60 bytes), uploading instead of streaming 2026/09/30 02:02:20 DEBUG : potato2: size = 60 OK 2026/09/30 02:02:20 DEBUG : potato2: md5 = d6548b156ea68a4e003e786df99eee76 OK 2026/09/30 02:02:20 DEBUG : potato2: Size and md5 of src and dst objects identical --- PASS: TestRcatSize (3.06s) === RUN TestRcatSizeShortEOF run.go:198: Remote "Cloudinary root 'rclone-test-beyiday8luki'", Local "Local file system at /tmp/rclone113397365", Modify Window "876000h0m0s" 2026/09/30 02:02:22 DEBUG : potato1: size = 120 (Cloudinary root 'rclone-test-beyiday8luki') 2026/09/30 02:02:22 DEBUG : potato1: size = 60 (Cloudinary root 'rclone-test-beyiday8luki') 2026/09/30 02:02:22 ERROR : potato1: corrupted on transfer: sizes differ src 120 vs dst(Cloudinary root 'rclone-test-beyiday8luki') 60 2026/09/30 02:02:22 INFO : potato1: Removing failed copy --- PASS: TestRcatSizeShortEOF (1.42s) === RUN TestRcatSizeMetadata run.go:198: Remote "Cloudinary root 'rclone-test-beyiday8luki'", Local "Local file system at /tmp/rclone113397365", Modify Window "876000h0m0s" operations_test.go:1838: Skipping as destination doesn't support user metadata --- SKIP: TestRcatSizeMetadata (0.55s) === RUN TestRcatSizeUploadHeaders run.go:198: Remote "Cloudinary root 'rclone-test-beyiday8luki'", Local "Local file system at /tmp/rclone113397365", Modify Window "876000h0m0s" 2026/09/30 02:02:24 DEBUG : potato1: size = 60 OK 2026/09/30 02:02:24 DEBUG : potato1: md5 = d6548b156ea68a4e003e786df99eee76 OK --- PASS: TestRcatSizeUploadHeaders (1.57s) === RUN TestRcatSizeChecksum === RUN TestRcatSizeChecksum/Corrupted run.go:198: Remote "Cloudinary root 'rclone-test-beyiday8luki'", Local "Local file system at /tmp/rclone113397365", Modify Window "876000h0m0s" 2026/09/30 02:02:25 DEBUG : potato1: size = 60 OK 2026/09/30 02:02:25 DEBUG : potato1: md5 = d6548b156ea68a4e003e786df99eee76 (Cloudinary root 'rclone-test-beyiday8luki') 2026/09/30 02:02:25 DEBUG : potato1: md5 = 771ba8b5f9b1a1201c9f9bb57bf74b99 (Cloudinary root 'rclone-test-beyiday8luki') 2026/09/30 02:02:25 ERROR : potato1: corrupted on transfer: md5 hashes differ src "d6548b156ea68a4e003e786df99eee76" vs dst(Cloudinary root 'rclone-test-beyiday8luki') "771ba8b5f9b1a1201c9f9bb57bf74b99" 2026/09/30 02:02:25 INFO : potato1: Removing failed copy === RUN TestRcatSizeChecksum/SizeDiffers run.go:198: Remote "Cloudinary root 'rclone-test-beyiday8luki'", Local "Local file system at /tmp/rclone113397365", Modify Window "876000h0m0s" 2026/09/30 02:02:27 DEBUG : potato4: size = 60 (Cloudinary root 'rclone-test-beyiday8luki') 2026/09/30 02:02:27 DEBUG : potato4: size = 59 (Cloudinary root 'rclone-test-beyiday8luki') 2026/09/30 02:02:27 ERROR : potato4: corrupted on transfer: sizes differ src 60 vs dst(Cloudinary root 'rclone-test-beyiday8luki') 59 2026/09/30 02:02:27 INFO : potato4: Removing failed copy === RUN TestRcatSizeChecksum/IgnoreChecksum run.go:198: Remote "Cloudinary root 'rclone-test-beyiday8luki'", Local "Local file system at /tmp/rclone113397365", Modify Window "876000h0m0s" 2026/09/30 02:02:29 DEBUG : potato2: size = 60 OK === RUN TestRcatSizeChecksum/NoHashes run.go:198: Remote "Cloudinary root 'rclone-test-beyiday8luki'", Local "Local file system at /tmp/rclone113397365", Modify Window "876000h0m0s" 2026/09/30 02:02:31 DEBUG : potato3: size = 60 OK --- PASS: TestRcatSizeChecksum (6.80s) --- PASS: TestRcatSizeChecksum/Corrupted (1.89s) --- PASS: TestRcatSizeChecksum/SizeDiffers (1.71s) --- PASS: TestRcatSizeChecksum/IgnoreChecksum (1.50s) --- PASS: TestRcatSizeChecksum/NoHashes (1.70s) === RUN TestTouchDir run.go:198: Remote "Cloudinary root 'rclone-test-beyiday8luki'", Local "Local file system at /tmp/rclone113397365", Modify Window "876000h0m0s" operations_test.go:2020: Skipping test as remote does not support modtime --- SKIP: TestTouchDir (0.51s) === RUN TestMkdirMetadata run.go:198: Remote "Cloudinary root 'rclone-test-beyiday8luki'", Local "Local file system at /tmp/rclone113397365", Modify Window "876000h0m0s" operations_test.go:2058: Skipping test as remote does not support MkdirMetadata --- SKIP: TestMkdirMetadata (0.57s) === RUN TestMkdirModTime run.go:198: Remote "Cloudinary root 'rclone-test-beyiday8luki'", Local "Local file system at /tmp/rclone113397365", Modify Window "876000h0m0s" operations_test.go:2079: Skipping test as remote does not support DirSetModTime or MkdirMetadata --- SKIP: TestMkdirModTime (0.53s) === RUN TestCopyDirMetadata run.go:198: Remote "Cloudinary root 'rclone-test-beyiday8luki'", Local "Local file system at /tmp/rclone113397365", Modify Window "876000h0m0s" operations_test.go:2123: Skipping test as remote does not support WriteDirMetadata or MkdirMetadata --- SKIP: TestCopyDirMetadata (0.57s) === RUN TestSetDirModTime run.go:198: Remote "Cloudinary root 'rclone-test-beyiday8luki'", Local "Local file system at /tmp/rclone113397365", Modify Window "876000h0m0s" operations_test.go:2161: Skipping test as remote does not support DirSetModTime or WriteDirSetModTime --- SKIP: TestSetDirModTime (0.57s) === RUN TestDirsEqual run.go:198: Remote "Cloudinary root 'rclone-test-beyiday8luki'", Local "Local file system at /tmp/rclone113397365", Modify Window "876000h0m0s" operations_test.go:2212: Skipping test as remote does not support WriteDirMetadata or MkdirMetadata --- SKIP: TestDirsEqual (0.54s) === RUN TestRemoveExisting run.go:198: Remote "Cloudinary root 'rclone-test-beyiday8luki'", Local "Local file system at /tmp/rclone113397365", Modify Window "876000h0m0s" operations_test.go:2281: Skipping as remote can't Move --- SKIP: TestRemoveExisting (0.53s) === RUN TestRcatInputFailurePreservesDestination 2026/09/30 02:02:35 DEBUG : Creating backend with remote "/tmp/TestRcatInputFailurePreservesDestination2273251127/001" --- PASS: TestRcatInputFailurePreservesDestination (0.00s) === RUN TestRcAbout rc_test.go:31: Skipping test on non local remote --- SKIP: TestRcAbout (0.00s) === RUN TestRcCleanup rc_test.go:31: Skipping test on non local remote --- SKIP: TestRcCleanup (0.00s) === RUN TestRcCopyfile rc_test.go:31: Skipping test on non local remote --- SKIP: TestRcCopyfile (0.00s) === RUN TestRcCopyurl rc_test.go:31: Skipping test on non local remote --- SKIP: TestRcCopyurl (0.00s) === RUN TestRcDelete rc_test.go:31: Skipping test on non local remote --- SKIP: TestRcDelete (0.00s) === RUN TestRcDeletefile rc_test.go:31: Skipping test on non local remote --- SKIP: TestRcDeletefile (0.00s) === RUN TestRcList rc_test.go:31: Skipping test on non local remote --- SKIP: TestRcList (0.00s) === RUN TestRcStat rc_test.go:31: Skipping test on non local remote --- SKIP: TestRcStat (0.00s) === RUN TestRcSetTier rc_test.go:31: Skipping test on non local remote --- SKIP: TestRcSetTier (0.00s) === RUN TestRcSetTierFile rc_test.go:31: Skipping test on non local remote --- SKIP: TestRcSetTierFile (0.00s) === RUN TestRcMkdir rc_test.go:31: Skipping test on non local remote --- SKIP: TestRcMkdir (0.00s) === RUN TestRcMovefile rc_test.go:31: Skipping test on non local remote --- SKIP: TestRcMovefile (0.00s) === RUN TestRcPurge rc_test.go:31: Skipping test on non local remote --- SKIP: TestRcPurge (0.00s) === RUN TestRcRmdir rc_test.go:31: Skipping test on non local remote --- SKIP: TestRcRmdir (0.00s) === RUN TestRcRmdirs rc_test.go:31: Skipping test on non local remote --- SKIP: TestRcRmdirs (0.00s) === RUN TestRcSize rc_test.go:31: Skipping test on non local remote --- SKIP: TestRcSize (0.00s) === RUN TestRcPublicLink rc_test.go:31: Skipping test on non local remote --- SKIP: TestRcPublicLink (0.00s) === RUN TestRcFsInfo rc_test.go:31: Skipping test on non local remote --- SKIP: TestRcFsInfo (0.00s) === RUN TestUploadFile rc_test.go:31: Skipping test on non local remote --- SKIP: TestUploadFile (0.00s) === RUN TestRcCommand rc_test.go:31: Skipping test on non local remote --- SKIP: TestRcCommand (0.00s) === RUN TestRcDu rc_test.go:31: Skipping test on non local remote --- SKIP: TestRcDu (0.00s) === RUN TestRcCheck rc_test.go:31: Skipping test on non local remote --- SKIP: TestRcCheck (0.00s) === RUN TestRcHashsum rc_test.go:31: Skipping test on non local remote --- SKIP: TestRcHashsum (0.00s) === RUN TestRcHashsumSingleFile rc_test.go:31: Skipping test on non local remote --- SKIP: TestRcHashsumSingleFile (0.00s) === RUN TestRcHashsumFile rc_test.go:31: Skipping test on non local remote --- SKIP: TestRcHashsumFile (0.00s) === RUN TestRcGetFile rc_test.go:31: Skipping test on non local remote --- SKIP: TestRcGetFile (0.00s) FAIL 2026/09/30 02:02:36 DEBUG : Cloudinary root 'rclone-test-beyiday8luki': Purge dir "" "./operations.test -test.v -test.timeout 1h0m0s -remote TestCloudinary: -list-retries 5 -verbose" - Finished ERROR in 12m46.954244178s (try 1/5): exit status 1: Failed [TestCopyFileImmutable TestIndex TestIndexFilter TestIndexRules TestIndexMaxDepth TestIndexLinkIndex TestIndexDirTime TestIndexTemplate TestIndexChanged TestIndexChangedDelete TestIndexChangedFiles TestLsWithFilesFrom TestRmdirsLeaveRoot]