"./sync.test -test.v -test.timeout 1h0m0s -remote 'TestGoogleCloudStorage,directory_markers:' -verbose -test.run '^(TestSyncCompareDest|TestSyncMultipleCompareDest|TestSyncOverlapWithFilter)$'" - Starting (try 2/5)
2025/03/28 01:46:42 DEBUG : Creating backend with remote "TestGoogleCloudStorage,directory_markers:rclone-test-qudoric5fuzu"
2025/03/28 01:46:42 DEBUG : Using config file from "/home/rclone/.rclone.conf"
2025/03/28 01:46:42 DEBUG : TestGoogleCloudStorage: detected overridden config - adding "{juk_h}" suffix to name
2025/03/28 01:46:42 DEBUG : Creating backend with remote "/tmp/rclone2030427926"
=== RUN   TestSyncOverlapWithFilter
    run.go:180: Remote "GCS bucket rclone-test-qudoric5fuzu", Local "Local file system at /tmp/rclone2030427926", Modify Window "1ns"
2025/03/28 01:46:42 DEBUG : Creating backend with remote "TestGoogleCloudStorage,directory_markers:rclone-test-qudoric5fuzu/rclone-sync-test"
2025/03/28 01:46:42 DEBUG : TestGoogleCloudStorage: detected overridden config - adding "{juk_h}" suffix to name
2025/03/28 01:46:44 DEBUG : /: Creating directory marker
2025/03/28 01:46:44 DEBUG : Creating backend with remote "TestGoogleCloudStorage,directory_markers:rclone-test-qudoric5fuzu/rclone-sync-test-include/layer2"
2025/03/28 01:46:44 DEBUG : TestGoogleCloudStorage: detected overridden config - adding "{juk_h}" suffix to name
2025/03/28 01:46:45 DEBUG : /: Creating directory marker
2025/03/28 01:46:45 DEBUG : Creating backend with remote "TestGoogleCloudStorage,directory_markers:rclone-test-qudoric5fuzu/rclone-sync-test-ignore-file"
2025/03/28 01:46:45 DEBUG : TestGoogleCloudStorage: detected overridden config - adding "{juk_h}" suffix to name
2025/03/28 01:46:46 DEBUG : /: Creating directory marker
2025/03/28 01:46:47 DEBUG : rclone-sync-test-ignore-file/: Creating directory marker
2025/03/28 01:46:48 DEBUG : rclone-sync-test-ignore-file: Excluded
2025/03/28 01:46:48 ERROR : : Entry doesn't belong in directory "" (same as directory) - ignoring
2025/03/28 01:46:49 DEBUG : rclone-sync-test: Excluded
2025/03/28 01:46:49 DEBUG : rclone-sync-test-include/layer2: Excluded
2025/03/28 01:46:49 DEBUG : GCS bucket rclone-test-qudoric5fuzu path rclone-sync-test: Waiting for checks to finish
2025/03/28 01:46:49 DEBUG : GCS bucket rclone-test-qudoric5fuzu path rclone-sync-test: Waiting for transfers to finish
2025/03/28 01:46:49 DEBUG : Waiting for deletions to finish
2025/03/28 01:46:49 INFO  : There was nothing to transfer
2025/03/28 01:46:50 DEBUG : rclone-sync-test-ignore-file: Excluded
2025/03/28 01:46:50 ERROR : : Entry doesn't belong in directory "" (same as directory) - ignoring
2025/03/28 01:46:50 DEBUG : rclone-sync-test: Excluded
2025/03/28 01:46:51 DEBUG : rclone-sync-test-include/layer2: Excluded
2025/03/28 01:46:51 DEBUG : GCS bucket rclone-test-qudoric5fuzu: Waiting for checks to finish
2025/03/28 01:46:51 DEBUG : GCS bucket rclone-test-qudoric5fuzu: Waiting for transfers to finish
2025/03/28 01:46:51 DEBUG : Waiting for deletions to finish
2025/03/28 01:46:51 INFO  : rclone-sync-test-include: Removing directory
2025/03/28 01:46:51 DEBUG : rclone-sync-test-include/: Removing directory marker
2025/03/28 01:46:51 DEBUG : rclone-sync-test-include: Failed to Rmdir: removing directory marker failed: googleapi: Error 404: No such object: rclone-test-qudoric5fuzu/rclone-sync-test-include/, notFound
2025/03/28 01:46:51 DEBUG : GCS bucket rclone-test-qudoric5fuzu: failed to delete 1 directories
2025/03/28 01:46:51 INFO  : There was nothing to transfer
    run.go:180: Remote "GCS bucket rclone-test-qudoric5fuzu", Local "Local file system at /tmp/rclone2030427926", Modify Window "1ns"
2025/03/28 01:46:51 DEBUG : rclone-sync-test-ignore-file: Excluded
2025/03/28 01:46:52 DEBUG : rclone-sync-test: Excluded
2025/03/28 01:46:52 DEBUG : rclone-sync-test-include/layer2: Excluded
    run.go:180: Remote "GCS bucket rclone-test-qudoric5fuzu", Local "Local file system at /tmp/rclone2030427926", Modify Window "1ns"
2025/03/28 01:46:53 DEBUG : rclone-sync-test-ignore-file: Excluded
2025/03/28 01:46:53 DEBUG : rclone-sync-test: Excluded
2025/03/28 01:46:54 DEBUG : rclone-sync-test-include/layer2: Excluded
    run.go:180: Remote "GCS bucket rclone-test-qudoric5fuzu", Local "Local file system at /tmp/rclone2030427926", Modify Window "1ns"
2025/03/28 01:46:54 DEBUG : rclone-sync-test-ignore-file: Excluded
2025/03/28 01:46:55 DEBUG : rclone-sync-test: Excluded
2025/03/28 01:46:55 DEBUG : rclone-sync-test-include/layer2: Excluded
    run.go:180: Remote "GCS bucket rclone-test-qudoric5fuzu", Local "Local file system at /tmp/rclone2030427926", Modify Window "1ns"
2025/03/28 01:46:55 DEBUG : rclone-sync-test-ignore-file: Excluded
2025/03/28 01:46:56 DEBUG : rclone-sync-test: Excluded
2025/03/28 01:46:57 DEBUG : rclone-sync-test-include/layer2: Excluded
    run.go:180: Remote "GCS bucket rclone-test-qudoric5fuzu", Local "Local file system at /tmp/rclone2030427926", Modify Window "1ns"
2025/03/28 01:46:57 DEBUG : rclone-sync-test-ignore-file: Excluded
2025/03/28 01:46:58 DEBUG : rclone-sync-test: Excluded
2025/03/28 01:46:58 DEBUG : rclone-sync-test-include/layer2: Excluded
    run.go:180: Remote "GCS bucket rclone-test-qudoric5fuzu", Local "Local file system at /tmp/rclone2030427926", Modify Window "1ns"
2025/03/28 01:46:58 DEBUG : rclone-sync-test-ignore-file: Excluded
2025/03/28 01:46:59 DEBUG : rclone-sync-test: Excluded
2025/03/28 01:46:59 DEBUG : rclone-sync-test-include/layer2: Excluded
2025/03/28 01:47:00 DEBUG : rclone-sync-test-ignore-file: Excluded
2025/03/28 01:47:00 ERROR : : Entry doesn't belong in directory "" (same as directory) - ignoring
2025/03/28 01:47:00 DEBUG : rclone-sync-test: Excluded
2025/03/28 01:47:01 DEBUG : rclone-sync-test-include/layer2: Excluded
2025/03/28 01:47:01 DEBUG : GCS bucket rclone-test-qudoric5fuzu path rclone-sync-test-include/layer2: Waiting for checks to finish
2025/03/28 01:47:01 DEBUG : GCS bucket rclone-test-qudoric5fuzu path rclone-sync-test-include/layer2: Waiting for transfers to finish
2025/03/28 01:47:01 DEBUG : Waiting for deletions to finish
2025/03/28 01:47:01 INFO  : There was nothing to transfer
    run.go:180: Remote "GCS bucket rclone-test-qudoric5fuzu", Local "Local file system at /tmp/rclone2030427926", Modify Window "1ns"
2025/03/28 01:47:01 DEBUG : rclone-sync-test-ignore-file: Excluded
2025/03/28 01:47:01 DEBUG : rclone-sync-test: Excluded
2025/03/28 01:47:02 DEBUG : rclone-sync-test-include/layer2: Excluded
    run.go:180: Remote "GCS bucket rclone-test-qudoric5fuzu", Local "Local file system at /tmp/rclone2030427926", Modify Window "1ns"
2025/03/28 01:47:02 DEBUG : rclone-sync-test-ignore-file: Excluded
2025/03/28 01:47:03 DEBUG : rclone-sync-test: Excluded
2025/03/28 01:47:03 DEBUG : rclone-sync-test-include/layer2: Excluded
2025/03/28 01:47:04 DEBUG : rclone-sync-test-ignore-file: Excluded
2025/03/28 01:47:04 ERROR : : Entry doesn't belong in directory "" (same as directory) - ignoring
2025/03/28 01:47:04 DEBUG : rclone-sync-test: Excluded
2025/03/28 01:47:05 DEBUG : rclone-sync-test-include/layer2: Excluded
2025/03/28 01:47:05 DEBUG : GCS bucket rclone-test-qudoric5fuzu: Waiting for checks to finish
2025/03/28 01:47:05 DEBUG : GCS bucket rclone-test-qudoric5fuzu: Waiting for transfers to finish
2025/03/28 01:47:05 DEBUG : Waiting for deletions to finish
2025/03/28 01:47:05 INFO  : rclone-sync-test-include: Removing directory
2025/03/28 01:47:05 DEBUG : rclone-sync-test-include/: Removing directory marker
2025/03/28 01:47:05 DEBUG : rclone-sync-test-include: Failed to Rmdir: removing directory marker failed: googleapi: Error 404: No such object: rclone-test-qudoric5fuzu/rclone-sync-test-include/, notFound
2025/03/28 01:47:05 DEBUG : GCS bucket rclone-test-qudoric5fuzu: failed to delete 1 directories
2025/03/28 01:47:05 INFO  : There was nothing to transfer
    run.go:180: Remote "GCS bucket rclone-test-qudoric5fuzu", Local "Local file system at /tmp/rclone2030427926", Modify Window "1ns"
2025/03/28 01:47:05 DEBUG : rclone-sync-test-ignore-file: Excluded
2025/03/28 01:47:06 DEBUG : rclone-sync-test: Excluded
2025/03/28 01:47:06 DEBUG : rclone-sync-test-include/layer2: Excluded
    run.go:180: Remote "GCS bucket rclone-test-qudoric5fuzu", Local "Local file system at /tmp/rclone2030427926", Modify Window "1ns"
2025/03/28 01:47:07 DEBUG : rclone-sync-test-ignore-file: Excluded
2025/03/28 01:47:07 DEBUG : rclone-sync-test: Excluded
2025/03/28 01:47:08 DEBUG : rclone-sync-test-include/layer2: Excluded
    run.go:180: Remote "GCS bucket rclone-test-qudoric5fuzu", Local "Local file system at /tmp/rclone2030427926", Modify Window "1ns"
2025/03/28 01:47:08 DEBUG : rclone-sync-test-ignore-file: Excluded
2025/03/28 01:47:09 DEBUG : rclone-sync-test: Excluded
2025/03/28 01:47:09 DEBUG : rclone-sync-test-include/layer2: Excluded
    run.go:180: Remote "GCS bucket rclone-test-qudoric5fuzu", Local "Local file system at /tmp/rclone2030427926", Modify Window "1ns"
2025/03/28 01:47:09 DEBUG : rclone-sync-test-ignore-file: Excluded
2025/03/28 01:47:10 DEBUG : rclone-sync-test: Excluded
2025/03/28 01:47:11 DEBUG : rclone-sync-test-include/layer2: Excluded
2025/03/28 01:47:11 DEBUG : : Excluded
2025/03/28 01:47:11 DEBUG : rclone-sync-test-ignore-file: Excluded
2025/03/28 01:47:12 DEBUG : rclone-sync-test: Excluded
2025/03/28 01:47:12 DEBUG : rclone-sync-test-include/layer2: Excluded
2025/03/28 01:47:12 DEBUG : GCS bucket rclone-test-qudoric5fuzu path rclone-sync-test-ignore-file: Waiting for checks to finish
2025/03/28 01:47:12 DEBUG : GCS bucket rclone-test-qudoric5fuzu path rclone-sync-test-ignore-file: Waiting for transfers to finish
2025/03/28 01:47:12 DEBUG : Waiting for deletions to finish
2025/03/28 01:47:12 INFO  : There was nothing to transfer
    run.go:180: Remote "GCS bucket rclone-test-qudoric5fuzu", Local "Local file system at /tmp/rclone2030427926", Modify Window "1ns"
2025/03/28 01:47:12 DEBUG : rclone-sync-test-ignore-file: Excluded
2025/03/28 01:47:13 DEBUG : rclone-sync-test: Excluded
2025/03/28 01:47:14 DEBUG : rclone-sync-test-include/layer2: Excluded
    run.go:180: Remote "GCS bucket rclone-test-qudoric5fuzu", Local "Local file system at /tmp/rclone2030427926", Modify Window "1ns"
2025/03/28 01:47:14 DEBUG : rclone-sync-test-ignore-file: Excluded
2025/03/28 01:47:14 DEBUG : rclone-sync-test: Excluded
2025/03/28 01:47:15 DEBUG : rclone-sync-test-include/layer2: Excluded
    run.go:180: Remote "GCS bucket rclone-test-qudoric5fuzu", Local "Local file system at /tmp/rclone2030427926", Modify Window "1ns"
2025/03/28 01:47:15 DEBUG : rclone-sync-test-ignore-file: Excluded
2025/03/28 01:47:16 DEBUG : rclone-sync-test: Excluded
2025/03/28 01:47:16 DEBUG : rclone-sync-test-include/layer2: Excluded
    run.go:180: Remote "GCS bucket rclone-test-qudoric5fuzu", Local "Local file system at /tmp/rclone2030427926", Modify Window "1ns"
2025/03/28 01:47:16 DEBUG : rclone-sync-test-ignore-file: Excluded
2025/03/28 01:47:17 DEBUG : rclone-sync-test: Excluded
2025/03/28 01:47:17 DEBUG : rclone-sync-test-include/layer2: Excluded
    run.go:180: Remote "GCS bucket rclone-test-qudoric5fuzu", Local "Local file system at /tmp/rclone2030427926", Modify Window "1ns"
2025/03/28 01:47:17 DEBUG : rclone-sync-test-ignore-file: Excluded
2025/03/28 01:47:18 DEBUG : rclone-sync-test: Excluded
2025/03/28 01:47:18 DEBUG : rclone-sync-test-include/layer2: Excluded
2025/03/28 01:47:19 DEBUG : rclone-sync-test-include/layer2/: Removing directory marker
    run.go:125: removing dir "rclone-sync-test-include/layer2" failed - try 1/3: removing directory marker failed: googleapi: Error 404: No such object: rclone-test-qudoric5fuzu/rclone-sync-test-include/layer2/, notFound
2025/03/28 01:47:20 DEBUG : rclone-sync-test-include/layer2/: Removing directory marker
    run.go:125: removing dir "rclone-sync-test-include/layer2" failed - try 2/3: removing directory marker failed: googleapi: Error 404: No such object: rclone-test-qudoric5fuzu/rclone-sync-test-include/layer2/, notFound
2025/03/28 01:47:21 DEBUG : rclone-sync-test-include/layer2/: Removing directory marker
    run.go:125: removing dir "rclone-sync-test-include/layer2" failed - try 3/3: removing directory marker failed: googleapi: Error 404: No such object: rclone-test-qudoric5fuzu/rclone-sync-test-include/layer2/, notFound
    run.go:128: removing dir "rclone-sync-test-include/layer2" failed: removing directory marker failed: googleapi: Error 404: No such object: rclone-test-qudoric5fuzu/rclone-sync-test-include/layer2/, notFound
2025/03/28 01:47:22 DEBUG : rclone-sync-test-include/: Removing directory marker
    run.go:125: removing dir "rclone-sync-test-include" failed - try 1/3: removing directory marker failed: googleapi: Error 404: No such object: rclone-test-qudoric5fuzu/rclone-sync-test-include/, notFound
2025/03/28 01:47:23 DEBUG : rclone-sync-test-include/: Removing directory marker
    run.go:125: removing dir "rclone-sync-test-include" failed - try 2/3: removing directory marker failed: googleapi: Error 404: No such object: rclone-test-qudoric5fuzu/rclone-sync-test-include/, notFound
2025/03/28 01:47:24 DEBUG : rclone-sync-test-include/: Removing directory marker
    run.go:125: removing dir "rclone-sync-test-include" failed - try 3/3: removing directory marker failed: googleapi: Error 404: No such object: rclone-test-qudoric5fuzu/rclone-sync-test-include/, notFound
    run.go:128: removing dir "rclone-sync-test-include" failed: removing directory marker failed: googleapi: Error 404: No such object: rclone-test-qudoric5fuzu/rclone-sync-test-include/, notFound
2025/03/28 01:47:25 DEBUG : rclone-sync-test-ignore-file/: Removing directory marker
2025/03/28 01:47:25 DEBUG : rclone-sync-test-ignore-file/: Removing directory marker
    run.go:125: removing dir "rclone-sync-test-ignore-file" failed - try 1/3: removing directory marker failed: googleapi: Error 404: No such object: rclone-test-qudoric5fuzu/rclone-sync-test-ignore-file/, notFound
2025/03/28 01:47:26 DEBUG : rclone-sync-test-ignore-file/: Removing directory marker
    run.go:125: removing dir "rclone-sync-test-ignore-file" failed - try 2/3: removing directory marker failed: googleapi: Error 404: No such object: rclone-test-qudoric5fuzu/rclone-sync-test-ignore-file/, notFound
2025/03/28 01:47:27 DEBUG : rclone-sync-test-ignore-file/: Removing directory marker
    run.go:125: removing dir "rclone-sync-test-ignore-file" failed - try 3/3: removing directory marker failed: googleapi: Error 404: No such object: rclone-test-qudoric5fuzu/rclone-sync-test-ignore-file/, notFound
    run.go:128: removing dir "rclone-sync-test-ignore-file" failed: removing directory marker failed: googleapi: Error 404: No such object: rclone-test-qudoric5fuzu/rclone-sync-test-ignore-file/, notFound
2025/03/28 01:47:28 DEBUG : rclone-sync-test/: Removing directory marker
    run.go:125: removing dir "rclone-sync-test" failed - try 1/3: removing directory marker failed: googleapi: Error 404: No such object: rclone-test-qudoric5fuzu/rclone-sync-test/, notFound
2025/03/28 01:47:29 DEBUG : rclone-sync-test/: Removing directory marker
    run.go:125: removing dir "rclone-sync-test" failed - try 2/3: removing directory marker failed: googleapi: Error 404: No such object: rclone-test-qudoric5fuzu/rclone-sync-test/, notFound
2025/03/28 01:47:30 DEBUG : rclone-sync-test/: Removing directory marker
    run.go:125: removing dir "rclone-sync-test" failed - try 3/3: removing directory marker failed: googleapi: Error 404: No such object: rclone-test-qudoric5fuzu/rclone-sync-test/, notFound
    run.go:128: removing dir "rclone-sync-test" failed: removing directory marker failed: googleapi: Error 404: No such object: rclone-test-qudoric5fuzu/rclone-sync-test/, notFound
    fstest.go:292: Sleeping for 1s for list eventual consistency: 1/3
    fstest.go:292: Sleeping for 2s for list eventual consistency: 2/3
    fstest.go:292: Sleeping for 4s for list eventual consistency: 3/3
    fstest.go:321: 
        	Error Trace:	/home/rclone/go/src/github.com/rclone/rclone/fstest/fstest.go:321
        	            				/home/rclone/go/src/github.com/rclone/rclone/fstest/fstest.go:332
        	            				/home/rclone/go/src/github.com/rclone/rclone/fstest/run.go:173
        	            				/home/rclone/go/src/github.com/rclone/rclone/fstest/run.go:388
        	            				/home/rclone/go/pkg/mod/golang.org/toolchain@v0.0.1-go1.23.0.linux-amd64/src/testing/testing.go:1176
        	            				/home/rclone/go/pkg/mod/golang.org/toolchain@v0.0.1-go1.23.0.linux-amd64/src/testing/testing.go:1354
        	            				/home/rclone/go/pkg/mod/golang.org/toolchain@v0.0.1-go1.23.0.linux-amd64/src/testing/testing.go:1684
        	Error:      	Not equal: 
        	            	expected: []string{}
        	            	actual  : []string{"rclone-sync-test", "rclone-sync-test-ignore-file", "rclone-sync-test-include", "rclone-sync-test-include/layer2"}
        	            	
        	            	Diff:
        	            	--- Expected
        	            	+++ Actual
        	            	@@ -1,2 +1,6 @@
        	            	-([]string) {
        	            	+([]string) (len=4) {
        	            	+ (string) (len=16) "rclone-sync-test",
        	            	+ (string) (len=28) "rclone-sync-test-ignore-file",
        	            	+ (string) (len=24) "rclone-sync-test-include",
        	            	+ (string) (len=31) "rclone-sync-test-include/layer2"
        	            	 }
        	Test:       	TestSyncOverlapWithFilter
        	Messages:   	directories
2025/03/28 01:47:39 DEBUG : rclone-sync-test-include/layer2/: Removing directory marker
    run.go:125: removing dir "rclone-sync-test-include/layer2" failed - try 1/3: removing directory marker failed: googleapi: Error 404: No such object: rclone-test-qudoric5fuzu/rclone-sync-test-include/layer2/, notFound
2025/03/28 01:47:40 DEBUG : rclone-sync-test-include/layer2/: Removing directory marker
    run.go:125: removing dir "rclone-sync-test-include/layer2" failed - try 2/3: removing directory marker failed: googleapi: Error 404: No such object: rclone-test-qudoric5fuzu/rclone-sync-test-include/layer2/, notFound
2025/03/28 01:47:41 DEBUG : rclone-sync-test-include/layer2/: Removing directory marker
    run.go:125: removing dir "rclone-sync-test-include/layer2" failed - try 3/3: removing directory marker failed: googleapi: Error 404: No such object: rclone-test-qudoric5fuzu/rclone-sync-test-include/layer2/, notFound
    run.go:128: removing dir "rclone-sync-test-include/layer2" failed: removing directory marker failed: googleapi: Error 404: No such object: rclone-test-qudoric5fuzu/rclone-sync-test-include/layer2/, notFound
2025/03/28 01:47:42 DEBUG : rclone-sync-test-include/: Removing directory marker
    run.go:125: removing dir "rclone-sync-test-include" failed - try 1/3: removing directory marker failed: googleapi: Error 404: No such object: rclone-test-qudoric5fuzu/rclone-sync-test-include/, notFound
2025/03/28 01:47:43 DEBUG : rclone-sync-test-include/: Removing directory marker
    run.go:125: removing dir "rclone-sync-test-include" failed - try 2/3: removing directory marker failed: googleapi: Error 404: No such object: rclone-test-qudoric5fuzu/rclone-sync-test-include/, notFound
2025/03/28 01:47:44 DEBUG : rclone-sync-test-include/: Removing directory marker
    run.go:125: removing dir "rclone-sync-test-include" failed - try 3/3: removing directory marker failed: googleapi: Error 404: No such object: rclone-test-qudoric5fuzu/rclone-sync-test-include/, notFound
    run.go:128: removing dir "rclone-sync-test-include" failed: removing directory marker failed: googleapi: Error 404: No such object: rclone-test-qudoric5fuzu/rclone-sync-test-include/, notFound
2025/03/28 01:47:45 DEBUG : rclone-sync-test-ignore-file/: Removing directory marker
    run.go:125: removing dir "rclone-sync-test-ignore-file" failed - try 1/3: removing directory marker failed: googleapi: Error 404: No such object: rclone-test-qudoric5fuzu/rclone-sync-test-ignore-file/, notFound
2025/03/28 01:47:46 DEBUG : rclone-sync-test-ignore-file/: Removing directory marker
    run.go:125: removing dir "rclone-sync-test-ignore-file" failed - try 2/3: removing directory marker failed: googleapi: Error 404: No such object: rclone-test-qudoric5fuzu/rclone-sync-test-ignore-file/, notFound
2025/03/28 01:47:47 DEBUG : rclone-sync-test-ignore-file/: Removing directory marker
    run.go:125: removing dir "rclone-sync-test-ignore-file" failed - try 3/3: removing directory marker failed: googleapi: Error 404: No such object: rclone-test-qudoric5fuzu/rclone-sync-test-ignore-file/, notFound
    run.go:128: removing dir "rclone-sync-test-ignore-file" failed: removing directory marker failed: googleapi: Error 404: No such object: rclone-test-qudoric5fuzu/rclone-sync-test-ignore-file/, notFound
2025/03/28 01:47:48 DEBUG : rclone-sync-test/: Removing directory marker
    run.go:125: removing dir "rclone-sync-test" failed - try 1/3: removing directory marker failed: googleapi: Error 404: No such object: rclone-test-qudoric5fuzu/rclone-sync-test/, notFound
2025/03/28 01:47:49 DEBUG : rclone-sync-test/: Removing directory marker
    run.go:125: removing dir "rclone-sync-test" failed - try 2/3: removing directory marker failed: googleapi: Error 404: No such object: rclone-test-qudoric5fuzu/rclone-sync-test/, notFound
2025/03/28 01:47:50 DEBUG : rclone-sync-test/: Removing directory marker
    run.go:125: removing dir "rclone-sync-test" failed - try 3/3: removing directory marker failed: googleapi: Error 404: No such object: rclone-test-qudoric5fuzu/rclone-sync-test/, notFound
    run.go:128: removing dir "rclone-sync-test" failed: removing directory marker failed: googleapi: Error 404: No such object: rclone-test-qudoric5fuzu/rclone-sync-test/, notFound
    fstest.go:292: Sleeping for 1s for list eventual consistency: 1/3
    fstest.go:292: Sleeping for 2s for list eventual consistency: 2/3
    fstest.go:292: Sleeping for 4s for list eventual consistency: 3/3
    fstest.go:321: 
        	Error Trace:	/home/rclone/go/src/github.com/rclone/rclone/fstest/fstest.go:321
        	            				/home/rclone/go/src/github.com/rclone/rclone/fstest/fstest.go:332
        	            				/home/rclone/go/src/github.com/rclone/rclone/fstest/run.go:173
        	            				/home/rclone/go/src/github.com/rclone/rclone/fstest/run.go:388
        	            				/home/rclone/go/pkg/mod/golang.org/toolchain@v0.0.1-go1.23.0.linux-amd64/src/testing/testing.go:1176
        	            				/home/rclone/go/pkg/mod/golang.org/toolchain@v0.0.1-go1.23.0.linux-amd64/src/testing/testing.go:1354
        	            				/home/rclone/go/pkg/mod/golang.org/toolchain@v0.0.1-go1.23.0.linux-amd64/src/testing/testing.go:1684
        	Error:      	Not equal: 
        	            	expected: []string{}
        	            	actual  : []string{"rclone-sync-test", "rclone-sync-test-ignore-file", "rclone-sync-test-include", "rclone-sync-test-include/layer2"}
        	            	
        	            	Diff:
        	            	--- Expected
        	            	+++ Actual
        	            	@@ -1,2 +1,6 @@
        	            	-([]string) {
        	            	+([]string) (len=4) {
        	            	+ (string) (len=16) "rclone-sync-test",
        	            	+ (string) (len=28) "rclone-sync-test-ignore-file",
        	            	+ (string) (len=24) "rclone-sync-test-include",
        	            	+ (string) (len=31) "rclone-sync-test-include/layer2"
        	            	 }
        	Test:       	TestSyncOverlapWithFilter
        	Messages:   	directories
2025/03/28 01:47:59 DEBUG : rclone-sync-test-include/layer2/: Removing directory marker
    run.go:125: removing dir "rclone-sync-test-include/layer2" failed - try 1/3: removing directory marker failed: googleapi: Error 404: No such object: rclone-test-qudoric5fuzu/rclone-sync-test-include/layer2/, notFound
2025/03/28 01:48:00 DEBUG : rclone-sync-test-include/layer2/: Removing directory marker
    run.go:125: removing dir "rclone-sync-test-include/layer2" failed - try 2/3: removing directory marker failed: googleapi: Error 404: No such object: rclone-test-qudoric5fuzu/rclone-sync-test-include/layer2/, notFound
2025/03/28 01:48:01 DEBUG : rclone-sync-test-include/layer2/: Removing directory marker
    run.go:125: removing dir "rclone-sync-test-include/layer2" failed - try 3/3: removing directory marker failed: googleapi: Error 404: No such object: rclone-test-qudoric5fuzu/rclone-sync-test-include/layer2/, notFound
    run.go:128: removing dir "rclone-sync-test-include/layer2" failed: removing directory marker failed: googleapi: Error 404: No such object: rclone-test-qudoric5fuzu/rclone-sync-test-include/layer2/, notFound
2025/03/28 01:48:02 DEBUG : rclone-sync-test-include/: Removing directory marker
    run.go:125: removing dir "rclone-sync-test-include" failed - try 1/3: removing directory marker failed: googleapi: Error 404: No such object: rclone-test-qudoric5fuzu/rclone-sync-test-include/, notFound
2025/03/28 01:48:03 DEBUG : rclone-sync-test-include/: Removing directory marker
    run.go:125: removing dir "rclone-sync-test-include" failed - try 2/3: removing directory marker failed: googleapi: Error 404: No such object: rclone-test-qudoric5fuzu/rclone-sync-test-include/, notFound
2025/03/28 01:48:04 DEBUG : rclone-sync-test-include/: Removing directory marker
    run.go:125: removing dir "rclone-sync-test-include" failed - try 3/3: removing directory marker failed: googleapi: Error 404: No such object: rclone-test-qudoric5fuzu/rclone-sync-test-include/, notFound
    run.go:128: removing dir "rclone-sync-test-include" failed: removing directory marker failed: googleapi: Error 404: No such object: rclone-test-qudoric5fuzu/rclone-sync-test-include/, notFound
2025/03/28 01:48:05 DEBUG : rclone-sync-test-ignore-file/: Removing directory marker
    run.go:125: removing dir "rclone-sync-test-ignore-file" failed - try 1/3: removing directory marker failed: googleapi: Error 404: No such object: rclone-test-qudoric5fuzu/rclone-sync-test-ignore-file/, notFound
2025/03/28 01:48:06 DEBUG : rclone-sync-test-ignore-file/: Removing directory marker
    run.go:125: removing dir "rclone-sync-test-ignore-file" failed - try 2/3: removing directory marker failed: googleapi: Error 404: No such object: rclone-test-qudoric5fuzu/rclone-sync-test-ignore-file/, notFound
2025/03/28 01:48:07 DEBUG : rclone-sync-test-ignore-file/: Removing directory marker
    run.go:125: removing dir "rclone-sync-test-ignore-file" failed - try 3/3: removing directory marker failed: googleapi: Error 404: No such object: rclone-test-qudoric5fuzu/rclone-sync-test-ignore-file/, notFound
    run.go:128: removing dir "rclone-sync-test-ignore-file" failed: removing directory marker failed: googleapi: Error 404: No such object: rclone-test-qudoric5fuzu/rclone-sync-test-ignore-file/, notFound
2025/03/28 01:48:08 DEBUG : rclone-sync-test/: Removing directory marker
    run.go:125: removing dir "rclone-sync-test" failed - try 1/3: removing directory marker failed: googleapi: Error 404: No such object: rclone-test-qudoric5fuzu/rclone-sync-test/, notFound
2025/03/28 01:48:09 DEBUG : rclone-sync-test/: Removing directory marker
    run.go:125: removing dir "rclone-sync-test" failed - try 2/3: removing directory marker failed: googleapi: Error 404: No such object: rclone-test-qudoric5fuzu/rclone-sync-test/, notFound
2025/03/28 01:48:10 DEBUG : rclone-sync-test/: Removing directory marker
    run.go:125: removing dir "rclone-sync-test" failed - try 3/3: removing directory marker failed: googleapi: Error 404: No such object: rclone-test-qudoric5fuzu/rclone-sync-test/, notFound
    run.go:128: removing dir "rclone-sync-test" failed: removing directory marker failed: googleapi: Error 404: No such object: rclone-test-qudoric5fuzu/rclone-sync-test/, notFound
    fstest.go:292: Sleeping for 1s for list eventual consistency: 1/3
    fstest.go:292: Sleeping for 2s for list eventual consistency: 2/3
    fstest.go:292: Sleeping for 4s for list eventual consistency: 3/3
    fstest.go:321: 
        	Error Trace:	/home/rclone/go/src/github.com/rclone/rclone/fstest/fstest.go:321
        	            				/home/rclone/go/src/github.com/rclone/rclone/fstest/fstest.go:332
        	            				/home/rclone/go/src/github.com/rclone/rclone/fstest/run.go:173
        	            				/home/rclone/go/src/github.com/rclone/rclone/fstest/run.go:388
        	            				/home/rclone/go/pkg/mod/golang.org/toolchain@v0.0.1-go1.23.0.linux-amd64/src/testing/testing.go:1176
        	            				/home/rclone/go/pkg/mod/golang.org/toolchain@v0.0.1-go1.23.0.linux-amd64/src/testing/testing.go:1354
        	            				/home/rclone/go/pkg/mod/golang.org/toolchain@v0.0.1-go1.23.0.linux-amd64/src/testing/testing.go:1684
        	Error:      	Not equal: 
        	            	expected: []string{}
        	            	actual  : []string{"rclone-sync-test", "rclone-sync-test-ignore-file", "rclone-sync-test-include", "rclone-sync-test-include/layer2"}
        	            	
        	            	Diff:
        	            	--- Expected
        	            	+++ Actual
        	            	@@ -1,2 +1,6 @@
        	            	-([]string) {
        	            	+([]string) (len=4) {
        	            	+ (string) (len=16) "rclone-sync-test",
        	            	+ (string) (len=28) "rclone-sync-test-ignore-file",
        	            	+ (string) (len=24) "rclone-sync-test-include",
        	            	+ (string) (len=31) "rclone-sync-test-include/layer2"
        	            	 }
        	Test:       	TestSyncOverlapWithFilter
        	Messages:   	directories
2025/03/28 01:48:19 DEBUG : rclone-sync-test-include/layer2/: Removing directory marker
    run.go:125: removing dir "rclone-sync-test-include/layer2" failed - try 1/3: removing directory marker failed: googleapi: Error 404: No such object: rclone-test-qudoric5fuzu/rclone-sync-test-include/layer2/, notFound
2025/03/28 01:48:20 DEBUG : rclone-sync-test-include/layer2/: Removing directory marker
    run.go:125: removing dir "rclone-sync-test-include/layer2" failed - try 2/3: removing directory marker failed: googleapi: Error 404: No such object: rclone-test-qudoric5fuzu/rclone-sync-test-include/layer2/, notFound
2025/03/28 01:48:21 DEBUG : rclone-sync-test-include/layer2/: Removing directory marker
    run.go:125: removing dir "rclone-sync-test-include/layer2" failed - try 3/3: removing directory marker failed: googleapi: Error 404: No such object: rclone-test-qudoric5fuzu/rclone-sync-test-include/layer2/, notFound
    run.go:128: removing dir "rclone-sync-test-include/layer2" failed: removing directory marker failed: googleapi: Error 404: No such object: rclone-test-qudoric5fuzu/rclone-sync-test-include/layer2/, notFound
2025/03/28 01:48:22 DEBUG : rclone-sync-test-include/: Removing directory marker
    run.go:125: removing dir "rclone-sync-test-include" failed - try 1/3: removing directory marker failed: googleapi: Error 404: No such object: rclone-test-qudoric5fuzu/rclone-sync-test-include/, notFound
2025/03/28 01:48:23 DEBUG : rclone-sync-test-include/: Removing directory marker
    run.go:125: removing dir "rclone-sync-test-include" failed - try 2/3: removing directory marker failed: googleapi: Error 404: No such object: rclone-test-qudoric5fuzu/rclone-sync-test-include/, notFound
2025/03/28 01:48:24 DEBUG : rclone-sync-test-include/: Removing directory marker
    run.go:125: removing dir "rclone-sync-test-include" failed - try 3/3: removing directory marker failed: googleapi: Error 404: No such object: rclone-test-qudoric5fuzu/rclone-sync-test-include/, notFound
    run.go:128: removing dir "rclone-sync-test-include" failed: removing directory marker failed: googleapi: Error 404: No such object: rclone-test-qudoric5fuzu/rclone-sync-test-include/, notFound
2025/03/28 01:48:25 DEBUG : rclone-sync-test-ignore-file/: Removing directory marker
    run.go:125: removing dir "rclone-sync-test-ignore-file" failed - try 1/3: removing directory marker failed: googleapi: Error 404: No such object: rclone-test-qudoric5fuzu/rclone-sync-test-ignore-file/, notFound
2025/03/28 01:48:26 DEBUG : rclone-sync-test-ignore-file/: Removing directory marker
    run.go:125: removing dir "rclone-sync-test-ignore-file" failed - try 2/3: removing directory marker failed: googleapi: Error 404: No such object: rclone-test-qudoric5fuzu/rclone-sync-test-ignore-file/, notFound
2025/03/28 01:48:27 DEBUG : rclone-sync-test-ignore-file/: Removing directory marker
    run.go:125: removing dir "rclone-sync-test-ignore-file" failed - try 3/3: removing directory marker failed: googleapi: Error 404: No such object: rclone-test-qudoric5fuzu/rclone-sync-test-ignore-file/, notFound
    run.go:128: removing dir "rclone-sync-test-ignore-file" failed: removing directory marker failed: googleapi: Error 404: No such object: rclone-test-qudoric5fuzu/rclone-sync-test-ignore-file/, notFound
2025/03/28 01:48:28 DEBUG : rclone-sync-test/: Removing directory marker
    run.go:125: removing dir "rclone-sync-test" failed - try 1/3: removing directory marker failed: googleapi: Error 404: No such object: rclone-test-qudoric5fuzu/rclone-sync-test/, notFound
2025/03/28 01:48:29 DEBUG : rclone-sync-test/: Removing directory marker
    run.go:125: removing dir "rclone-sync-test" failed - try 2/3: removing directory marker failed: googleapi: Error 404: No such object: rclone-test-qudoric5fuzu/rclone-sync-test/, notFound
2025/03/28 01:48:30 DEBUG : rclone-sync-test/: Removing directory marker
    run.go:125: removing dir "rclone-sync-test" failed - try 3/3: removing directory marker failed: googleapi: Error 404: No such object: rclone-test-qudoric5fuzu/rclone-sync-test/, notFound
    run.go:128: removing dir "rclone-sync-test" failed: removing directory marker failed: googleapi: Error 404: No such object: rclone-test-qudoric5fuzu/rclone-sync-test/, notFound
    fstest.go:292: Sleeping for 1s for list eventual consistency: 1/3
    fstest.go:292: Sleeping for 2s for list eventual consistency: 2/3
    fstest.go:292: Sleeping for 4s for list eventual consistency: 3/3
    fstest.go:321: 
        	Error Trace:	/home/rclone/go/src/github.com/rclone/rclone/fstest/fstest.go:321
        	            				/home/rclone/go/src/github.com/rclone/rclone/fstest/fstest.go:332
        	            				/home/rclone/go/src/github.com/rclone/rclone/fstest/run.go:173
        	            				/home/rclone/go/src/github.com/rclone/rclone/fstest/run.go:388
        	            				/home/rclone/go/pkg/mod/golang.org/toolchain@v0.0.1-go1.23.0.linux-amd64/src/testing/testing.go:1176
        	            				/home/rclone/go/pkg/mod/golang.org/toolchain@v0.0.1-go1.23.0.linux-amd64/src/testing/testing.go:1354
        	            				/home/rclone/go/pkg/mod/golang.org/toolchain@v0.0.1-go1.23.0.linux-amd64/src/testing/testing.go:1684
        	Error:      	Not equal: 
        	            	expected: []string{}
        	            	actual  : []string{"rclone-sync-test", "rclone-sync-test-ignore-file", "rclone-sync-test-include", "rclone-sync-test-include/layer2"}
        	            	
        	            	Diff:
        	            	--- Expected
        	            	+++ Actual
        	            	@@ -1,2 +1,6 @@
        	            	-([]string) {
        	            	+([]string) (len=4) {
        	            	+ (string) (len=16) "rclone-sync-test",
        	            	+ (string) (len=28) "rclone-sync-test-ignore-file",
        	            	+ (string) (len=24) "rclone-sync-test-include",
        	            	+ (string) (len=31) "rclone-sync-test-include/layer2"
        	            	 }
        	Test:       	TestSyncOverlapWithFilter
        	Messages:   	directories
2025/03/28 01:48:38 DEBUG : rclone-sync-test-include/layer2/: Removing directory marker
    run.go:125: removing dir "rclone-sync-test-include/layer2" failed - try 1/3: removing directory marker failed: googleapi: Error 404: No such object: rclone-test-qudoric5fuzu/rclone-sync-test-include/layer2/, notFound
2025/03/28 01:48:39 DEBUG : rclone-sync-test-include/layer2/: Removing directory marker
    run.go:125: removing dir "rclone-sync-test-include/layer2" failed - try 2/3: removing directory marker failed: googleapi: Error 404: No such object: rclone-test-qudoric5fuzu/rclone-sync-test-include/layer2/, notFound
2025/03/28 01:48:40 DEBUG : rclone-sync-test-include/layer2/: Removing directory marker
    run.go:125: removing dir "rclone-sync-test-include/layer2" failed - try 3/3: removing directory marker failed: googleapi: Error 404: No such object: rclone-test-qudoric5fuzu/rclone-sync-test-include/layer2/, notFound
    run.go:128: removing dir "rclone-sync-test-include/layer2" failed: removing directory marker failed: googleapi: Error 404: No such object: rclone-test-qudoric5fuzu/rclone-sync-test-include/layer2/, notFound
2025/03/28 01:48:42 DEBUG : rclone-sync-test-include/: Removing directory marker
    run.go:125: removing dir "rclone-sync-test-include" failed - try 1/3: removing directory marker failed: googleapi: Error 404: No such object: rclone-test-qudoric5fuzu/rclone-sync-test-include/, notFound
2025/03/28 01:48:43 DEBUG : rclone-sync-test-include/: Removing directory marker
    run.go:125: removing dir "rclone-sync-test-include" failed - try 2/3: removing directory marker failed: googleapi: Error 404: No such object: rclone-test-qudoric5fuzu/rclone-sync-test-include/, notFound
2025/03/28 01:48:44 DEBUG : rclone-sync-test-include/: Removing directory marker
    run.go:125: removing dir "rclone-sync-test-include" failed - try 3/3: removing directory marker failed: googleapi: Error 404: No such object: rclone-test-qudoric5fuzu/rclone-sync-test-include/, notFound
    run.go:128: removing dir "rclone-sync-test-include" failed: removing directory marker failed: googleapi: Error 404: No such object: rclone-test-qudoric5fuzu/rclone-sync-test-include/, notFound
2025/03/28 01:48:45 DEBUG : rclone-sync-test-ignore-file/: Removing directory marker
    run.go:125: removing dir "rclone-sync-test-ignore-file" failed - try 1/3: removing directory marker failed: googleapi: Error 404: No such object: rclone-test-qudoric5fuzu/rclone-sync-test-ignore-file/, notFound
2025/03/28 01:48:46 DEBUG : rclone-sync-test-ignore-file/: Removing directory marker
    run.go:125: removing dir "rclone-sync-test-ignore-file" failed - try 2/3: removing directory marker failed: googleapi: Error 404: No such object: rclone-test-qudoric5fuzu/rclone-sync-test-ignore-file/, notFound
2025/03/28 01:48:47 DEBUG : rclone-sync-test-ignore-file/: Removing directory marker
    run.go:125: removing dir "rclone-sync-test-ignore-file" failed - try 3/3: removing directory marker failed: googleapi: Error 404: No such object: rclone-test-qudoric5fuzu/rclone-sync-test-ignore-file/, notFound
    run.go:128: removing dir "rclone-sync-test-ignore-file" failed: removing directory marker failed: googleapi: Error 404: No such object: rclone-test-qudoric5fuzu/rclone-sync-test-ignore-file/, notFound
2025/03/28 01:48:48 DEBUG : rclone-sync-test/: Removing directory marker
    run.go:125: removing dir "rclone-sync-test" failed - try 1/3: removing directory marker failed: googleapi: Error 404: No such object: rclone-test-qudoric5fuzu/rclone-sync-test/, notFound
2025/03/28 01:48:49 DEBUG : rclone-sync-test/: Removing directory marker
    run.go:125: removing dir "rclone-sync-test" failed - try 2/3: removing directory marker failed: googleapi: Error 404: No such object: rclone-test-qudoric5fuzu/rclone-sync-test/, notFound
2025/03/28 01:48:50 DEBUG : rclone-sync-test/: Removing directory marker
    run.go:125: removing dir "rclone-sync-test" failed - try 3/3: removing directory marker failed: googleapi: Error 404: No such object: rclone-test-qudoric5fuzu/rclone-sync-test/, notFound
    run.go:128: removing dir "rclone-sync-test" failed: removing directory marker failed: googleapi: Error 404: No such object: rclone-test-qudoric5fuzu/rclone-sync-test/, notFound
    fstest.go:292: Sleeping for 1s for list eventual consistency: 1/3
    fstest.go:292: Sleeping for 2s for list eventual consistency: 2/3
    fstest.go:292: Sleeping for 4s for list eventual consistency: 3/3
    fstest.go:321: 
        	Error Trace:	/home/rclone/go/src/github.com/rclone/rclone/fstest/fstest.go:321
        	            				/home/rclone/go/src/github.com/rclone/rclone/fstest/fstest.go:332
        	            				/home/rclone/go/src/github.com/rclone/rclone/fstest/run.go:173
        	            				/home/rclone/go/src/github.com/rclone/rclone/fstest/run.go:388
        	            				/home/rclone/go/pkg/mod/golang.org/toolchain@v0.0.1-go1.23.0.linux-amd64/src/testing/testing.go:1176
        	            				/home/rclone/go/pkg/mod/golang.org/toolchain@v0.0.1-go1.23.0.linux-amd64/src/testing/testing.go:1354
        	            				/home/rclone/go/pkg/mod/golang.org/toolchain@v0.0.1-go1.23.0.linux-amd64/src/testing/testing.go:1684
        	Error:      	Not equal: 
        	            	expected: []string{}
        	            	actual  : []string{"rclone-sync-test", "rclone-sync-test-ignore-file", "rclone-sync-test-include", "rclone-sync-test-include/layer2"}
        	            	
        	            	Diff:
        	            	--- Expected
        	            	+++ Actual
        	            	@@ -1,2 +1,6 @@
        	            	-([]string) {
        	            	+([]string) (len=4) {
        	            	+ (string) (len=16) "rclone-sync-test",
        	            	+ (string) (len=28) "rclone-sync-test-ignore-file",
        	            	+ (string) (len=24) "rclone-sync-test-include",
        	            	+ (string) (len=31) "rclone-sync-test-include/layer2"
        	            	 }
        	Test:       	TestSyncOverlapWithFilter
        	Messages:   	directories
2025/03/28 01:48:58 DEBUG : rclone-sync-test-include/layer2/: Removing directory marker
    run.go:125: removing dir "rclone-sync-test-include/layer2" failed - try 1/3: removing directory marker failed: googleapi: Error 404: No such object: rclone-test-qudoric5fuzu/rclone-sync-test-include/layer2/, notFound
2025/03/28 01:48:59 DEBUG : rclone-sync-test-include/layer2/: Removing directory marker
    run.go:125: removing dir "rclone-sync-test-include/layer2" failed - try 2/3: removing directory marker failed: googleapi: Error 404: No such object: rclone-test-qudoric5fuzu/rclone-sync-test-include/layer2/, notFound
2025/03/28 01:49:00 DEBUG : rclone-sync-test-include/layer2/: Removing directory marker
    run.go:125: removing dir "rclone-sync-test-include/layer2" failed - try 3/3: removing directory marker failed: googleapi: Error 404: No such object: rclone-test-qudoric5fuzu/rclone-sync-test-include/layer2/, notFound
    run.go:128: removing dir "rclone-sync-test-include/layer2" failed: removing directory marker failed: googleapi: Error 404: No such object: rclone-test-qudoric5fuzu/rclone-sync-test-include/layer2/, notFound
2025/03/28 01:49:01 DEBUG : rclone-sync-test-include/: Removing directory marker
    run.go:125: removing dir "rclone-sync-test-include" failed - try 1/3: removing directory marker failed: googleapi: Error 404: No such object: rclone-test-qudoric5fuzu/rclone-sync-test-include/, notFound
2025/03/28 01:49:02 DEBUG : rclone-sync-test-include/: Removing directory marker
    run.go:125: removing dir "rclone-sync-test-include" failed - try 2/3: removing directory marker failed: googleapi: Error 404: No such object: rclone-test-qudoric5fuzu/rclone-sync-test-include/, notFound
2025/03/28 01:49:04 DEBUG : rclone-sync-test-include/: Removing directory marker
    run.go:125: removing dir "rclone-sync-test-include" failed - try 3/3: removing directory marker failed: googleapi: Error 404: No such object: rclone-test-qudoric5fuzu/rclone-sync-test-include/, notFound
    run.go:128: removing dir "rclone-sync-test-include" failed: removing directory marker failed: googleapi: Error 404: No such object: rclone-test-qudoric5fuzu/rclone-sync-test-include/, notFound
2025/03/28 01:49:05 DEBUG : rclone-sync-test-ignore-file/: Removing directory marker
    run.go:125: removing dir "rclone-sync-test-ignore-file" failed - try 1/3: removing directory marker failed: googleapi: Error 404: No such object: rclone-test-qudoric5fuzu/rclone-sync-test-ignore-file/, notFound
2025/03/28 01:49:06 DEBUG : rclone-sync-test-ignore-file/: Removing directory marker
    run.go:125: removing dir "rclone-sync-test-ignore-file" failed - try 2/3: removing directory marker failed: googleapi: Error 404: No such object: rclone-test-qudoric5fuzu/rclone-sync-test-ignore-file/, notFound
2025/03/28 01:49:07 DEBUG : rclone-sync-test-ignore-file/: Removing directory marker
    run.go:125: removing dir "rclone-sync-test-ignore-file" failed - try 3/3: removing directory marker failed: googleapi: Error 404: No such object: rclone-test-qudoric5fuzu/rclone-sync-test-ignore-file/, notFound
    run.go:128: removing dir "rclone-sync-test-ignore-file" failed: removing directory marker failed: googleapi: Error 404: No such object: rclone-test-qudoric5fuzu/rclone-sync-test-ignore-file/, notFound
2025/03/28 01:49:08 DEBUG : rclone-sync-test/: Removing directory marker
    run.go:125: removing dir "rclone-sync-test" failed - try 1/3: removing directory marker failed: googleapi: Error 404: No such object: rclone-test-qudoric5fuzu/rclone-sync-test/, notFound
2025/03/28 01:49:09 DEBUG : rclone-sync-test/: Removing directory marker
    run.go:125: removing dir "rclone-sync-test" failed - try 2/3: removing directory marker failed: googleapi: Error 404: No such object: rclone-test-qudoric5fuzu/rclone-sync-test/, notFound
2025/03/28 01:49:10 DEBUG : rclone-sync-test/: Removing directory marker
    run.go:125: removing dir "rclone-sync-test" failed - try 3/3: removing directory marker failed: googleapi: Error 404: No such object: rclone-test-qudoric5fuzu/rclone-sync-test/, notFound
    run.go:128: removing dir "rclone-sync-test" failed: removing directory marker failed: googleapi: Error 404: No such object: rclone-test-qudoric5fuzu/rclone-sync-test/, notFound
    fstest.go:292: Sleeping for 1s for list eventual consistency: 1/3
    fstest.go:292: Sleeping for 2s for list eventual consistency: 2/3
    fstest.go:292: Sleeping for 4s for list eventual consistency: 3/3
    fstest.go:321: 
        	Error Trace:	/home/rclone/go/src/github.com/rclone/rclone/fstest/fstest.go:321
        	            				/home/rclone/go/src/github.com/rclone/rclone/fstest/fstest.go:332
        	            				/home/rclone/go/src/github.com/rclone/rclone/fstest/run.go:173
        	            				/home/rclone/go/src/github.com/rclone/rclone/fstest/run.go:388
        	            				/home/rclone/go/pkg/mod/golang.org/toolchain@v0.0.1-go1.23.0.linux-amd64/src/testing/testing.go:1176
        	            				/home/rclone/go/pkg/mod/golang.org/toolchain@v0.0.1-go1.23.0.linux-amd64/src/testing/testing.go:1354
        	            				/home/rclone/go/pkg/mod/golang.org/toolchain@v0.0.1-go1.23.0.linux-amd64/src/testing/testing.go:1684
        	Error:      	Not equal: 
        	            	expected: []string{}
        	            	actual  : []string{"rclone-sync-test", "rclone-sync-test-ignore-file", "rclone-sync-test-include", "rclone-sync-test-include/layer2"}
        	            	
        	            	Diff:
        	            	--- Expected
        	            	+++ Actual
        	            	@@ -1,2 +1,6 @@
        	            	-([]string) {
        	            	+([]string) (len=4) {
        	            	+ (string) (len=16) "rclone-sync-test",
        	            	+ (string) (len=28) "rclone-sync-test-ignore-file",
        	            	+ (string) (len=24) "rclone-sync-test-include",
        	            	+ (string) (len=31) "rclone-sync-test-include/layer2"
        	            	 }
        	Test:       	TestSyncOverlapWithFilter
        	Messages:   	directories
2025/03/28 01:49:18 DEBUG : rclone-sync-test-include/layer2/: Removing directory marker
    run.go:125: removing dir "rclone-sync-test-include/layer2" failed - try 1/3: removing directory marker failed: googleapi: Error 404: No such object: rclone-test-qudoric5fuzu/rclone-sync-test-include/layer2/, notFound
2025/03/28 01:49:19 DEBUG : rclone-sync-test-include/layer2/: Removing directory marker
    run.go:125: removing dir "rclone-sync-test-include/layer2" failed - try 2/3: removing directory marker failed: googleapi: Error 404: No such object: rclone-test-qudoric5fuzu/rclone-sync-test-include/layer2/, notFound
2025/03/28 01:49:20 DEBUG : rclone-sync-test-include/layer2/: Removing directory marker
    run.go:125: removing dir "rclone-sync-test-include/layer2" failed - try 3/3: removing directory marker failed: googleapi: Error 404: No such object: rclone-test-qudoric5fuzu/rclone-sync-test-include/layer2/, notFound
    run.go:128: removing dir "rclone-sync-test-include/layer2" failed: removing directory marker failed: googleapi: Error 404: No such object: rclone-test-qudoric5fuzu/rclone-sync-test-include/layer2/, notFound
2025/03/28 01:49:21 DEBUG : rclone-sync-test-include/: Removing directory marker
    run.go:125: removing dir "rclone-sync-test-include" failed - try 1/3: removing directory marker failed: googleapi: Error 404: No such object: rclone-test-qudoric5fuzu/rclone-sync-test-include/, notFound
2025/03/28 01:49:22 DEBUG : rclone-sync-test-include/: Removing directory marker
    run.go:125: removing dir "rclone-sync-test-include" failed - try 2/3: removing directory marker failed: googleapi: Error 404: No such object: rclone-test-qudoric5fuzu/rclone-sync-test-include/, notFound
2025/03/28 01:49:23 DEBUG : rclone-sync-test-include/: Removing directory marker
    run.go:125: removing dir "rclone-sync-test-include" failed - try 3/3: removing directory marker failed: googleapi: Error 404: No such object: rclone-test-qudoric5fuzu/rclone-sync-test-include/, notFound
    run.go:128: removing dir "rclone-sync-test-include" failed: removing directory marker failed: googleapi: Error 404: No such object: rclone-test-qudoric5fuzu/rclone-sync-test-include/, notFound
2025/03/28 01:49:24 DEBUG : rclone-sync-test-ignore-file/: Removing directory marker
    run.go:125: removing dir "rclone-sync-test-ignore-file" failed - try 1/3: removing directory marker failed: googleapi: Error 404: No such object: rclone-test-qudoric5fuzu/rclone-sync-test-ignore-file/, notFound
2025/03/28 01:49:26 DEBUG : rclone-sync-test-ignore-file/: Removing directory marker
    run.go:125: removing dir "rclone-sync-test-ignore-file" failed - try 2/3: removing directory marker failed: googleapi: Error 404: No such object: rclone-test-qudoric5fuzu/rclone-sync-test-ignore-file/, notFound
2025/03/28 01:49:27 DEBUG : rclone-sync-test-ignore-file/: Removing directory marker
    run.go:125: removing dir "rclone-sync-test-ignore-file" failed - try 3/3: removing directory marker failed: googleapi: Error 404: No such object: rclone-test-qudoric5fuzu/rclone-sync-test-ignore-file/, notFound
    run.go:128: removing dir "rclone-sync-test-ignore-file" failed: removing directory marker failed: googleapi: Error 404: No such object: rclone-test-qudoric5fuzu/rclone-sync-test-ignore-file/, notFound
2025/03/28 01:49:28 DEBUG : rclone-sync-test/: Removing directory marker
    run.go:125: removing dir "rclone-sync-test" failed - try 1/3: removing directory marker failed: googleapi: Error 404: No such object: rclone-test-qudoric5fuzu/rclone-sync-test/, notFound
2025/03/28 01:49:29 DEBUG : rclone-sync-test/: Removing directory marker
    run.go:125: removing dir "rclone-sync-test" failed - try 2/3: removing directory marker failed: googleapi: Error 404: No such object: rclone-test-qudoric5fuzu/rclone-sync-test/, notFound
2025/03/28 01:49:30 DEBUG : rclone-sync-test/: Removing directory marker
    run.go:125: removing dir "rclone-sync-test" failed - try 3/3: removing directory marker failed: googleapi: Error 404: No such object: rclone-test-qudoric5fuzu/rclone-sync-test/, notFound
    run.go:128: removing dir "rclone-sync-test" failed: removing directory marker failed: googleapi: Error 404: No such object: rclone-test-qudoric5fuzu/rclone-sync-test/, notFound
    fstest.go:292: Sleeping for 1s for list eventual consistency: 1/3
    fstest.go:292: Sleeping for 2s for list eventual consistency: 2/3
    fstest.go:292: Sleeping for 4s for list eventual consistency: 3/3
    fstest.go:321: 
        	Error Trace:	/home/rclone/go/src/github.com/rclone/rclone/fstest/fstest.go:321
        	            				/home/rclone/go/src/github.com/rclone/rclone/fstest/fstest.go:332
        	            				/home/rclone/go/src/github.com/rclone/rclone/fstest/run.go:173
        	            				/home/rclone/go/src/github.com/rclone/rclone/fstest/run.go:388
        	            				/home/rclone/go/pkg/mod/golang.org/toolchain@v0.0.1-go1.23.0.linux-amd64/src/testing/testing.go:1176
        	            				/home/rclone/go/pkg/mod/golang.org/toolchain@v0.0.1-go1.23.0.linux-amd64/src/testing/testing.go:1354
        	            				/home/rclone/go/pkg/mod/golang.org/toolchain@v0.0.1-go1.23.0.linux-amd64/src/testing/testing.go:1684
        	Error:      	Not equal: 
        	            	expected: []string{}
        	            	actual  : []string{"rclone-sync-test", "rclone-sync-test-ignore-file", "rclone-sync-test-include", "rclone-sync-test-include/layer2"}
        	            	
        	            	Diff:
        	            	--- Expected
        	            	+++ Actual
        	            	@@ -1,2 +1,6 @@
        	            	-([]string) {
        	            	+([]string) (len=4) {
        	            	+ (string) (len=16) "rclone-sync-test",
        	            	+ (string) (len=28) "rclone-sync-test-ignore-file",
        	            	+ (string) (len=24) "rclone-sync-test-include",
        	            	+ (string) (len=31) "rclone-sync-test-include/layer2"
        	            	 }
        	Test:       	TestSyncOverlapWithFilter
        	Messages:   	directories
2025/03/28 01:49:38 DEBUG : rclone-sync-test-include/layer2/: Removing directory marker
    run.go:125: removing dir "rclone-sync-test-include/layer2" failed - try 1/3: removing directory marker failed: googleapi: Error 404: No such object: rclone-test-qudoric5fuzu/rclone-sync-test-include/layer2/, notFound
2025/03/28 01:49:39 DEBUG : rclone-sync-test-include/layer2/: Removing directory marker
    run.go:125: removing dir "rclone-sync-test-include/layer2" failed - try 2/3: removing directory marker failed: googleapi: Error 404: No such object: rclone-test-qudoric5fuzu/rclone-sync-test-include/layer2/, notFound
2025/03/28 01:49:40 DEBUG : rclone-sync-test-include/layer2/: Removing directory marker
    run.go:125: removing dir "rclone-sync-test-include/layer2" failed - try 3/3: removing directory marker failed: googleapi: Error 404: No such object: rclone-test-qudoric5fuzu/rclone-sync-test-include/layer2/, notFound
    run.go:128: removing dir "rclone-sync-test-include/layer2" failed: removing directory marker failed: googleapi: Error 404: No such object: rclone-test-qudoric5fuzu/rclone-sync-test-include/layer2/, notFound
2025/03/28 01:49:41 DEBUG : rclone-sync-test-include/: Removing directory marker
    run.go:125: removing dir "rclone-sync-test-include" failed - try 1/3: removing directory marker failed: googleapi: Error 404: No such object: rclone-test-qudoric5fuzu/rclone-sync-test-include/, notFound
2025/03/28 01:49:42 DEBUG : rclone-sync-test-include/: Removing directory marker
    run.go:125: removing dir "rclone-sync-test-include" failed - try 2/3: removing directory marker failed: googleapi: Error 404: No such object: rclone-test-qudoric5fuzu/rclone-sync-test-include/, notFound
2025/03/28 01:49:43 DEBUG : rclone-sync-test-include/: Removing directory marker
    run.go:125: removing dir "rclone-sync-test-include" failed - try 3/3: removing directory marker failed: googleapi: Error 404: No such object: rclone-test-qudoric5fuzu/rclone-sync-test-include/, notFound
    run.go:128: removing dir "rclone-sync-test-include" failed: removing directory marker failed: googleapi: Error 404: No such object: rclone-test-qudoric5fuzu/rclone-sync-test-include/, notFound
2025/03/28 01:49:44 DEBUG : rclone-sync-test-ignore-file/: Removing directory marker
    run.go:125: removing dir "rclone-sync-test-ignore-file" failed - try 1/3: removing directory marker failed: googleapi: Error 404: No such object: rclone-test-qudoric5fuzu/rclone-sync-test-ignore-file/, notFound
2025/03/28 01:49:45 DEBUG : rclone-sync-test-ignore-file/: Removing directory marker
    run.go:125: removing dir "rclone-sync-test-ignore-file" failed - try 2/3: removing directory marker failed: googleapi: Error 404: No such object: rclone-test-qudoric5fuzu/rclone-sync-test-ignore-file/, notFound
2025/03/28 01:49:46 DEBUG : rclone-sync-test-ignore-file/: Removing directory marker
    run.go:125: removing dir "rclone-sync-test-ignore-file" failed - try 3/3: removing directory marker failed: googleapi: Error 404: No such object: rclone-test-qudoric5fuzu/rclone-sync-test-ignore-file/, notFound
    run.go:128: removing dir "rclone-sync-test-ignore-file" failed: removing directory marker failed: googleapi: Error 404: No such object: rclone-test-qudoric5fuzu/rclone-sync-test-ignore-file/, notFound
2025/03/28 01:49:47 DEBUG : rclone-sync-test/: Removing directory marker
    run.go:125: removing dir "rclone-sync-test" failed - try 1/3: removing directory marker failed: googleapi: Error 404: No such object: rclone-test-qudoric5fuzu/rclone-sync-test/, notFound
2025/03/28 01:49:49 DEBUG : rclone-sync-test/: Removing directory marker
    run.go:125: removing dir "rclone-sync-test" failed - try 2/3: removing directory marker failed: googleapi: Error 404: No such object: rclone-test-qudoric5fuzu/rclone-sync-test/, notFound
2025/03/28 01:49:50 DEBUG : rclone-sync-test/: Removing directory marker
    run.go:125: removing dir "rclone-sync-test" failed - try 3/3: removing directory marker failed: googleapi: Error 404: No such object: rclone-test-qudoric5fuzu/rclone-sync-test/, notFound
    run.go:128: removing dir "rclone-sync-test" failed: removing directory marker failed: googleapi: Error 404: No such object: rclone-test-qudoric5fuzu/rclone-sync-test/, notFound
    fstest.go:292: Sleeping for 1s for list eventual consistency: 1/3
    fstest.go:292: Sleeping for 2s for list eventual consistency: 2/3
    fstest.go:292: Sleeping for 4s for list eventual consistency: 3/3
    fstest.go:321: 
        	Error Trace:	/home/rclone/go/src/github.com/rclone/rclone/fstest/fstest.go:321
        	            				/home/rclone/go/src/github.com/rclone/rclone/fstest/fstest.go:332
        	            				/home/rclone/go/src/github.com/rclone/rclone/fstest/run.go:173
        	            				/home/rclone/go/src/github.com/rclone/rclone/fstest/run.go:388
        	            				/home/rclone/go/pkg/mod/golang.org/toolchain@v0.0.1-go1.23.0.linux-amd64/src/testing/testing.go:1176
        	            				/home/rclone/go/pkg/mod/golang.org/toolchain@v0.0.1-go1.23.0.linux-amd64/src/testing/testing.go:1354
        	            				/home/rclone/go/pkg/mod/golang.org/toolchain@v0.0.1-go1.23.0.linux-amd64/src/testing/testing.go:1684
        	Error:      	Not equal: 
        	            	expected: []string{}
        	            	actual  : []string{"rclone-sync-test", "rclone-sync-test-ignore-file", "rclone-sync-test-include", "rclone-sync-test-include/layer2"}
        	            	
        	            	Diff:
        	            	--- Expected
        	            	+++ Actual
        	            	@@ -1,2 +1,6 @@
        	            	-([]string) {
        	            	+([]string) (len=4) {
        	            	+ (string) (len=16) "rclone-sync-test",
        	            	+ (string) (len=28) "rclone-sync-test-ignore-file",
        	            	+ (string) (len=24) "rclone-sync-test-include",
        	            	+ (string) (len=31) "rclone-sync-test-include/layer2"
        	            	 }
        	Test:       	TestSyncOverlapWithFilter
        	Messages:   	directories
2025/03/28 01:49:58 DEBUG : rclone-sync-test-include/layer2/: Removing directory marker
    run.go:125: removing dir "rclone-sync-test-include/layer2" failed - try 1/3: removing directory marker failed: googleapi: Error 404: No such object: rclone-test-qudoric5fuzu/rclone-sync-test-include/layer2/, notFound
2025/03/28 01:49:59 DEBUG : rclone-sync-test-include/layer2/: Removing directory marker
    run.go:125: removing dir "rclone-sync-test-include/layer2" failed - try 2/3: removing directory marker failed: googleapi: Error 404: No such object: rclone-test-qudoric5fuzu/rclone-sync-test-include/layer2/, notFound
2025/03/28 01:50:00 DEBUG : rclone-sync-test-include/layer2/: Removing directory marker
    run.go:125: removing dir "rclone-sync-test-include/layer2" failed - try 3/3: removing directory marker failed: googleapi: Error 404: No such object: rclone-test-qudoric5fuzu/rclone-sync-test-include/layer2/, notFound
    run.go:128: removing dir "rclone-sync-test-include/layer2" failed: removing directory marker failed: googleapi: Error 404: No such object: rclone-test-qudoric5fuzu/rclone-sync-test-include/layer2/, notFound
2025/03/28 01:50:01 DEBUG : rclone-sync-test-include/: Removing directory marker
    run.go:125: removing dir "rclone-sync-test-include" failed - try 1/3: removing directory marker failed: googleapi: Error 404: No such object: rclone-test-qudoric5fuzu/rclone-sync-test-include/, notFound
2025/03/28 01:50:02 DEBUG : rclone-sync-test-include/: Removing directory marker
    run.go:125: removing dir "rclone-sync-test-include" failed - try 2/3: removing directory marker failed: googleapi: Error 404: No such object: rclone-test-qudoric5fuzu/rclone-sync-test-include/, notFound
2025/03/28 01:50:03 DEBUG : rclone-sync-test-include/: Removing directory marker
    run.go:125: removing dir "rclone-sync-test-include" failed - try 3/3: removing directory marker failed: googleapi: Error 404: No such object: rclone-test-qudoric5fuzu/rclone-sync-test-include/, notFound
    run.go:128: removing dir "rclone-sync-test-include" failed: removing directory marker failed: googleapi: Error 404: No such object: rclone-test-qudoric5fuzu/rclone-sync-test-include/, notFound
2025/03/28 01:50:04 DEBUG : rclone-sync-test-ignore-file/: Removing directory marker
    run.go:125: removing dir "rclone-sync-test-ignore-file" failed - try 1/3: removing directory marker failed: googleapi: Error 404: No such object: rclone-test-qudoric5fuzu/rclone-sync-test-ignore-file/, notFound
2025/03/28 01:50:05 DEBUG : rclone-sync-test-ignore-file/: Removing directory marker
    run.go:125: removing dir "rclone-sync-test-ignore-file" failed - try 2/3: removing directory marker failed: googleapi: Error 404: No such object: rclone-test-qudoric5fuzu/rclone-sync-test-ignore-file/, notFound
2025/03/28 01:50:06 DEBUG : rclone-sync-test-ignore-file/: Removing directory marker
    run.go:125: removing dir "rclone-sync-test-ignore-file" failed - try 3/3: removing directory marker failed: googleapi: Error 404: No such object: rclone-test-qudoric5fuzu/rclone-sync-test-ignore-file/, notFound
    run.go:128: removing dir "rclone-sync-test-ignore-file" failed: removing directory marker failed: googleapi: Error 404: No such object: rclone-test-qudoric5fuzu/rclone-sync-test-ignore-file/, notFound
2025/03/28 01:50:07 DEBUG : rclone-sync-test/: Removing directory marker
    run.go:125: removing dir "rclone-sync-test" failed - try 1/3: removing directory marker failed: googleapi: Error 404: No such object: rclone-test-qudoric5fuzu/rclone-sync-test/, notFound
2025/03/28 01:50:08 DEBUG : rclone-sync-test/: Removing directory marker
    run.go:125: removing dir "rclone-sync-test" failed - try 2/3: removing directory marker failed: googleapi: Error 404: No such object: rclone-test-qudoric5fuzu/rclone-sync-test/, notFound
2025/03/28 01:50:09 DEBUG : rclone-sync-test/: Removing directory marker
    run.go:125: removing dir "rclone-sync-test" failed - try 3/3: removing directory marker failed: googleapi: Error 404: No such object: rclone-test-qudoric5fuzu/rclone-sync-test/, notFound
    run.go:128: removing dir "rclone-sync-test" failed: removing directory marker failed: googleapi: Error 404: No such object: rclone-test-qudoric5fuzu/rclone-sync-test/, notFound
    fstest.go:292: Sleeping for 1s for list eventual consistency: 1/3
    fstest.go:292: Sleeping for 2s for list eventual consistency: 2/3
    fstest.go:292: Sleeping for 4s for list eventual consistency: 3/3
    fstest.go:321: 
        	Error Trace:	/home/rclone/go/src/github.com/rclone/rclone/fstest/fstest.go:321
        	            				/home/rclone/go/src/github.com/rclone/rclone/fstest/fstest.go:332
        	            				/home/rclone/go/src/github.com/rclone/rclone/fstest/run.go:173
        	            				/home/rclone/go/src/github.com/rclone/rclone/fstest/run.go:388
        	            				/home/rclone/go/pkg/mod/golang.org/toolchain@v0.0.1-go1.23.0.linux-amd64/src/testing/testing.go:1176
        	            				/home/rclone/go/pkg/mod/golang.org/toolchain@v0.0.1-go1.23.0.linux-amd64/src/testing/testing.go:1354
        	            				/home/rclone/go/pkg/mod/golang.org/toolchain@v0.0.1-go1.23.0.linux-amd64/src/testing/testing.go:1684
        	Error:      	Not equal: 
        	            	expected: []string{}
        	            	actual  : []string{"rclone-sync-test", "rclone-sync-test-ignore-file", "rclone-sync-test-include", "rclone-sync-test-include/layer2"}
        	            	
        	            	Diff:
        	            	--- Expected
        	            	+++ Actual
        	            	@@ -1,2 +1,6 @@
        	            	-([]string) {
        	            	+([]string) (len=4) {
        	            	+ (string) (len=16) "rclone-sync-test",
        	            	+ (string) (len=28) "rclone-sync-test-ignore-file",
        	            	+ (string) (len=24) "rclone-sync-test-include",
        	            	+ (string) (len=31) "rclone-sync-test-include/layer2"
        	            	 }
        	Test:       	TestSyncOverlapWithFilter
        	Messages:   	directories
2025/03/28 01:50:18 DEBUG : rclone-sync-test-include/layer2/: Removing directory marker
    run.go:125: removing dir "rclone-sync-test-include/layer2" failed - try 1/3: removing directory marker failed: googleapi: Error 404: No such object: rclone-test-qudoric5fuzu/rclone-sync-test-include/layer2/, notFound
2025/03/28 01:50:19 DEBUG : rclone-sync-test-include/layer2/: Removing directory marker
    run.go:125: removing dir "rclone-sync-test-include/layer2" failed - try 2/3: removing directory marker failed: googleapi: Error 404: No such object: rclone-test-qudoric5fuzu/rclone-sync-test-include/layer2/, notFound
2025/03/28 01:50:20 DEBUG : rclone-sync-test-include/layer2/: Removing directory marker
    run.go:125: removing dir "rclone-sync-test-include/layer2" failed - try 3/3: removing directory marker failed: googleapi: Error 404: No such object: rclone-test-qudoric5fuzu/rclone-sync-test-include/layer2/, notFound
    run.go:128: removing dir "rclone-sync-test-include/layer2" failed: removing directory marker failed: googleapi: Error 404: No such object: rclone-test-qudoric5fuzu/rclone-sync-test-include/layer2/, notFound
2025/03/28 01:50:21 DEBUG : rclone-sync-test-include/: Removing directory marker
    run.go:125: removing dir "rclone-sync-test-include" failed - try 1/3: removing directory marker failed: googleapi: Error 404: No such object: rclone-test-qudoric5fuzu/rclone-sync-test-include/, notFound
2025/03/28 01:50:22 DEBUG : rclone-sync-test-include/: Removing directory marker
    run.go:125: removing dir "rclone-sync-test-include" failed - try 2/3: removing directory marker failed: googleapi: Error 404: No such object: rclone-test-qudoric5fuzu/rclone-sync-test-include/, notFound
2025/03/28 01:50:23 DEBUG : rclone-sync-test-include/: Removing directory marker
    run.go:125: removing dir "rclone-sync-test-include" failed - try 3/3: removing directory marker failed: googleapi: Error 404: No such object: rclone-test-qudoric5fuzu/rclone-sync-test-include/, notFound
    run.go:128: removing dir "rclone-sync-test-include" failed: removing directory marker failed: googleapi: Error 404: No such object: rclone-test-qudoric5fuzu/rclone-sync-test-include/, notFound
2025/03/28 01:50:24 DEBUG : rclone-sync-test-ignore-file/: Removing directory marker
    run.go:125: removing dir "rclone-sync-test-ignore-file" failed - try 1/3: removing directory marker failed: googleapi: Error 404: No such object: rclone-test-qudoric5fuzu/rclone-sync-test-ignore-file/, notFound
2025/03/28 01:50:25 DEBUG : rclone-sync-test-ignore-file/: Removing directory marker
    run.go:125: removing dir "rclone-sync-test-ignore-file" failed - try 2/3: removing directory marker failed: googleapi: Error 404: No such object: rclone-test-qudoric5fuzu/rclone-sync-test-ignore-file/, notFound
2025/03/28 01:50:26 DEBUG : rclone-sync-test-ignore-file/: Removing directory marker
    run.go:125: removing dir "rclone-sync-test-ignore-file" failed - try 3/3: removing directory marker failed: googleapi: Error 404: No such object: rclone-test-qudoric5fuzu/rclone-sync-test-ignore-file/, notFound
    run.go:128: removing dir "rclone-sync-test-ignore-file" failed: removing directory marker failed: googleapi: Error 404: No such object: rclone-test-qudoric5fuzu/rclone-sync-test-ignore-file/, notFound
2025/03/28 01:50:27 DEBUG : rclone-sync-test/: Removing directory marker
    run.go:125: removing dir "rclone-sync-test" failed - try 1/3: removing directory marker failed: googleapi: Error 404: No such object: rclone-test-qudoric5fuzu/rclone-sync-test/, notFound
2025/03/28 01:50:28 DEBUG : rclone-sync-test/: Removing directory marker
    run.go:125: removing dir "rclone-sync-test" failed - try 2/3: removing directory marker failed: googleapi: Error 404: No such object: rclone-test-qudoric5fuzu/rclone-sync-test/, notFound
2025/03/28 01:50:29 DEBUG : rclone-sync-test/: Removing directory marker
    run.go:125: removing dir "rclone-sync-test" failed - try 3/3: removing directory marker failed: googleapi: Error 404: No such object: rclone-test-qudoric5fuzu/rclone-sync-test/, notFound
    run.go:128: removing dir "rclone-sync-test" failed: removing directory marker failed: googleapi: Error 404: No such object: rclone-test-qudoric5fuzu/rclone-sync-test/, notFound
    fstest.go:292: Sleeping for 1s for list eventual consistency: 1/3
    fstest.go:292: Sleeping for 2s for list eventual consistency: 2/3
    fstest.go:292: Sleeping for 4s for list eventual consistency: 3/3
    fstest.go:321: 
        	Error Trace:	/home/rclone/go/src/github.com/rclone/rclone/fstest/fstest.go:321
        	            				/home/rclone/go/src/github.com/rclone/rclone/fstest/fstest.go:332
        	            				/home/rclone/go/src/github.com/rclone/rclone/fstest/run.go:173
        	            				/home/rclone/go/src/github.com/rclone/rclone/fstest/run.go:388
        	            				/home/rclone/go/pkg/mod/golang.org/toolchain@v0.0.1-go1.23.0.linux-amd64/src/testing/testing.go:1176
        	            				/home/rclone/go/pkg/mod/golang.org/toolchain@v0.0.1-go1.23.0.linux-amd64/src/testing/testing.go:1354
        	            				/home/rclone/go/pkg/mod/golang.org/toolchain@v0.0.1-go1.23.0.linux-amd64/src/testing/testing.go:1684
        	Error:      	Not equal: 
        	            	expected: []string{}
        	            	actual  : []string{"rclone-sync-test", "rclone-sync-test-ignore-file", "rclone-sync-test-include", "rclone-sync-test-include/layer2"}
        	            	
        	            	Diff:
        	            	--- Expected
        	            	+++ Actual
        	            	@@ -1,2 +1,6 @@
        	            	-([]string) {
        	            	+([]string) (len=4) {
        	            	+ (string) (len=16) "rclone-sync-test",
        	            	+ (string) (len=28) "rclone-sync-test-ignore-file",
        	            	+ (string) (len=24) "rclone-sync-test-include",
        	            	+ (string) (len=31) "rclone-sync-test-include/layer2"
        	            	 }
        	Test:       	TestSyncOverlapWithFilter
        	Messages:   	directories
2025/03/28 01:50:38 DEBUG : rclone-sync-test-include/layer2/: Removing directory marker
    run.go:125: removing dir "rclone-sync-test-include/layer2" failed - try 1/3: removing directory marker failed: googleapi: Error 404: No such object: rclone-test-qudoric5fuzu/rclone-sync-test-include/layer2/, notFound
2025/03/28 01:50:39 DEBUG : rclone-sync-test-include/layer2/: Removing directory marker
    run.go:125: removing dir "rclone-sync-test-include/layer2" failed - try 2/3: removing directory marker failed: googleapi: Error 404: No such object: rclone-test-qudoric5fuzu/rclone-sync-test-include/layer2/, notFound
2025/03/28 01:50:40 DEBUG : rclone-sync-test-include/layer2/: Removing directory marker
    run.go:125: removing dir "rclone-sync-test-include/layer2" failed - try 3/3: removing directory marker failed: googleapi: Error 404: No such object: rclone-test-qudoric5fuzu/rclone-sync-test-include/layer2/, notFound
    run.go:128: removing dir "rclone-sync-test-include/layer2" failed: removing directory marker failed: googleapi: Error 404: No such object: rclone-test-qudoric5fuzu/rclone-sync-test-include/layer2/, notFound
2025/03/28 01:50:41 DEBUG : rclone-sync-test-include/: Removing directory marker
    run.go:125: removing dir "rclone-sync-test-include" failed - try 1/3: removing directory marker failed: googleapi: Error 404: No such object: rclone-test-qudoric5fuzu/rclone-sync-test-include/, notFound
2025/03/28 01:50:42 DEBUG : rclone-sync-test-include/: Removing directory marker
    run.go:125: removing dir "rclone-sync-test-include" failed - try 2/3: removing directory marker failed: googleapi: Error 404: No such object: rclone-test-qudoric5fuzu/rclone-sync-test-include/, notFound
2025/03/28 01:50:43 DEBUG : rclone-sync-test-include/: Removing directory marker
    run.go:125: removing dir "rclone-sync-test-include" failed - try 3/3: removing directory marker failed: googleapi: Error 404: No such object: rclone-test-qudoric5fuzu/rclone-sync-test-include/, notFound
    run.go:128: removing dir "rclone-sync-test-include" failed: removing directory marker failed: googleapi: Error 404: No such object: rclone-test-qudoric5fuzu/rclone-sync-test-include/, notFound
2025/03/28 01:50:44 DEBUG : rclone-sync-test-ignore-file/: Removing directory marker
    run.go:125: removing dir "rclone-sync-test-ignore-file" failed - try 1/3: removing directory marker failed: googleapi: Error 404: No such object: rclone-test-qudoric5fuzu/rclone-sync-test-ignore-file/, notFound
2025/03/28 01:50:45 DEBUG : rclone-sync-test-ignore-file/: Removing directory marker
    run.go:125: removing dir "rclone-sync-test-ignore-file" failed - try 2/3: removing directory marker failed: googleapi: Error 404: No such object: rclone-test-qudoric5fuzu/rclone-sync-test-ignore-file/, notFound
2025/03/28 01:50:46 DEBUG : rclone-sync-test-ignore-file/: Removing directory marker
    run.go:125: removing dir "rclone-sync-test-ignore-file" failed - try 3/3: removing directory marker failed: googleapi: Error 404: No such object: rclone-test-qudoric5fuzu/rclone-sync-test-ignore-file/, notFound
    run.go:128: removing dir "rclone-sync-test-ignore-file" failed: removing directory marker failed: googleapi: Error 404: No such object: rclone-test-qudoric5fuzu/rclone-sync-test-ignore-file/, notFound
2025/03/28 01:50:47 DEBUG : rclone-sync-test/: Removing directory marker
    run.go:125: removing dir "rclone-sync-test" failed - try 1/3: removing directory marker failed: googleapi: Error 404: No such object: rclone-test-qudoric5fuzu/rclone-sync-test/, notFound
2025/03/28 01:50:48 DEBUG : rclone-sync-test/: Removing directory marker
    run.go:125: removing dir "rclone-sync-test" failed - try 2/3: removing directory marker failed: googleapi: Error 404: No such object: rclone-test-qudoric5fuzu/rclone-sync-test/, notFound
2025/03/28 01:50:49 DEBUG : rclone-sync-test/: Removing directory marker
    run.go:125: removing dir "rclone-sync-test" failed - try 3/3: removing directory marker failed: googleapi: Error 404: No such object: rclone-test-qudoric5fuzu/rclone-sync-test/, notFound
    run.go:128: removing dir "rclone-sync-test" failed: removing directory marker failed: googleapi: Error 404: No such object: rclone-test-qudoric5fuzu/rclone-sync-test/, notFound
    fstest.go:292: Sleeping for 1s for list eventual consistency: 1/3
    fstest.go:292: Sleeping for 2s for list eventual consistency: 2/3
    fstest.go:292: Sleeping for 4s for list eventual consistency: 3/3
    fstest.go:321: 
        	Error Trace:	/home/rclone/go/src/github.com/rclone/rclone/fstest/fstest.go:321
        	            				/home/rclone/go/src/github.com/rclone/rclone/fstest/fstest.go:332
        	            				/home/rclone/go/src/github.com/rclone/rclone/fstest/run.go:173
        	            				/home/rclone/go/src/github.com/rclone/rclone/fstest/run.go:388
        	            				/home/rclone/go/pkg/mod/golang.org/toolchain@v0.0.1-go1.23.0.linux-amd64/src/testing/testing.go:1176
        	            				/home/rclone/go/pkg/mod/golang.org/toolchain@v0.0.1-go1.23.0.linux-amd64/src/testing/testing.go:1354
        	            				/home/rclone/go/pkg/mod/golang.org/toolchain@v0.0.1-go1.23.0.linux-amd64/src/testing/testing.go:1684
        	Error:      	Not equal: 
        	            	expected: []string{}
        	            	actual  : []string{"rclone-sync-test", "rclone-sync-test-ignore-file", "rclone-sync-test-include", "rclone-sync-test-include/layer2"}
        	            	
        	            	Diff:
        	            	--- Expected
        	            	+++ Actual
        	            	@@ -1,2 +1,6 @@
        	            	-([]string) {
        	            	+([]string) (len=4) {
        	            	+ (string) (len=16) "rclone-sync-test",
        	            	+ (string) (len=28) "rclone-sync-test-ignore-file",
        	            	+ (string) (len=24) "rclone-sync-test-include",
        	            	+ (string) (len=31) "rclone-sync-test-include/layer2"
        	            	 }
        	Test:       	TestSyncOverlapWithFilter
        	Messages:   	directories
2025/03/28 01:50:58 DEBUG : rclone-sync-test-include/layer2/: Removing directory marker
    run.go:125: removing dir "rclone-sync-test-include/layer2" failed - try 1/3: removing directory marker failed: googleapi: Error 404: No such object: rclone-test-qudoric5fuzu/rclone-sync-test-include/layer2/, notFound
2025/03/28 01:50:59 DEBUG : rclone-sync-test-include/layer2/: Removing directory marker
    run.go:125: removing dir "rclone-sync-test-include/layer2" failed - try 2/3: removing directory marker failed: googleapi: Error 404: No such object: rclone-test-qudoric5fuzu/rclone-sync-test-include/layer2/, notFound
2025/03/28 01:51:00 DEBUG : rclone-sync-test-include/layer2/: Removing directory marker
    run.go:125: removing dir "rclone-sync-test-include/layer2" failed - try 3/3: removing directory marker failed: googleapi: Error 404: No such object: rclone-test-qudoric5fuzu/rclone-sync-test-include/layer2/, notFound
    run.go:128: removing dir "rclone-sync-test-include/layer2" failed: removing directory marker failed: googleapi: Error 404: No such object: rclone-test-qudoric5fuzu/rclone-sync-test-include/layer2/, notFound
2025/03/28 01:51:01 DEBUG : rclone-sync-test-include/: Removing directory marker
    run.go:125: removing dir "rclone-sync-test-include" failed - try 1/3: removing directory marker failed: googleapi: Error 404: No such object: rclone-test-qudoric5fuzu/rclone-sync-test-include/, notFound
2025/03/28 01:51:02 DEBUG : rclone-sync-test-include/: Removing directory marker
    run.go:125: removing dir "rclone-sync-test-include" failed - try 2/3: removing directory marker failed: googleapi: Error 404: No such object: rclone-test-qudoric5fuzu/rclone-sync-test-include/, notFound
2025/03/28 01:51:03 DEBUG : rclone-sync-test-include/: Removing directory marker
    run.go:125: removing dir "rclone-sync-test-include" failed - try 3/3: removing directory marker failed: googleapi: Error 404: No such object: rclone-test-qudoric5fuzu/rclone-sync-test-include/, notFound
    run.go:128: removing dir "rclone-sync-test-include" failed: removing directory marker failed: googleapi: Error 404: No such object: rclone-test-qudoric5fuzu/rclone-sync-test-include/, notFound
2025/03/28 01:51:04 DEBUG : rclone-sync-test-ignore-file/: Removing directory marker
    run.go:125: removing dir "rclone-sync-test-ignore-file" failed - try 1/3: removing directory marker failed: googleapi: Error 404: No such object: rclone-test-qudoric5fuzu/rclone-sync-test-ignore-file/, notFound
2025/03/28 01:51:05 DEBUG : rclone-sync-test-ignore-file/: Removing directory marker
    run.go:125: removing dir "rclone-sync-test-ignore-file" failed - try 2/3: removing directory marker failed: googleapi: Error 404: No such object: rclone-test-qudoric5fuzu/rclone-sync-test-ignore-file/, notFound
2025/03/28 01:51:06 DEBUG : rclone-sync-test-ignore-file/: Removing directory marker
    run.go:125: removing dir "rclone-sync-test-ignore-file" failed - try 3/3: removing directory marker failed: googleapi: Error 404: No such object: rclone-test-qudoric5fuzu/rclone-sync-test-ignore-file/, notFound
    run.go:128: removing dir "rclone-sync-test-ignore-file" failed: removing directory marker failed: googleapi: Error 404: No such object: rclone-test-qudoric5fuzu/rclone-sync-test-ignore-file/, notFound
2025/03/28 01:51:07 DEBUG : rclone-sync-test/: Removing directory marker
    run.go:125: removing dir "rclone-sync-test" failed - try 1/3: removing directory marker failed: googleapi: Error 404: No such object: rclone-test-qudoric5fuzu/rclone-sync-test/, notFound
2025/03/28 01:51:08 DEBUG : rclone-sync-test/: Removing directory marker
    run.go:125: removing dir "rclone-sync-test" failed - try 2/3: removing directory marker failed: googleapi: Error 404: No such object: rclone-test-qudoric5fuzu/rclone-sync-test/, notFound
2025/03/28 01:51:09 DEBUG : rclone-sync-test/: Removing directory marker
    run.go:125: removing dir "rclone-sync-test" failed - try 3/3: removing directory marker failed: googleapi: Error 404: No such object: rclone-test-qudoric5fuzu/rclone-sync-test/, notFound
    run.go:128: removing dir "rclone-sync-test" failed: removing directory marker failed: googleapi: Error 404: No such object: rclone-test-qudoric5fuzu/rclone-sync-test/, notFound
    fstest.go:292: Sleeping for 1s for list eventual consistency: 1/3
    fstest.go:292: Sleeping for 2s for list eventual consistency: 2/3
    fstest.go:292: Sleeping for 4s for list eventual consistency: 3/3
    fstest.go:321: 
        	Error Trace:	/home/rclone/go/src/github.com/rclone/rclone/fstest/fstest.go:321
        	            				/home/rclone/go/src/github.com/rclone/rclone/fstest/fstest.go:332
        	            				/home/rclone/go/src/github.com/rclone/rclone/fstest/run.go:173
        	            				/home/rclone/go/src/github.com/rclone/rclone/fstest/run.go:388
        	            				/home/rclone/go/pkg/mod/golang.org/toolchain@v0.0.1-go1.23.0.linux-amd64/src/testing/testing.go:1176
        	            				/home/rclone/go/pkg/mod/golang.org/toolchain@v0.0.1-go1.23.0.linux-amd64/src/testing/testing.go:1354
        	            				/home/rclone/go/pkg/mod/golang.org/toolchain@v0.0.1-go1.23.0.linux-amd64/src/testing/testing.go:1684
        	Error:      	Not equal: 
        	            	expected: []string{}
        	            	actual  : []string{"rclone-sync-test", "rclone-sync-test-ignore-file", "rclone-sync-test-include", "rclone-sync-test-include/layer2"}
        	            	
        	            	Diff:
        	            	--- Expected
        	            	+++ Actual
        	            	@@ -1,2 +1,6 @@
        	            	-([]string) {
        	            	+([]string) (len=4) {
        	            	+ (string) (len=16) "rclone-sync-test",
        	            	+ (string) (len=28) "rclone-sync-test-ignore-file",
        	            	+ (string) (len=24) "rclone-sync-test-include",
        	            	+ (string) (len=31) "rclone-sync-test-include/layer2"
        	            	 }
        	Test:       	TestSyncOverlapWithFilter
        	Messages:   	directories
2025/03/28 01:51:17 DEBUG : rclone-sync-test-include/layer2/: Removing directory marker
    run.go:125: removing dir "rclone-sync-test-include/layer2" failed - try 1/3: removing directory marker failed: googleapi: Error 404: No such object: rclone-test-qudoric5fuzu/rclone-sync-test-include/layer2/, notFound
2025/03/28 01:51:18 DEBUG : rclone-sync-test-include/layer2/: Removing directory marker
    run.go:125: removing dir "rclone-sync-test-include/layer2" failed - try 2/3: removing directory marker failed: googleapi: Error 404: No such object: rclone-test-qudoric5fuzu/rclone-sync-test-include/layer2/, notFound
2025/03/28 01:51:20 DEBUG : rclone-sync-test-include/layer2/: Removing directory marker
    run.go:125: removing dir "rclone-sync-test-include/layer2" failed - try 3/3: removing directory marker failed: googleapi: Error 404: No such object: rclone-test-qudoric5fuzu/rclone-sync-test-include/layer2/, notFound
    run.go:128: removing dir "rclone-sync-test-include/layer2" failed: removing directory marker failed: googleapi: Error 404: No such object: rclone-test-qudoric5fuzu/rclone-sync-test-include/layer2/, notFound
2025/03/28 01:51:21 DEBUG : rclone-sync-test-include/: Removing directory marker
    run.go:125: removing dir "rclone-sync-test-include" failed - try 1/3: removing directory marker failed: googleapi: Error 404: No such object: rclone-test-qudoric5fuzu/rclone-sync-test-include/, notFound
2025/03/28 01:51:22 DEBUG : rclone-sync-test-include/: Removing directory marker
    run.go:125: removing dir "rclone-sync-test-include" failed - try 2/3: removing directory marker failed: googleapi: Error 404: No such object: rclone-test-qudoric5fuzu/rclone-sync-test-include/, notFound
2025/03/28 01:51:23 DEBUG : rclone-sync-test-include/: Removing directory marker
    run.go:125: removing dir "rclone-sync-test-include" failed - try 3/3: removing directory marker failed: googleapi: Error 404: No such object: rclone-test-qudoric5fuzu/rclone-sync-test-include/, notFound
    run.go:128: removing dir "rclone-sync-test-include" failed: removing directory marker failed: googleapi: Error 404: No such object: rclone-test-qudoric5fuzu/rclone-sync-test-include/, notFound
2025/03/28 01:51:24 DEBUG : rclone-sync-test-ignore-file/: Removing directory marker
    run.go:125: removing dir "rclone-sync-test-ignore-file" failed - try 1/3: removing directory marker failed: googleapi: Error 404: No such object: rclone-test-qudoric5fuzu/rclone-sync-test-ignore-file/, notFound
2025/03/28 01:51:25 DEBUG : rclone-sync-test-ignore-file/: Removing directory marker
    run.go:125: removing dir "rclone-sync-test-ignore-file" failed - try 2/3: removing directory marker failed: googleapi: Error 404: No such object: rclone-test-qudoric5fuzu/rclone-sync-test-ignore-file/, notFound
2025/03/28 01:51:26 DEBUG : rclone-sync-test-ignore-file/: Removing directory marker
    run.go:125: removing dir "rclone-sync-test-ignore-file" failed - try 3/3: removing directory marker failed: googleapi: Error 404: No such object: rclone-test-qudoric5fuzu/rclone-sync-test-ignore-file/, notFound
    run.go:128: removing dir "rclone-sync-test-ignore-file" failed: removing directory marker failed: googleapi: Error 404: No such object: rclone-test-qudoric5fuzu/rclone-sync-test-ignore-file/, notFound
2025/03/28 01:51:27 DEBUG : rclone-sync-test/: Removing directory marker
    run.go:125: removing dir "rclone-sync-test" failed - try 1/3: removing directory marker failed: googleapi: Error 404: No such object: rclone-test-qudoric5fuzu/rclone-sync-test/, notFound
2025/03/28 01:51:28 DEBUG : rclone-sync-test/: Removing directory marker
    run.go:125: removing dir "rclone-sync-test" failed - try 2/3: removing directory marker failed: googleapi: Error 404: No such object: rclone-test-qudoric5fuzu/rclone-sync-test/, notFound
2025/03/28 01:51:29 DEBUG : rclone-sync-test/: Removing directory marker
    run.go:125: removing dir "rclone-sync-test" failed - try 3/3: removing directory marker failed: googleapi: Error 404: No such object: rclone-test-qudoric5fuzu/rclone-sync-test/, notFound
    run.go:128: removing dir "rclone-sync-test" failed: removing directory marker failed: googleapi: Error 404: No such object: rclone-test-qudoric5fuzu/rclone-sync-test/, notFound
    fstest.go:292: Sleeping for 1s for list eventual consistency: 1/3
    fstest.go:292: Sleeping for 2s for list eventual consistency: 2/3
    fstest.go:292: Sleeping for 4s for list eventual consistency: 3/3
    fstest.go:321: 
        	Error Trace:	/home/rclone/go/src/github.com/rclone/rclone/fstest/fstest.go:321
        	            				/home/rclone/go/src/github.com/rclone/rclone/fstest/fstest.go:332
        	            				/home/rclone/go/src/github.com/rclone/rclone/fstest/run.go:173
        	            				/home/rclone/go/src/github.com/rclone/rclone/fstest/run.go:388
        	            				/home/rclone/go/pkg/mod/golang.org/toolchain@v0.0.1-go1.23.0.linux-amd64/src/testing/testing.go:1176
        	            				/home/rclone/go/pkg/mod/golang.org/toolchain@v0.0.1-go1.23.0.linux-amd64/src/testing/testing.go:1354
        	            				/home/rclone/go/pkg/mod/golang.org/toolchain@v0.0.1-go1.23.0.linux-amd64/src/testing/testing.go:1684
        	Error:      	Not equal: 
        	            	expected: []string{}
        	            	actual  : []string{"rclone-sync-test", "rclone-sync-test-ignore-file", "rclone-sync-test-include", "rclone-sync-test-include/layer2"}
        	            	
        	            	Diff:
        	            	--- Expected
        	            	+++ Actual
        	            	@@ -1,2 +1,6 @@
        	            	-([]string) {
        	            	+([]string) (len=4) {
        	            	+ (string) (len=16) "rclone-sync-test",
        	            	+ (string) (len=28) "rclone-sync-test-ignore-file",
        	            	+ (string) (len=24) "rclone-sync-test-include",
        	            	+ (string) (len=31) "rclone-sync-test-include/layer2"
        	            	 }
        	Test:       	TestSyncOverlapWithFilter
        	Messages:   	directories
2025/03/28 01:51:37 DEBUG : rclone-sync-test-include/layer2/: Removing directory marker
    run.go:125: removing dir "rclone-sync-test-include/layer2" failed - try 1/3: removing directory marker failed: googleapi: Error 404: No such object: rclone-test-qudoric5fuzu/rclone-sync-test-include/layer2/, notFound
2025/03/28 01:51:38 DEBUG : rclone-sync-test-include/layer2/: Removing directory marker
    run.go:125: removing dir "rclone-sync-test-include/layer2" failed - try 2/3: removing directory marker failed: googleapi: Error 404: No such object: rclone-test-qudoric5fuzu/rclone-sync-test-include/layer2/, notFound
2025/03/28 01:51:39 DEBUG : rclone-sync-test-include/layer2/: Removing directory marker
    run.go:125: removing dir "rclone-sync-test-include/layer2" failed - try 3/3: removing directory marker failed: googleapi: Error 404: No such object: rclone-test-qudoric5fuzu/rclone-sync-test-include/layer2/, notFound
    run.go:128: removing dir "rclone-sync-test-include/layer2" failed: removing directory marker failed: googleapi: Error 404: No such object: rclone-test-qudoric5fuzu/rclone-sync-test-include/layer2/, notFound
2025/03/28 01:51:40 DEBUG : rclone-sync-test-include/: Removing directory marker
    run.go:125: removing dir "rclone-sync-test-include" failed - try 1/3: removing directory marker failed: googleapi: Error 404: No such object: rclone-test-qudoric5fuzu/rclone-sync-test-include/, notFound
2025/03/28 01:51:41 DEBUG : rclone-sync-test-include/: Removing directory marker
    run.go:125: removing dir "rclone-sync-test-include" failed - try 2/3: removing directory marker failed: googleapi: Error 404: No such object: rclone-test-qudoric5fuzu/rclone-sync-test-include/, notFound
2025/03/28 01:51:43 DEBUG : rclone-sync-test-include/: Removing directory marker
    run.go:125: removing dir "rclone-sync-test-include" failed - try 3/3: removing directory marker failed: googleapi: Error 404: No such object: rclone-test-qudoric5fuzu/rclone-sync-test-include/, notFound
    run.go:128: removing dir "rclone-sync-test-include" failed: removing directory marker failed: googleapi: Error 404: No such object: rclone-test-qudoric5fuzu/rclone-sync-test-include/, notFound
2025/03/28 01:51:44 DEBUG : rclone-sync-test-ignore-file/: Removing directory marker
    run.go:125: removing dir "rclone-sync-test-ignore-file" failed - try 1/3: removing directory marker failed: googleapi: Error 404: No such object: rclone-test-qudoric5fuzu/rclone-sync-test-ignore-file/, notFound
2025/03/28 01:51:45 DEBUG : rclone-sync-test-ignore-file/: Removing directory marker
    run.go:125: removing dir "rclone-sync-test-ignore-file" failed - try 2/3: removing directory marker failed: googleapi: Error 404: No such object: rclone-test-qudoric5fuzu/rclone-sync-test-ignore-file/, notFound
2025/03/28 01:51:46 DEBUG : rclone-sync-test-ignore-file/: Removing directory marker
    run.go:125: removing dir "rclone-sync-test-ignore-file" failed - try 3/3: removing directory marker failed: googleapi: Error 404: No such object: rclone-test-qudoric5fuzu/rclone-sync-test-ignore-file/, notFound
    run.go:128: removing dir "rclone-sync-test-ignore-file" failed: removing directory marker failed: googleapi: Error 404: No such object: rclone-test-qudoric5fuzu/rclone-sync-test-ignore-file/, notFound
2025/03/28 01:51:47 DEBUG : rclone-sync-test/: Removing directory marker
    run.go:125: removing dir "rclone-sync-test" failed - try 1/3: removing directory marker failed: googleapi: Error 404: No such object: rclone-test-qudoric5fuzu/rclone-sync-test/, notFound
2025/03/28 01:51:48 DEBUG : rclone-sync-test/: Removing directory marker
    run.go:125: removing dir "rclone-sync-test" failed - try 2/3: removing directory marker failed: googleapi: Error 404: No such object: rclone-test-qudoric5fuzu/rclone-sync-test/, notFound
2025/03/28 01:51:49 DEBUG : rclone-sync-test/: Removing directory marker
    run.go:125: removing dir "rclone-sync-test" failed - try 3/3: removing directory marker failed: googleapi: Error 404: No such object: rclone-test-qudoric5fuzu/rclone-sync-test/, notFound
    run.go:128: removing dir "rclone-sync-test" failed: removing directory marker failed: googleapi: Error 404: No such object: rclone-test-qudoric5fuzu/rclone-sync-test/, notFound
    fstest.go:292: Sleeping for 1s for list eventual consistency: 1/3
    fstest.go:292: Sleeping for 2s for list eventual consistency: 2/3
    fstest.go:292: Sleeping for 4s for list eventual consistency: 3/3
    fstest.go:321: 
        	Error Trace:	/home/rclone/go/src/github.com/rclone/rclone/fstest/fstest.go:321
        	            				/home/rclone/go/src/github.com/rclone/rclone/fstest/fstest.go:332
        	            				/home/rclone/go/src/github.com/rclone/rclone/fstest/run.go:173
        	            				/home/rclone/go/src/github.com/rclone/rclone/fstest/run.go:388
        	            				/home/rclone/go/pkg/mod/golang.org/toolchain@v0.0.1-go1.23.0.linux-amd64/src/testing/testing.go:1176
        	            				/home/rclone/go/pkg/mod/golang.org/toolchain@v0.0.1-go1.23.0.linux-amd64/src/testing/testing.go:1354
        	            				/home/rclone/go/pkg/mod/golang.org/toolchain@v0.0.1-go1.23.0.linux-amd64/src/testing/testing.go:1684
        	Error:      	Not equal: 
        	            	expected: []string{}
        	            	actual  : []string{"rclone-sync-test", "rclone-sync-test-ignore-file", "rclone-sync-test-include", "rclone-sync-test-include/layer2"}
        	            	
        	            	Diff:
        	            	--- Expected
        	            	+++ Actual
        	            	@@ -1,2 +1,6 @@
        	            	-([]string) {
        	            	+([]string) (len=4) {
        	            	+ (string) (len=16) "rclone-sync-test",
        	            	+ (string) (len=28) "rclone-sync-test-ignore-file",
        	            	+ (string) (len=24) "rclone-sync-test-include",
        	            	+ (string) (len=31) "rclone-sync-test-include/layer2"
        	            	 }
        	Test:       	TestSyncOverlapWithFilter
        	Messages:   	directories
2025/03/28 01:51:57 DEBUG : rclone-sync-test-include/layer2/: Removing directory marker
    run.go:125: removing dir "rclone-sync-test-include/layer2" failed - try 1/3: removing directory marker failed: googleapi: Error 404: No such object: rclone-test-qudoric5fuzu/rclone-sync-test-include/layer2/, notFound
2025/03/28 01:51:58 DEBUG : rclone-sync-test-include/layer2/: Removing directory marker
    run.go:125: removing dir "rclone-sync-test-include/layer2" failed - try 2/3: removing directory marker failed: googleapi: Error 404: No such object: rclone-test-qudoric5fuzu/rclone-sync-test-include/layer2/, notFound
2025/03/28 01:51:59 DEBUG : rclone-sync-test-include/layer2/: Removing directory marker
    run.go:125: removing dir "rclone-sync-test-include/layer2" failed - try 3/3: removing directory marker failed: googleapi: Error 404: No such object: rclone-test-qudoric5fuzu/rclone-sync-test-include/layer2/, notFound
    run.go:128: removing dir "rclone-sync-test-include/layer2" failed: removing directory marker failed: googleapi: Error 404: No such object: rclone-test-qudoric5fuzu/rclone-sync-test-include/layer2/, notFound
2025/03/28 01:52:00 DEBUG : rclone-sync-test-include/: Removing directory marker
    run.go:125: removing dir "rclone-sync-test-include" failed - try 1/3: removing directory marker failed: googleapi: Error 404: No such object: rclone-test-qudoric5fuzu/rclone-sync-test-include/, notFound
2025/03/28 01:52:01 DEBUG : rclone-sync-test-include/: Removing directory marker
    run.go:125: removing dir "rclone-sync-test-include" failed - try 2/3: removing directory marker failed: googleapi: Error 404: No such object: rclone-test-qudoric5fuzu/rclone-sync-test-include/, notFound
2025/03/28 01:52:02 DEBUG : rclone-sync-test-include/: Removing directory marker
    run.go:125: removing dir "rclone-sync-test-include" failed - try 3/3: removing directory marker failed: googleapi: Error 404: No such object: rclone-test-qudoric5fuzu/rclone-sync-test-include/, notFound
    run.go:128: removing dir "rclone-sync-test-include" failed: removing directory marker failed: googleapi: Error 404: No such object: rclone-test-qudoric5fuzu/rclone-sync-test-include/, notFound
2025/03/28 01:52:03 DEBUG : rclone-sync-test-ignore-file/: Removing directory marker
    run.go:125: removing dir "rclone-sync-test-ignore-file" failed - try 1/3: removing directory marker failed: googleapi: Error 404: No such object: rclone-test-qudoric5fuzu/rclone-sync-test-ignore-file/, notFound
2025/03/28 01:52:05 DEBUG : rclone-sync-test-ignore-file/: Removing directory marker
    run.go:125: removing dir "rclone-sync-test-ignore-file" failed - try 2/3: removing directory marker failed: googleapi: Error 404: No such object: rclone-test-qudoric5fuzu/rclone-sync-test-ignore-file/, notFound
2025/03/28 01:52:06 DEBUG : rclone-sync-test-ignore-file/: Removing directory marker
    run.go:125: removing dir "rclone-sync-test-ignore-file" failed - try 3/3: removing directory marker failed: googleapi: Error 404: No such object: rclone-test-qudoric5fuzu/rclone-sync-test-ignore-file/, notFound
    run.go:128: removing dir "rclone-sync-test-ignore-file" failed: removing directory marker failed: googleapi: Error 404: No such object: rclone-test-qudoric5fuzu/rclone-sync-test-ignore-file/, notFound
2025/03/28 01:52:07 DEBUG : rclone-sync-test/: Removing directory marker
    run.go:125: removing dir "rclone-sync-test" failed - try 1/3: removing directory marker failed: googleapi: Error 404: No such object: rclone-test-qudoric5fuzu/rclone-sync-test/, notFound
2025/03/28 01:52:08 DEBUG : rclone-sync-test/: Removing directory marker
    run.go:125: removing dir "rclone-sync-test" failed - try 2/3: removing directory marker failed: googleapi: Error 404: No such object: rclone-test-qudoric5fuzu/rclone-sync-test/, notFound
2025/03/28 01:52:09 DEBUG : rclone-sync-test/: Removing directory marker
    run.go:125: removing dir "rclone-sync-test" failed - try 3/3: removing directory marker failed: googleapi: Error 404: No such object: rclone-test-qudoric5fuzu/rclone-sync-test/, notFound
    run.go:128: removing dir "rclone-sync-test" failed: removing directory marker failed: googleapi: Error 404: No such object: rclone-test-qudoric5fuzu/rclone-sync-test/, notFound
    fstest.go:292: Sleeping for 1s for list eventual consistency: 1/3
    fstest.go:292: Sleeping for 2s for list eventual consistency: 2/3
    fstest.go:292: Sleeping for 4s for list eventual consistency: 3/3
    fstest.go:321: 
        	Error Trace:	/home/rclone/go/src/github.com/rclone/rclone/fstest/fstest.go:321
        	            				/home/rclone/go/src/github.com/rclone/rclone/fstest/fstest.go:332
        	            				/home/rclone/go/src/github.com/rclone/rclone/fstest/run.go:173
        	            				/home/rclone/go/src/github.com/rclone/rclone/fstest/run.go:388
        	            				/home/rclone/go/pkg/mod/golang.org/toolchain@v0.0.1-go1.23.0.linux-amd64/src/testing/testing.go:1176
        	            				/home/rclone/go/pkg/mod/golang.org/toolchain@v0.0.1-go1.23.0.linux-amd64/src/testing/testing.go:1354
        	            				/home/rclone/go/pkg/mod/golang.org/toolchain@v0.0.1-go1.23.0.linux-amd64/src/testing/testing.go:1684
        	Error:      	Not equal: 
        	            	expected: []string{}
        	            	actual  : []string{"rclone-sync-test", "rclone-sync-test-ignore-file", "rclone-sync-test-include", "rclone-sync-test-include/layer2"}
        	            	
        	            	Diff:
        	            	--- Expected
        	            	+++ Actual
        	            	@@ -1,2 +1,6 @@
        	            	-([]string) {
        	            	+([]string) (len=4) {
        	            	+ (string) (len=16) "rclone-sync-test",
        	            	+ (string) (len=28) "rclone-sync-test-ignore-file",
        	            	+ (string) (len=24) "rclone-sync-test-include",
        	            	+ (string) (len=31) "rclone-sync-test-include/layer2"
        	            	 }
        	Test:       	TestSyncOverlapWithFilter
        	Messages:   	directories
2025/03/28 01:52:17 DEBUG : rclone-sync-test-include/layer2/: Removing directory marker
    run.go:125: removing dir "rclone-sync-test-include/layer2" failed - try 1/3: removing directory marker failed: googleapi: Error 404: No such object: rclone-test-qudoric5fuzu/rclone-sync-test-include/layer2/, notFound
2025/03/28 01:52:18 DEBUG : rclone-sync-test-include/layer2/: Removing directory marker
    run.go:125: removing dir "rclone-sync-test-include/layer2" failed - try 2/3: removing directory marker failed: googleapi: Error 404: No such object: rclone-test-qudoric5fuzu/rclone-sync-test-include/layer2/, notFound
2025/03/28 01:52:19 DEBUG : rclone-sync-test-include/layer2/: Removing directory marker
    run.go:125: removing dir "rclone-sync-test-include/layer2" failed - try 3/3: removing directory marker failed: googleapi: Error 404: No such object: rclone-test-qudoric5fuzu/rclone-sync-test-include/layer2/, notFound
    run.go:128: removing dir "rclone-sync-test-include/layer2" failed: removing directory marker failed: googleapi: Error 404: No such object: rclone-test-qudoric5fuzu/rclone-sync-test-include/layer2/, notFound
2025/03/28 01:52:20 DEBUG : rclone-sync-test-include/: Removing directory marker
    run.go:125: removing dir "rclone-sync-test-include" failed - try 1/3: removing directory marker failed: googleapi: Error 404: No such object: rclone-test-qudoric5fuzu/rclone-sync-test-include/, notFound
2025/03/28 01:52:21 DEBUG : rclone-sync-test-include/: Removing directory marker
    run.go:125: removing dir "rclone-sync-test-include" failed - try 2/3: removing directory marker failed: googleapi: Error 404: No such object: rclone-test-qudoric5fuzu/rclone-sync-test-include/, notFound
2025/03/28 01:52:22 DEBUG : rclone-sync-test-include/: Removing directory marker
    run.go:125: removing dir "rclone-sync-test-include" failed - try 3/3: removing directory marker failed: googleapi: Error 404: No such object: rclone-test-qudoric5fuzu/rclone-sync-test-include/, notFound
    run.go:128: removing dir "rclone-sync-test-include" failed: removing directory marker failed: googleapi: Error 404: No such object: rclone-test-qudoric5fuzu/rclone-sync-test-include/, notFound
2025/03/28 01:52:23 DEBUG : rclone-sync-test-ignore-file/: Removing directory marker
    run.go:125: removing dir "rclone-sync-test-ignore-file" failed - try 1/3: removing directory marker failed: googleapi: Error 404: No such object: rclone-test-qudoric5fuzu/rclone-sync-test-ignore-file/, notFound
2025/03/28 01:52:24 DEBUG : rclone-sync-test-ignore-file/: Removing directory marker
    run.go:125: removing dir "rclone-sync-test-ignore-file" failed - try 2/3: removing directory marker failed: googleapi: Error 404: No such object: rclone-test-qudoric5fuzu/rclone-sync-test-ignore-file/, notFound
2025/03/28 01:52:25 DEBUG : rclone-sync-test-ignore-file/: Removing directory marker
    run.go:125: removing dir "rclone-sync-test-ignore-file" failed - try 3/3: removing directory marker failed: googleapi: Error 404: No such object: rclone-test-qudoric5fuzu/rclone-sync-test-ignore-file/, notFound
    run.go:128: removing dir "rclone-sync-test-ignore-file" failed: removing directory marker failed: googleapi: Error 404: No such object: rclone-test-qudoric5fuzu/rclone-sync-test-ignore-file/, notFound
2025/03/28 01:52:26 DEBUG : rclone-sync-test/: Removing directory marker
    run.go:125: removing dir "rclone-sync-test" failed - try 1/3: removing directory marker failed: googleapi: Error 404: No such object: rclone-test-qudoric5fuzu/rclone-sync-test/, notFound
2025/03/28 01:52:28 DEBUG : rclone-sync-test/: Removing directory marker
    run.go:125: removing dir "rclone-sync-test" failed - try 2/3: removing directory marker failed: googleapi: Error 404: No such object: rclone-test-qudoric5fuzu/rclone-sync-test/, notFound
2025/03/28 01:52:29 DEBUG : rclone-sync-test/: Removing directory marker
    run.go:125: removing dir "rclone-sync-test" failed - try 3/3: removing directory marker failed: googleapi: Error 404: No such object: rclone-test-qudoric5fuzu/rclone-sync-test/, notFound
    run.go:128: removing dir "rclone-sync-test" failed: removing directory marker failed: googleapi: Error 404: No such object: rclone-test-qudoric5fuzu/rclone-sync-test/, notFound
    fstest.go:292: Sleeping for 1s for list eventual consistency: 1/3
    fstest.go:292: Sleeping for 2s for list eventual consistency: 2/3
    fstest.go:292: Sleeping for 4s for list eventual consistency: 3/3
    fstest.go:321: 
        	Error Trace:	/home/rclone/go/src/github.com/rclone/rclone/fstest/fstest.go:321
        	            				/home/rclone/go/src/github.com/rclone/rclone/fstest/fstest.go:332
        	            				/home/rclone/go/src/github.com/rclone/rclone/fstest/run.go:173
        	            				/home/rclone/go/src/github.com/rclone/rclone/fstest/run.go:388
        	            				/home/rclone/go/pkg/mod/golang.org/toolchain@v0.0.1-go1.23.0.linux-amd64/src/testing/testing.go:1176
        	            				/home/rclone/go/pkg/mod/golang.org/toolchain@v0.0.1-go1.23.0.linux-amd64/src/testing/testing.go:1354
        	            				/home/rclone/go/pkg/mod/golang.org/toolchain@v0.0.1-go1.23.0.linux-amd64/src/testing/testing.go:1684
        	Error:      	Not equal: 
        	            	expected: []string{}
        	            	actual  : []string{"rclone-sync-test", "rclone-sync-test-ignore-file", "rclone-sync-test-include", "rclone-sync-test-include/layer2"}
        	            	
        	            	Diff:
        	            	--- Expected
        	            	+++ Actual
        	            	@@ -1,2 +1,6 @@
        	            	-([]string) {
        	            	+([]string) (len=4) {
        	            	+ (string) (len=16) "rclone-sync-test",
        	            	+ (string) (len=28) "rclone-sync-test-ignore-file",
        	            	+ (string) (len=24) "rclone-sync-test-include",
        	            	+ (string) (len=31) "rclone-sync-test-include/layer2"
        	            	 }
        	Test:       	TestSyncOverlapWithFilter
        	Messages:   	directories
2025/03/28 01:52:37 DEBUG : rclone-sync-test-include/layer2/: Removing directory marker
    run.go:125: removing dir "rclone-sync-test-include/layer2" failed - try 1/3: removing directory marker failed: googleapi: Error 404: No such object: rclone-test-qudoric5fuzu/rclone-sync-test-include/layer2/, notFound
2025/03/28 01:52:38 DEBUG : rclone-sync-test-include/layer2/: Removing directory marker
    run.go:125: removing dir "rclone-sync-test-include/layer2" failed - try 2/3: removing directory marker failed: googleapi: Error 404: No such object: rclone-test-qudoric5fuzu/rclone-sync-test-include/layer2/, notFound
2025/03/28 01:52:39 DEBUG : rclone-sync-test-include/layer2/: Removing directory marker
    run.go:125: removing dir "rclone-sync-test-include/layer2" failed - try 3/3: removing directory marker failed: googleapi: Error 404: No such object: rclone-test-qudoric5fuzu/rclone-sync-test-include/layer2/, notFound
    run.go:128: removing dir "rclone-sync-test-include/layer2" failed: removing directory marker failed: googleapi: Error 404: No such object: rclone-test-qudoric5fuzu/rclone-sync-test-include/layer2/, notFound
2025/03/28 01:52:40 DEBUG : rclone-sync-test-include/: Removing directory marker
    run.go:125: removing dir "rclone-sync-test-include" failed - try 1/3: removing directory marker failed: googleapi: Error 404: No such object: rclone-test-qudoric5fuzu/rclone-sync-test-include/, notFound
2025/03/28 01:52:41 DEBUG : rclone-sync-test-include/: Removing directory marker
    run.go:125: removing dir "rclone-sync-test-include" failed - try 2/3: removing directory marker failed: googleapi: Error 404: No such object: rclone-test-qudoric5fuzu/rclone-sync-test-include/, notFound
2025/03/28 01:52:42 DEBUG : rclone-sync-test-include/: Removing directory marker
    run.go:125: removing dir "rclone-sync-test-include" failed - try 3/3: removing directory marker failed: googleapi: Error 404: No such object: rclone-test-qudoric5fuzu/rclone-sync-test-include/, notFound
    run.go:128: removing dir "rclone-sync-test-include" failed: removing directory marker failed: googleapi: Error 404: No such object: rclone-test-qudoric5fuzu/rclone-sync-test-include/, notFound
2025/03/28 01:52:43 DEBUG : rclone-sync-test-ignore-file/: Removing directory marker
    run.go:125: removing dir "rclone-sync-test-ignore-file" failed - try 1/3: removing directory marker failed: googleapi: Error 404: No such object: rclone-test-qudoric5fuzu/rclone-sync-test-ignore-file/, notFound
2025/03/28 01:52:44 DEBUG : rclone-sync-test-ignore-file/: Removing directory marker
    run.go:125: removing dir "rclone-sync-test-ignore-file" failed - try 2/3: removing directory marker failed: googleapi: Error 404: No such object: rclone-test-qudoric5fuzu/rclone-sync-test-ignore-file/, notFound
2025/03/28 01:52:45 DEBUG : rclone-sync-test-ignore-file/: Removing directory marker
    run.go:125: removing dir "rclone-sync-test-ignore-file" failed - try 3/3: removing directory marker failed: googleapi: Error 404: No such object: rclone-test-qudoric5fuzu/rclone-sync-test-ignore-file/, notFound
    run.go:128: removing dir "rclone-sync-test-ignore-file" failed: removing directory marker failed: googleapi: Error 404: No such object: rclone-test-qudoric5fuzu/rclone-sync-test-ignore-file/, notFound
2025/03/28 01:52:46 DEBUG : rclone-sync-test/: Removing directory marker
    run.go:125: removing dir "rclone-sync-test" failed - try 1/3: removing directory marker failed: googleapi: Error 404: No such object: rclone-test-qudoric5fuzu/rclone-sync-test/, notFound
2025/03/28 01:52:47 DEBUG : rclone-sync-test/: Removing directory marker
    run.go:125: removing dir "rclone-sync-test" failed - try 2/3: removing directory marker failed: googleapi: Error 404: No such object: rclone-test-qudoric5fuzu/rclone-sync-test/, notFound
2025/03/28 01:52:48 DEBUG : rclone-sync-test/: Removing directory marker
    run.go:125: removing dir "rclone-sync-test" failed - try 3/3: removing directory marker failed: googleapi: Error 404: No such object: rclone-test-qudoric5fuzu/rclone-sync-test/, notFound
    run.go:128: removing dir "rclone-sync-test" failed: removing directory marker failed: googleapi: Error 404: No such object: rclone-test-qudoric5fuzu/rclone-sync-test/, notFound
    fstest.go:292: Sleeping for 1s for list eventual consistency: 1/3
    fstest.go:292: Sleeping for 2s for list eventual consistency: 2/3
    fstest.go:292: Sleeping for 4s for list eventual consistency: 3/3
    fstest.go:321: 
        	Error Trace:	/home/rclone/go/src/github.com/rclone/rclone/fstest/fstest.go:321
        	            				/home/rclone/go/src/github.com/rclone/rclone/fstest/fstest.go:332
        	            				/home/rclone/go/src/github.com/rclone/rclone/fstest/run.go:173
        	            				/home/rclone/go/src/github.com/rclone/rclone/fstest/run.go:388
        	            				/home/rclone/go/pkg/mod/golang.org/toolchain@v0.0.1-go1.23.0.linux-amd64/src/testing/testing.go:1176
        	            				/home/rclone/go/pkg/mod/golang.org/toolchain@v0.0.1-go1.23.0.linux-amd64/src/testing/testing.go:1354
        	            				/home/rclone/go/pkg/mod/golang.org/toolchain@v0.0.1-go1.23.0.linux-amd64/src/testing/testing.go:1684
        	Error:      	Not equal: 
        	            	expected: []string{}
        	            	actual  : []string{"rclone-sync-test", "rclone-sync-test-ignore-file", "rclone-sync-test-include", "rclone-sync-test-include/layer2"}
        	            	
        	            	Diff:
        	            	--- Expected
        	            	+++ Actual
        	            	@@ -1,2 +1,6 @@
        	            	-([]string) {
        	            	+([]string) (len=4) {
        	            	+ (string) (len=16) "rclone-sync-test",
        	            	+ (string) (len=28) "rclone-sync-test-ignore-file",
        	            	+ (string) (len=24) "rclone-sync-test-include",
        	            	+ (string) (len=31) "rclone-sync-test-include/layer2"
        	            	 }
        	Test:       	TestSyncOverlapWithFilter
        	Messages:   	directories
2025/03/28 01:52:57 DEBUG : rclone-sync-test-include/layer2/: Removing directory marker
    run.go:125: removing dir "rclone-sync-test-include/layer2" failed - try 1/3: removing directory marker failed: googleapi: Error 404: No such object: rclone-test-qudoric5fuzu/rclone-sync-test-include/layer2/, notFound
2025/03/28 01:52:58 DEBUG : rclone-sync-test-include/layer2/: Removing directory marker
    run.go:125: removing dir "rclone-sync-test-include/layer2" failed - try 2/3: removing directory marker failed: googleapi: Error 404: No such object: rclone-test-qudoric5fuzu/rclone-sync-test-include/layer2/, notFound
2025/03/28 01:52:59 DEBUG : rclone-sync-test-include/layer2/: Removing directory marker
    run.go:125: removing dir "rclone-sync-test-include/layer2" failed - try 3/3: removing directory marker failed: googleapi: Error 404: No such object: rclone-test-qudoric5fuzu/rclone-sync-test-include/layer2/, notFound
    run.go:128: removing dir "rclone-sync-test-include/layer2" failed: removing directory marker failed: googleapi: Error 404: No such object: rclone-test-qudoric5fuzu/rclone-sync-test-include/layer2/, notFound
2025/03/28 01:53:00 DEBUG : rclone-sync-test-include/: Removing directory marker
    run.go:125: removing dir "rclone-sync-test-include" failed - try 1/3: removing directory marker failed: googleapi: Error 404: No such object: rclone-test-qudoric5fuzu/rclone-sync-test-include/, notFound
2025/03/28 01:53:01 DEBUG : rclone-sync-test-include/: Removing directory marker
    run.go:125: removing dir "rclone-sync-test-include" failed - try 2/3: removing directory marker failed: googleapi: Error 404: No such object: rclone-test-qudoric5fuzu/rclone-sync-test-include/, notFound
2025/03/28 01:53:02 DEBUG : rclone-sync-test-include/: Removing directory marker
    run.go:125: removing dir "rclone-sync-test-include" failed - try 3/3: removing directory marker failed: googleapi: Error 404: No such object: rclone-test-qudoric5fuzu/rclone-sync-test-include/, notFound
    run.go:128: removing dir "rclone-sync-test-include" failed: removing directory marker failed: googleapi: Error 404: No such object: rclone-test-qudoric5fuzu/rclone-sync-test-include/, notFound
2025/03/28 01:53:03 DEBUG : rclone-sync-test-ignore-file/: Removing directory marker
    run.go:125: removing dir "rclone-sync-test-ignore-file" failed - try 1/3: removing directory marker failed: googleapi: Error 404: No such object: rclone-test-qudoric5fuzu/rclone-sync-test-ignore-file/, notFound
2025/03/28 01:53:04 DEBUG : rclone-sync-test-ignore-file/: Removing directory marker
    run.go:125: removing dir "rclone-sync-test-ignore-file" failed - try 2/3: removing directory marker failed: googleapi: Error 404: No such object: rclone-test-qudoric5fuzu/rclone-sync-test-ignore-file/, notFound
2025/03/28 01:53:05 DEBUG : rclone-sync-test-ignore-file/: Removing directory marker
    run.go:125: removing dir "rclone-sync-test-ignore-file" failed - try 3/3: removing directory marker failed: googleapi: Error 404: No such object: rclone-test-qudoric5fuzu/rclone-sync-test-ignore-file/, notFound
    run.go:128: removing dir "rclone-sync-test-ignore-file" failed: removing directory marker failed: googleapi: Error 404: No such object: rclone-test-qudoric5fuzu/rclone-sync-test-ignore-file/, notFound
2025/03/28 01:53:06 DEBUG : rclone-sync-test/: Removing directory marker
    run.go:125: removing dir "rclone-sync-test" failed - try 1/3: removing directory marker failed: googleapi: Error 404: No such object: rclone-test-qudoric5fuzu/rclone-sync-test/, notFound
2025/03/28 01:53:07 DEBUG : rclone-sync-test/: Removing directory marker
    run.go:125: removing dir "rclone-sync-test" failed - try 2/3: removing directory marker failed: googleapi: Error 404: No such object: rclone-test-qudoric5fuzu/rclone-sync-test/, notFound
2025/03/28 01:53:08 DEBUG : rclone-sync-test/: Removing directory marker
    run.go:125: removing dir "rclone-sync-test" failed - try 3/3: removing directory marker failed: googleapi: Error 404: No such object: rclone-test-qudoric5fuzu/rclone-sync-test/, notFound
    run.go:128: removing dir "rclone-sync-test" failed: removing directory marker failed: googleapi: Error 404: No such object: rclone-test-qudoric5fuzu/rclone-sync-test/, notFound
    fstest.go:292: Sleeping for 1s for list eventual consistency: 1/3
    fstest.go:292: Sleeping for 2s for list eventual consistency: 2/3
    fstest.go:292: Sleeping for 4s for list eventual consistency: 3/3
    fstest.go:321: 
        	Error Trace:	/home/rclone/go/src/github.com/rclone/rclone/fstest/fstest.go:321
        	            				/home/rclone/go/src/github.com/rclone/rclone/fstest/fstest.go:332
        	            				/home/rclone/go/src/github.com/rclone/rclone/fstest/run.go:173
        	            				/home/rclone/go/src/github.com/rclone/rclone/fstest/run.go:388
        	            				/home/rclone/go/pkg/mod/golang.org/toolchain@v0.0.1-go1.23.0.linux-amd64/src/testing/testing.go:1176
        	            				/home/rclone/go/pkg/mod/golang.org/toolchain@v0.0.1-go1.23.0.linux-amd64/src/testing/testing.go:1354
        	            				/home/rclone/go/pkg/mod/golang.org/toolchain@v0.0.1-go1.23.0.linux-amd64/src/testing/testing.go:1684
        	Error:      	Not equal: 
        	            	expected: []string{}
        	            	actual  : []string{"rclone-sync-test", "rclone-sync-test-ignore-file", "rclone-sync-test-include", "rclone-sync-test-include/layer2"}
        	            	
        	            	Diff:
        	            	--- Expected
        	            	+++ Actual
        	            	@@ -1,2 +1,6 @@
        	            	-([]string) {
        	            	+([]string) (len=4) {
        	            	+ (string) (len=16) "rclone-sync-test",
        	            	+ (string) (len=28) "rclone-sync-test-ignore-file",
        	            	+ (string) (len=24) "rclone-sync-test-include",
        	            	+ (string) (len=31) "rclone-sync-test-include/layer2"
        	            	 }
        	Test:       	TestSyncOverlapWithFilter
        	Messages:   	directories
--- FAIL: TestSyncOverlapWithFilter (395.07s)
=== RUN   TestSyncCompareDest
    run.go:180: Remote "GCS bucket rclone-test-qudoric5fuzu", Local "Local file system at /tmp/rclone2030427926", Modify Window "1ns"
2025/03/28 01:53:17 DEBUG : Creating backend with remote "TestGoogleCloudStorage,directory_markers:rclone-test-qudoric5fuzu/dst"
2025/03/28 01:53:17 DEBUG : Config file has changed externally - reloading
2025/03/28 01:53:17 DEBUG : TestGoogleCloudStorage: detected overridden config - adding "{juk_h}" suffix to name
2025/03/28 01:53:17 DEBUG : Creating backend with remote "TestGoogleCloudStorage,directory_markers:rclone-test-qudoric5fuzu/CompareDest"
2025/03/28 01:53:17 DEBUG : TestGoogleCloudStorage: detected overridden config - adding "{juk_h}" suffix to name
2025/03/28 01:53:18 DEBUG : fs cache: renaming cache item "TestGoogleCloudStorage,directory_markers:rclone-test-qudoric5fuzu/CompareDest" to be canonical "TestGoogleCloudStorage{juk_h}:rclone-test-qudoric5fuzu/CompareDest"
2025/03/28 01:53:18 DEBUG : one: Need to transfer - File not found at Destination
2025/03/28 01:53:18 DEBUG : GCS bucket rclone-test-qudoric5fuzu path dst: Waiting for checks to finish
2025/03/28 01:53:18 DEBUG : GCS bucket rclone-test-qudoric5fuzu path dst: Waiting for transfers to finish
2025/03/28 01:53:19 DEBUG : /: Creating directory marker
2025/03/28 01:53:19 DEBUG : one: md5 = f97c5d29941bfb1b2fdab0874906ab82 OK
2025/03/28 01:53:19 INFO  : one: Copied (new)
2025/03/28 01:53:19 DEBUG : Waiting for deletions to finish
2025/03/28 01:53:19 DEBUG : fs cache: switching user supplied name "TestGoogleCloudStorage,directory_markers:rclone-test-qudoric5fuzu/CompareDest" for canonical name "TestGoogleCloudStorage{juk_h}:rclone-test-qudoric5fuzu/CompareDest"
2025/03/28 01:53:19 ERROR : : Entry doesn't belong in directory "" (same as directory) - ignoring
2025/03/28 01:53:19 DEBUG : GCS bucket rclone-test-qudoric5fuzu path dst: Waiting for checks to finish
2025/03/28 01:53:19 DEBUG : one: Sizes differ (src 5 vs dst 3)
2025/03/28 01:53:20 DEBUG : GCS bucket rclone-test-qudoric5fuzu path dst: Waiting for transfers to finish
2025/03/28 01:53:20 DEBUG : one: md5 = 07912d142f5d63ee918b34796b5a2432 OK
2025/03/28 01:53:20 INFO  : one: Copied (replaced existing)
2025/03/28 01:53:20 DEBUG : Waiting for deletions to finish
2025/03/28 01:53:20 DEBUG : dst/: Creating directory marker
2025/03/28 01:53:21 DEBUG : CompareDest/: Creating directory marker
2025/03/28 01:53:21 DEBUG : fs cache: switching user supplied name "TestGoogleCloudStorage,directory_markers:rclone-test-qudoric5fuzu/CompareDest" for canonical name "TestGoogleCloudStorage{juk_h}:rclone-test-qudoric5fuzu/CompareDest"
2025/03/28 01:53:21 ERROR : : Entry doesn't belong in directory "" (same as directory) - ignoring
2025/03/28 01:53:21 DEBUG : one: Sizes differ (src 5 vs dst 3)
2025/03/28 01:53:21 DEBUG : GCS bucket rclone-test-qudoric5fuzu path dst: Waiting for checks to finish
2025/03/28 01:53:21 DEBUG : one: Size and modification time the same (differ by 0s, within tolerance 1ns)
2025/03/28 01:53:21 DEBUG : one: Destination found in --compare-dest, skipping
2025/03/28 01:53:21 DEBUG : GCS bucket rclone-test-qudoric5fuzu path dst: Waiting for transfers to finish
2025/03/28 01:53:21 DEBUG : Waiting for deletions to finish
2025/03/28 01:53:21 INFO  : There was nothing to transfer
2025/03/28 01:53:22 DEBUG : fs cache: switching user supplied name "TestGoogleCloudStorage,directory_markers:rclone-test-qudoric5fuzu/CompareDest" for canonical name "TestGoogleCloudStorage{juk_h}:rclone-test-qudoric5fuzu/CompareDest"
2025/03/28 01:53:22 ERROR : : Entry doesn't belong in directory "" (same as directory) - ignoring
2025/03/28 01:53:22 DEBUG : two: Size and modification time the same (differ by 0s, within tolerance 1ns)
2025/03/28 01:53:22 DEBUG : two: Destination found in --compare-dest, skipping
2025/03/28 01:53:22 DEBUG : one: Sizes differ (src 5 vs dst 3)
2025/03/28 01:53:22 DEBUG : GCS bucket rclone-test-qudoric5fuzu path dst: Waiting for checks to finish
2025/03/28 01:53:22 DEBUG : one: Size and modification time the same (differ by 0s, within tolerance 1ns)
2025/03/28 01:53:22 DEBUG : one: Destination found in --compare-dest, skipping
2025/03/28 01:53:22 DEBUG : GCS bucket rclone-test-qudoric5fuzu path dst: Waiting for transfers to finish
2025/03/28 01:53:22 DEBUG : Waiting for deletions to finish
2025/03/28 01:53:22 INFO  : There was nothing to transfer
2025/03/28 01:53:22 DEBUG : fs cache: switching user supplied name "TestGoogleCloudStorage,directory_markers:rclone-test-qudoric5fuzu/CompareDest" for canonical name "TestGoogleCloudStorage{juk_h}:rclone-test-qudoric5fuzu/CompareDest"
2025/03/28 01:53:22 ERROR : : Entry doesn't belong in directory "" (same as directory) - ignoring
2025/03/28 01:53:22 DEBUG : two: Size and modification time the same (differ by 0s, within tolerance 1ns)
2025/03/28 01:53:22 DEBUG : two: Destination found in --compare-dest, skipping
2025/03/28 01:53:22 DEBUG : one: Sizes differ (src 5 vs dst 3)
2025/03/28 01:53:22 DEBUG : GCS bucket rclone-test-qudoric5fuzu path dst: Waiting for checks to finish
2025/03/28 01:53:22 DEBUG : one: Size and modification time the same (differ by 0s, within tolerance 1ns)
2025/03/28 01:53:22 DEBUG : one: Destination found in --compare-dest, skipping
2025/03/28 01:53:22 DEBUG : GCS bucket rclone-test-qudoric5fuzu path dst: Waiting for transfers to finish
2025/03/28 01:53:22 DEBUG : Waiting for deletions to finish
2025/03/28 01:53:22 INFO  : There was nothing to transfer
2025/03/28 01:53:22 DEBUG : fs cache: switching user supplied name "TestGoogleCloudStorage,directory_markers:rclone-test-qudoric5fuzu/CompareDest" for canonical name "TestGoogleCloudStorage{juk_h}:rclone-test-qudoric5fuzu/CompareDest"
2025/03/28 01:53:23 ERROR : : Entry doesn't belong in directory "" (same as directory) - ignoring
2025/03/28 01:53:23 DEBUG : two: Modification times differ by -119h59m59.876543211s: 2011-12-30 12:59:59 +0000 UTC, 2011-12-25 12:59:59.123456789 +0000 UTC
2025/03/28 01:53:23 DEBUG : two: md5 = b8a9f715dbb64fd5c56e7783c6820a61 OK
2025/03/28 01:53:23 DEBUG : two: Destination found in --compare-dest, skipping
2025/03/28 01:53:23 DEBUG : one: Sizes differ (src 5 vs dst 3)
2025/03/28 01:53:23 DEBUG : GCS bucket rclone-test-qudoric5fuzu path dst: Waiting for checks to finish
2025/03/28 01:53:23 DEBUG : one: Size and modification time the same (differ by 0s, within tolerance 1ns)
2025/03/28 01:53:23 DEBUG : one: Destination found in --compare-dest, skipping
2025/03/28 01:53:23 DEBUG : GCS bucket rclone-test-qudoric5fuzu path dst: Waiting for transfers to finish
2025/03/28 01:53:23 DEBUG : Waiting for deletions to finish
2025/03/28 01:53:23 INFO  : There was nothing to transfer
2025/03/28 01:53:23 DEBUG : fs cache: switching user supplied name "TestGoogleCloudStorage,directory_markers:rclone-test-qudoric5fuzu/CompareDest" for canonical name "TestGoogleCloudStorage{juk_h}:rclone-test-qudoric5fuzu/CompareDest"
2025/03/28 01:53:23 ERROR : : Entry doesn't belong in directory "" (same as directory) - ignoring
2025/03/28 01:53:23 DEBUG : two: Sizes differ (src 5 vs dst 3)
2025/03/28 01:53:23 DEBUG : two: Need to transfer - File not found at Destination
2025/03/28 01:53:23 DEBUG : one: Sizes differ (src 5 vs dst 3)
2025/03/28 01:53:23 DEBUG : GCS bucket rclone-test-qudoric5fuzu path dst: Waiting for checks to finish
2025/03/28 01:53:23 DEBUG : one: Size and modification time the same (differ by 0s, within tolerance 1ns)
2025/03/28 01:53:23 DEBUG : one: Destination found in --compare-dest, skipping
2025/03/28 01:53:23 DEBUG : GCS bucket rclone-test-qudoric5fuzu path dst: Waiting for transfers to finish
2025/03/28 01:53:23 DEBUG : two: md5 = 2379e4ce8c3380e996ab0509f17069ad OK
2025/03/28 01:53:23 INFO  : two: Copied (new)
2025/03/28 01:53:23 DEBUG : Waiting for deletions to finish
2025/03/28 01:53:24 DEBUG : rclone-sync-test-include/layer2/: Removing directory marker
    run.go:125: removing dir "rclone-sync-test-include/layer2" failed - try 1/3: removing directory marker failed: googleapi: Error 404: No such object: rclone-test-qudoric5fuzu/rclone-sync-test-include/layer2/, notFound
2025/03/28 01:53:25 DEBUG : rclone-sync-test-include/layer2/: Removing directory marker
    run.go:125: removing dir "rclone-sync-test-include/layer2" failed - try 2/3: removing directory marker failed: googleapi: Error 404: No such object: rclone-test-qudoric5fuzu/rclone-sync-test-include/layer2/, notFound
2025/03/28 01:53:26 DEBUG : rclone-sync-test-include/layer2/: Removing directory marker
    run.go:125: removing dir "rclone-sync-test-include/layer2" failed - try 3/3: removing directory marker failed: googleapi: Error 404: No such object: rclone-test-qudoric5fuzu/rclone-sync-test-include/layer2/, notFound
    run.go:128: removing dir "rclone-sync-test-include/layer2" failed: removing directory marker failed: googleapi: Error 404: No such object: rclone-test-qudoric5fuzu/rclone-sync-test-include/layer2/, notFound
2025/03/28 01:53:27 DEBUG : rclone-sync-test-include/: Removing directory marker
    run.go:125: removing dir "rclone-sync-test-include" failed - try 1/3: removing directory marker failed: googleapi: Error 404: No such object: rclone-test-qudoric5fuzu/rclone-sync-test-include/, notFound
2025/03/28 01:53:28 DEBUG : rclone-sync-test-include/: Removing directory marker
    run.go:125: removing dir "rclone-sync-test-include" failed - try 2/3: removing directory marker failed: googleapi: Error 404: No such object: rclone-test-qudoric5fuzu/rclone-sync-test-include/, notFound
2025/03/28 01:53:29 DEBUG : rclone-sync-test-include/: Removing directory marker
    run.go:125: removing dir "rclone-sync-test-include" failed - try 3/3: removing directory marker failed: googleapi: Error 404: No such object: rclone-test-qudoric5fuzu/rclone-sync-test-include/, notFound
    run.go:128: removing dir "rclone-sync-test-include" failed: removing directory marker failed: googleapi: Error 404: No such object: rclone-test-qudoric5fuzu/rclone-sync-test-include/, notFound
2025/03/28 01:53:30 DEBUG : rclone-sync-test-ignore-file/: Removing directory marker
    run.go:125: removing dir "rclone-sync-test-ignore-file" failed - try 1/3: removing directory marker failed: googleapi: Error 404: No such object: rclone-test-qudoric5fuzu/rclone-sync-test-ignore-file/, notFound
2025/03/28 01:53:31 DEBUG : rclone-sync-test-ignore-file/: Removing directory marker
    run.go:125: removing dir "rclone-sync-test-ignore-file" failed - try 2/3: removing directory marker failed: googleapi: Error 404: No such object: rclone-test-qudoric5fuzu/rclone-sync-test-ignore-file/, notFound
2025/03/28 01:53:32 DEBUG : rclone-sync-test-ignore-file/: Removing directory marker
    run.go:125: removing dir "rclone-sync-test-ignore-file" failed - try 3/3: removing directory marker failed: googleapi: Error 404: No such object: rclone-test-qudoric5fuzu/rclone-sync-test-ignore-file/, notFound
    run.go:128: removing dir "rclone-sync-test-ignore-file" failed: removing directory marker failed: googleapi: Error 404: No such object: rclone-test-qudoric5fuzu/rclone-sync-test-ignore-file/, notFound
2025/03/28 01:53:33 DEBUG : rclone-sync-test/: Removing directory marker
    run.go:125: removing dir "rclone-sync-test" failed - try 1/3: removing directory marker failed: googleapi: Error 404: No such object: rclone-test-qudoric5fuzu/rclone-sync-test/, notFound
2025/03/28 01:53:34 DEBUG : rclone-sync-test/: Removing directory marker
    run.go:125: removing dir "rclone-sync-test" failed - try 2/3: removing directory marker failed: googleapi: Error 404: No such object: rclone-test-qudoric5fuzu/rclone-sync-test/, notFound
2025/03/28 01:53:35 DEBUG : rclone-sync-test/: Removing directory marker
    run.go:125: removing dir "rclone-sync-test" failed - try 3/3: removing directory marker failed: googleapi: Error 404: No such object: rclone-test-qudoric5fuzu/rclone-sync-test/, notFound
    run.go:128: removing dir "rclone-sync-test" failed: removing directory marker failed: googleapi: Error 404: No such object: rclone-test-qudoric5fuzu/rclone-sync-test/, notFound
2025/03/28 01:53:37 DEBUG : dst/: Removing directory marker
2025/03/28 01:53:37 DEBUG : dst/: Removing directory marker
    run.go:125: removing dir "dst" failed - try 1/3: removing directory marker failed: googleapi: Error 404: No such object: rclone-test-qudoric5fuzu/dst/, notFound
2025/03/28 01:53:38 DEBUG : dst/: Removing directory marker
    run.go:125: removing dir "dst" failed - try 2/3: removing directory marker failed: googleapi: Error 404: No such object: rclone-test-qudoric5fuzu/dst/, notFound
2025/03/28 01:53:39 DEBUG : dst/: Removing directory marker
    run.go:125: removing dir "dst" failed - try 3/3: removing directory marker failed: googleapi: Error 404: No such object: rclone-test-qudoric5fuzu/dst/, notFound
    run.go:128: removing dir "dst" failed: removing directory marker failed: googleapi: Error 404: No such object: rclone-test-qudoric5fuzu/dst/, notFound
2025/03/28 01:53:40 DEBUG : CompareDest/: Removing directory marker
    fstest.go:292: Sleeping for 1s for list eventual consistency: 1/3
    fstest.go:292: Sleeping for 2s for list eventual consistency: 2/3
    fstest.go:292: Sleeping for 4s for list eventual consistency: 3/3
    fstest.go:321: 
        	Error Trace:	/home/rclone/go/src/github.com/rclone/rclone/fstest/fstest.go:321
        	            				/home/rclone/go/src/github.com/rclone/rclone/fstest/fstest.go:332
        	            				/home/rclone/go/src/github.com/rclone/rclone/fstest/run.go:173
        	            				/home/rclone/go/src/github.com/rclone/rclone/fstest/run.go:388
        	            				/home/rclone/go/pkg/mod/golang.org/toolchain@v0.0.1-go1.23.0.linux-amd64/src/testing/testing.go:1176
        	            				/home/rclone/go/pkg/mod/golang.org/toolchain@v0.0.1-go1.23.0.linux-amd64/src/testing/testing.go:1354
        	            				/home/rclone/go/pkg/mod/golang.org/toolchain@v0.0.1-go1.23.0.linux-amd64/src/testing/testing.go:1684
        	Error:      	Not equal: 
        	            	expected: []string{}
        	            	actual  : []string{"dst", "rclone-sync-test", "rclone-sync-test-ignore-file", "rclone-sync-test-include", "rclone-sync-test-include/layer2"}
        	            	
        	            	Diff:
        	            	--- Expected
        	            	+++ Actual
        	            	@@ -1,2 +1,7 @@
        	            	-([]string) {
        	            	+([]string) (len=5) {
        	            	+ (string) (len=3) "dst",
        	            	+ (string) (len=16) "rclone-sync-test",
        	            	+ (string) (len=28) "rclone-sync-test-ignore-file",
        	            	+ (string) (len=24) "rclone-sync-test-include",
        	            	+ (string) (len=31) "rclone-sync-test-include/layer2"
        	            	 }
        	Test:       	TestSyncCompareDest
        	Messages:   	directories
--- FAIL: TestSyncCompareDest (30.44s)
=== RUN   TestSyncMultipleCompareDest
    run.go:180: Remote "GCS bucket rclone-test-qudoric5fuzu", Local "Local file system at /tmp/rclone2030427926", Modify Window "1ns"
2025/03/28 01:53:47 DEBUG : pre-dest1/: Creating directory marker
2025/03/28 01:53:48 DEBUG : pre-dest2/: Creating directory marker
2025/03/28 01:53:48 DEBUG : Creating backend with remote "TestGoogleCloudStorage,directory_markers:rclone-test-qudoric5fuzu/dest"
2025/03/28 01:53:48 DEBUG : TestGoogleCloudStorage: detected overridden config - adding "{juk_h}" suffix to name
2025/03/28 01:53:49 DEBUG : Creating backend with remote "TestGoogleCloudStorage,directory_markers:rclone-test-qudoric5fuzu/pre-dest1"
2025/03/28 01:53:49 DEBUG : TestGoogleCloudStorage: detected overridden config - adding "{juk_h}" suffix to name
2025/03/28 01:53:49 DEBUG : fs cache: renaming cache item "TestGoogleCloudStorage,directory_markers:rclone-test-qudoric5fuzu/pre-dest1" to be canonical "TestGoogleCloudStorage{juk_h}:rclone-test-qudoric5fuzu/pre-dest1"
2025/03/28 01:53:49 DEBUG : Creating backend with remote "TestGoogleCloudStorage,directory_markers:rclone-test-qudoric5fuzu/pre-dest2"
2025/03/28 01:53:49 DEBUG : TestGoogleCloudStorage: detected overridden config - adding "{juk_h}" suffix to name
2025/03/28 01:53:50 DEBUG : fs cache: renaming cache item "TestGoogleCloudStorage,directory_markers:rclone-test-qudoric5fuzu/pre-dest2" to be canonical "TestGoogleCloudStorage{juk_h}:rclone-test-qudoric5fuzu/pre-dest2"
2025/03/28 01:53:50 DEBUG : 1: Size and modification time the same (differ by 0s, within tolerance 1ns)
2025/03/28 01:53:50 DEBUG : 1: Destination found in --compare-dest, skipping
2025/03/28 01:53:51 DEBUG : 2: Size and modification time the same (differ by 0s, within tolerance 1ns)
2025/03/28 01:53:51 DEBUG : 2: Destination found in --compare-dest, skipping
2025/03/28 01:53:51 DEBUG : 3: Need to transfer - File not found at Destination
2025/03/28 01:53:51 DEBUG : GCS bucket rclone-test-qudoric5fuzu path dest: Waiting for checks to finish
2025/03/28 01:53:51 DEBUG : GCS bucket rclone-test-qudoric5fuzu path dest: Waiting for transfers to finish
2025/03/28 01:53:52 DEBUG : /: Creating directory marker
2025/03/28 01:53:52 DEBUG : 3: md5 = eccbc87e4b5ce2fe28308fd9f2a7baf3 OK
2025/03/28 01:53:52 INFO  : 3: Copied (new)
2025/03/28 01:53:52 DEBUG : Waiting for deletions to finish
2025/03/28 01:53:52 DEBUG : rclone-sync-test-include/layer2/: Removing directory marker
    run.go:125: removing dir "rclone-sync-test-include/layer2" failed - try 1/3: removing directory marker failed: googleapi: Error 404: No such object: rclone-test-qudoric5fuzu/rclone-sync-test-include/layer2/, notFound
2025/03/28 01:53:54 DEBUG : rclone-sync-test-include/layer2/: Removing directory marker
    run.go:125: removing dir "rclone-sync-test-include/layer2" failed - try 2/3: removing directory marker failed: googleapi: Error 404: No such object: rclone-test-qudoric5fuzu/rclone-sync-test-include/layer2/, notFound
2025/03/28 01:53:55 DEBUG : rclone-sync-test-include/layer2/: Removing directory marker
    run.go:125: removing dir "rclone-sync-test-include/layer2" failed - try 3/3: removing directory marker failed: googleapi: Error 404: No such object: rclone-test-qudoric5fuzu/rclone-sync-test-include/layer2/, notFound
    run.go:128: removing dir "rclone-sync-test-include/layer2" failed: removing directory marker failed: googleapi: Error 404: No such object: rclone-test-qudoric5fuzu/rclone-sync-test-include/layer2/, notFound
2025/03/28 01:53:56 DEBUG : rclone-sync-test-include/: Removing directory marker
    run.go:125: removing dir "rclone-sync-test-include" failed - try 1/3: removing directory marker failed: googleapi: Error 404: No such object: rclone-test-qudoric5fuzu/rclone-sync-test-include/, notFound
2025/03/28 01:53:57 DEBUG : rclone-sync-test-include/: Removing directory marker
    run.go:125: removing dir "rclone-sync-test-include" failed - try 2/3: removing directory marker failed: googleapi: Error 404: No such object: rclone-test-qudoric5fuzu/rclone-sync-test-include/, notFound
2025/03/28 01:53:58 DEBUG : rclone-sync-test-include/: Removing directory marker
    run.go:125: removing dir "rclone-sync-test-include" failed - try 3/3: removing directory marker failed: googleapi: Error 404: No such object: rclone-test-qudoric5fuzu/rclone-sync-test-include/, notFound
    run.go:128: removing dir "rclone-sync-test-include" failed: removing directory marker failed: googleapi: Error 404: No such object: rclone-test-qudoric5fuzu/rclone-sync-test-include/, notFound
2025/03/28 01:53:59 DEBUG : rclone-sync-test-ignore-file/: Removing directory marker
    run.go:125: removing dir "rclone-sync-test-ignore-file" failed - try 1/3: removing directory marker failed: googleapi: Error 404: No such object: rclone-test-qudoric5fuzu/rclone-sync-test-ignore-file/, notFound
2025/03/28 01:54:00 DEBUG : rclone-sync-test-ignore-file/: Removing directory marker
    run.go:125: removing dir "rclone-sync-test-ignore-file" failed - try 2/3: removing directory marker failed: googleapi: Error 404: No such object: rclone-test-qudoric5fuzu/rclone-sync-test-ignore-file/, notFound
2025/03/28 01:54:01 DEBUG : rclone-sync-test-ignore-file/: Removing directory marker
    run.go:125: removing dir "rclone-sync-test-ignore-file" failed - try 3/3: removing directory marker failed: googleapi: Error 404: No such object: rclone-test-qudoric5fuzu/rclone-sync-test-ignore-file/, notFound
    run.go:128: removing dir "rclone-sync-test-ignore-file" failed: removing directory marker failed: googleapi: Error 404: No such object: rclone-test-qudoric5fuzu/rclone-sync-test-ignore-file/, notFound
2025/03/28 01:54:02 DEBUG : rclone-sync-test/: Removing directory marker
    run.go:125: removing dir "rclone-sync-test" failed - try 1/3: removing directory marker failed: googleapi: Error 404: No such object: rclone-test-qudoric5fuzu/rclone-sync-test/, notFound
2025/03/28 01:54:03 DEBUG : rclone-sync-test/: Removing directory marker
    run.go:125: removing dir "rclone-sync-test" failed - try 2/3: removing directory marker failed: googleapi: Error 404: No such object: rclone-test-qudoric5fuzu/rclone-sync-test/, notFound
2025/03/28 01:54:04 DEBUG : rclone-sync-test/: Removing directory marker
    run.go:125: removing dir "rclone-sync-test" failed - try 3/3: removing directory marker failed: googleapi: Error 404: No such object: rclone-test-qudoric5fuzu/rclone-sync-test/, notFound
    run.go:128: removing dir "rclone-sync-test" failed: removing directory marker failed: googleapi: Error 404: No such object: rclone-test-qudoric5fuzu/rclone-sync-test/, notFound
2025/03/28 01:54:05 DEBUG : pre-dest2/: Removing directory marker
2025/03/28 01:54:05 DEBUG : pre-dest1/: Removing directory marker
2025/03/28 01:54:05 DEBUG : dst/: Removing directory marker
    run.go:125: removing dir "dst" failed - try 1/3: removing directory marker failed: googleapi: Error 404: No such object: rclone-test-qudoric5fuzu/dst/, notFound
2025/03/28 01:54:06 DEBUG : dst/: Removing directory marker
    run.go:125: removing dir "dst" failed - try 2/3: removing directory marker failed: googleapi: Error 404: No such object: rclone-test-qudoric5fuzu/dst/, notFound
2025/03/28 01:54:07 DEBUG : dst/: Removing directory marker
    run.go:125: removing dir "dst" failed - try 3/3: removing directory marker failed: googleapi: Error 404: No such object: rclone-test-qudoric5fuzu/dst/, notFound
    run.go:128: removing dir "dst" failed: removing directory marker failed: googleapi: Error 404: No such object: rclone-test-qudoric5fuzu/dst/, notFound
2025/03/28 01:54:08 DEBUG : dest/: Removing directory marker
    run.go:125: removing dir "dest" failed - try 1/3: removing directory marker failed: googleapi: Error 404: No such object: rclone-test-qudoric5fuzu/dest/, notFound
2025/03/28 01:54:09 DEBUG : dest/: Removing directory marker
    run.go:125: removing dir "dest" failed - try 2/3: removing directory marker failed: googleapi: Error 404: No such object: rclone-test-qudoric5fuzu/dest/, notFound
2025/03/28 01:54:10 DEBUG : dest/: Removing directory marker
    run.go:125: removing dir "dest" failed - try 3/3: removing directory marker failed: googleapi: Error 404: No such object: rclone-test-qudoric5fuzu/dest/, notFound
    run.go:128: removing dir "dest" failed: removing directory marker failed: googleapi: Error 404: No such object: rclone-test-qudoric5fuzu/dest/, notFound
    fstest.go:292: Sleeping for 1s for list eventual consistency: 1/3
    fstest.go:292: Sleeping for 2s for list eventual consistency: 2/3
    fstest.go:292: Sleeping for 4s for list eventual consistency: 3/3
    fstest.go:321: 
        	Error Trace:	/home/rclone/go/src/github.com/rclone/rclone/fstest/fstest.go:321
        	            				/home/rclone/go/src/github.com/rclone/rclone/fstest/fstest.go:332
        	            				/home/rclone/go/src/github.com/rclone/rclone/fstest/run.go:173
        	            				/home/rclone/go/src/github.com/rclone/rclone/fstest/run.go:388
        	            				/home/rclone/go/pkg/mod/golang.org/toolchain@v0.0.1-go1.23.0.linux-amd64/src/testing/testing.go:1176
        	            				/home/rclone/go/pkg/mod/golang.org/toolchain@v0.0.1-go1.23.0.linux-amd64/src/testing/testing.go:1354
        	            				/home/rclone/go/pkg/mod/golang.org/toolchain@v0.0.1-go1.23.0.linux-amd64/src/testing/testing.go:1684
        	            				/home/rclone/go/pkg/mod/golang.org/toolchain@v0.0.1-go1.23.0.linux-amd64/src/runtime/panic.go:785
        	            				/home/rclone/go/pkg/mod/golang.org/toolchain@v0.0.1-go1.23.0.linux-amd64/src/runtime/panic.go:155
        	            				/home/rclone/go/src/github.com/rclone/rclone/backend/googlecloudstorage/googlecloudstorage.go:717
        	            				/home/rclone/go/src/github.com/rclone/rclone/backend/googlecloudstorage/googlecloudstorage.go:850
        	            				/home/rclone/go/src/github.com/rclone/rclone/backend/googlecloudstorage/googlecloudstorage.go:877
        	            				/home/rclone/go/src/github.com/rclone/rclone/fs/walk/walk.go:298
        	            				/home/rclone/go/src/github.com/rclone/rclone/fs/walk/walk.go:162
        	            				/home/rclone/go/src/github.com/rclone/rclone/fs/walk/walk.go:631
        	            				/home/rclone/go/src/github.com/rclone/rclone/fstest/fstest.go:274
        	            				/home/rclone/go/src/github.com/rclone/rclone/fstest/fstest.go:332
        	            				/home/rclone/go/src/github.com/rclone/rclone/fstest/fstest.go:344
        	            				/home/rclone/go/src/github.com/rclone/rclone/fs/sync/sync_test.go:2224
        	Error:      	Not equal: 
        	            	expected: []string{}
        	            	actual  : []string{"dest", "dst", "rclone-sync-test", "rclone-sync-test-ignore-file", "rclone-sync-test-include", "rclone-sync-test-include/layer2"}
        	            	
        	            	Diff:
        	            	--- Expected
        	            	+++ Actual
        	            	@@ -1,2 +1,8 @@
        	            	-([]string) {
        	            	+([]string) (len=6) {
        	            	+ (string) (len=4) "dest",
        	            	+ (string) (len=3) "dst",
        	            	+ (string) (len=16) "rclone-sync-test",
        	            	+ (string) (len=28) "rclone-sync-test-ignore-file",
        	            	+ (string) (len=24) "rclone-sync-test-include",
        	            	+ (string) (len=31) "rclone-sync-test-include/layer2"
        	            	 }
        	Test:       	TestSyncMultipleCompareDest
        	Messages:   	directories
--- FAIL: TestSyncMultipleCompareDest (31.72s)
panic: runtime error: slice bounds out of range [5:4] [recovered]
	panic: runtime error: slice bounds out of range [5:4]

goroutine 1856 [running]:
testing.tRunner.func1.2({0x2410fc0, 0xc000a601c8})
	/home/rclone/go/pkg/mod/golang.org/toolchain@v0.0.1-go1.23.0.linux-amd64/src/testing/testing.go:1632 +0x230
testing.tRunner.func1()
	/home/rclone/go/pkg/mod/golang.org/toolchain@v0.0.1-go1.23.0.linux-amd64/src/testing/testing.go:1635 +0x35e
panic({0x2410fc0?, 0xc000a601c8?})
	/home/rclone/go/pkg/mod/golang.org/toolchain@v0.0.1-go1.23.0.linux-amd64/src/runtime/panic.go:785 +0x132
github.com/rclone/rclone/backend/googlecloudstorage.(*Fs).list(0xc00032c640, {0x29e9c40, 0x3d1cb20}, {0xc0007b65c9, 0x18}, {0xc0007b65e2, 0x4}, {0xc0007b65e2, 0x4}, 0x0, ...)
	/home/rclone/go/src/github.com/rclone/rclone/backend/googlecloudstorage/googlecloudstorage.go:717 +0xffe
github.com/rclone/rclone/backend/googlecloudstorage.(*Fs).ListR.func1({0xc0007b65c9?, 0x0?}, {0xc0007b65e2?, 0x47233d?}, {0xc0007b65e2?, 0x1?}, 0x60?)
	/home/rclone/go/src/github.com/rclone/rclone/backend/googlecloudstorage/googlecloudstorage.go:850 +0x95
github.com/rclone/rclone/backend/googlecloudstorage.(*Fs).ListR(0xc00032c640, {0x29e9c40, 0x3d1cb20}, {0x0?, 0x24db300?}, 0xc00079a3c0)
	/home/rclone/go/src/github.com/rclone/rclone/backend/googlecloudstorage/googlecloudstorage.go:877 +0x12a
github.com/rclone/rclone/fs/walk.listR({0x29e9c40, 0x3d1cb20}, {0x29fe600, 0xc00032c640}, {0x0, 0x0}, 0x1, 0x3, 0xc0009161b0, 0xc0009165a0, ...)
	/home/rclone/go/src/github.com/rclone/rclone/fs/walk/walk.go:298 +0x2a3
github.com/rclone/rclone/fs/walk.ListR({0x29e9c40, 0x3d1cb20}, {0x29fe600, 0xc00032c640}, {0x0, 0x0}, 0x1, 0xffffffffffffffff, 0x3, 0xc0009161b0)
	/home/rclone/go/src/github.com/rclone/rclone/fs/walk/walk.go:162 +0x1d5
github.com/rclone/rclone/fs/walk.GetAll({0x29e9c40, 0x3d1cb20}, {0x29fe600, 0xc00032c640}, {0x0, 0x0}, 0x1, 0xffffffffffffffff)
	/home/rclone/go/src/github.com/rclone/rclone/fs/walk/walk.go:631 +0x105
github.com/rclone/rclone/fstest.CheckListingWithRoot(0xc00070e000, {0x29fe600, 0xc00032c640}, {0x0, 0x0}, {0xc00094c140, 0x1, 0x1}, {0x0, 0x0, ...}, ...)
	/home/rclone/go/src/github.com/rclone/rclone/fstest/fstest.go:274 +0x3d6
github.com/rclone/rclone/fstest.CheckListingWithPrecision(...)
	/home/rclone/go/src/github.com/rclone/rclone/fstest/fstest.go:332
github.com/rclone/rclone/fstest.CheckItemsWithPrecision(...)
	/home/rclone/go/src/github.com/rclone/rclone/fstest/fstest.go:344
github.com/rclone/rclone/fs/sync.TestSyncMultipleCompareDest(0xc00070e000)
	/home/rclone/go/src/github.com/rclone/rclone/fs/sync/sync_test.go:2224 +0xa0b
testing.tRunner(0xc00070e000, 0x270f080)
	/home/rclone/go/pkg/mod/golang.org/toolchain@v0.0.1-go1.23.0.linux-amd64/src/testing/testing.go:1690 +0xf4
created by testing.(*T).Run in goroutine 1
	/home/rclone/go/pkg/mod/golang.org/toolchain@v0.0.1-go1.23.0.linux-amd64/src/testing/testing.go:1743 +0x390
"./sync.test -test.v -test.timeout 1h0m0s -remote 'TestGoogleCloudStorage,directory_markers:' -verbose -test.run '^(TestSyncCompareDest|TestSyncMultipleCompareDest|TestSyncOverlapWithFilter)$'" - Finished ERROR in 7m37.28017388s (try 2/5): exit status 2: Failed [TestSyncOverlapWithFilter TestSyncCompareDest TestSyncMultipleCompareDest]