"./sync.test -test.v -test.timeout 1h0m0s -remote 'TestGoogleCloudStorage,directory_markers:' -verbose -test.run '^(TestSyncCompareDest|TestSyncMultipleCompareDest|TestSyncOverlapWithFilter)$'" - Starting (try 3/5)
2025/03/26 05:11:22 DEBUG : Creating backend with remote "TestGoogleCloudStorage,directory_markers:rclone-test-maqakig0luvu"
2025/03/26 05:11:22 DEBUG : Using config file from "/home/rclone/.rclone.conf"
2025/03/26 05:11:22 DEBUG : TestGoogleCloudStorage: detected overridden config - adding "{juk_h}" suffix to name
2025/03/26 05:11:22 DEBUG : Creating backend with remote "/tmp/rclone928107066"
=== RUN   TestSyncOverlapWithFilter
    run.go:180: Remote "GCS bucket rclone-test-maqakig0luvu", Local "Local file system at /tmp/rclone928107066", Modify Window "1ns"
2025/03/26 05:11:22 DEBUG : Creating backend with remote "TestGoogleCloudStorage,directory_markers:rclone-test-maqakig0luvu/rclone-sync-test"
2025/03/26 05:11:22 DEBUG : TestGoogleCloudStorage: detected overridden config - adding "{juk_h}" suffix to name
2025/03/26 05:11:24 DEBUG : /: Creating directory marker
2025/03/26 05:11:25 DEBUG : Creating backend with remote "TestGoogleCloudStorage,directory_markers:rclone-test-maqakig0luvu/rclone-sync-test-include/layer2"
2025/03/26 05:11:25 DEBUG : TestGoogleCloudStorage: detected overridden config - adding "{juk_h}" suffix to name
2025/03/26 05:11:26 DEBUG : /: Creating directory marker
2025/03/26 05:11:26 DEBUG : Creating backend with remote "TestGoogleCloudStorage,directory_markers:rclone-test-maqakig0luvu/rclone-sync-test-ignore-file"
2025/03/26 05:11:26 DEBUG : TestGoogleCloudStorage: detected overridden config - adding "{juk_h}" suffix to name
2025/03/26 05:11:27 DEBUG : /: Creating directory marker
2025/03/26 05:11:28 DEBUG : rclone-sync-test-ignore-file/: Creating directory marker
2025/03/26 05:11:29 DEBUG : rclone-sync-test-ignore-file: Excluded
2025/03/26 05:11:29 ERROR : : Entry doesn't belong in directory "" (same as directory) - ignoring
2025/03/26 05:11:29 DEBUG : rclone-sync-test: Excluded
2025/03/26 05:11:30 DEBUG : rclone-sync-test-include/layer2: Excluded
2025/03/26 05:11:30 DEBUG : GCS bucket rclone-test-maqakig0luvu path rclone-sync-test: Waiting for checks to finish
2025/03/26 05:11:30 DEBUG : GCS bucket rclone-test-maqakig0luvu path rclone-sync-test: Waiting for transfers to finish
2025/03/26 05:11:30 DEBUG : Waiting for deletions to finish
2025/03/26 05:11:30 INFO  : There was nothing to transfer
2025/03/26 05:11:30 DEBUG : rclone-sync-test-ignore-file: Excluded
2025/03/26 05:11:31 ERROR : : Entry doesn't belong in directory "" (same as directory) - ignoring
2025/03/26 05:11:31 DEBUG : rclone-sync-test: Excluded
2025/03/26 05:11:31 DEBUG : rclone-sync-test-include/layer2: Excluded
2025/03/26 05:11:31 DEBUG : GCS bucket rclone-test-maqakig0luvu: Waiting for checks to finish
2025/03/26 05:11:31 DEBUG : GCS bucket rclone-test-maqakig0luvu: Waiting for transfers to finish
2025/03/26 05:11:31 DEBUG : Waiting for deletions to finish
2025/03/26 05:11:31 INFO  : rclone-sync-test-include: Removing directory
2025/03/26 05:11:31 DEBUG : rclone-sync-test-include/: Removing directory marker
2025/03/26 05:11:31 DEBUG : rclone-sync-test-include: Failed to Rmdir: removing directory marker failed: googleapi: Error 404: No such object: rclone-test-maqakig0luvu/rclone-sync-test-include/, notFound
2025/03/26 05:11:31 DEBUG : GCS bucket rclone-test-maqakig0luvu: failed to delete 1 directories
2025/03/26 05:11:31 INFO  : There was nothing to transfer
    run.go:180: Remote "GCS bucket rclone-test-maqakig0luvu", Local "Local file system at /tmp/rclone928107066", Modify Window "1ns"
2025/03/26 05:11:32 DEBUG : rclone-sync-test-ignore-file: Excluded
2025/03/26 05:11:33 DEBUG : rclone-sync-test: Excluded
2025/03/26 05:11:33 DEBUG : rclone-sync-test-include/layer2: Excluded
    run.go:180: Remote "GCS bucket rclone-test-maqakig0luvu", Local "Local file system at /tmp/rclone928107066", Modify Window "1ns"
2025/03/26 05:11:33 DEBUG : rclone-sync-test-ignore-file: Excluded
2025/03/26 05:11:34 DEBUG : rclone-sync-test: Excluded
2025/03/26 05:11:34 DEBUG : rclone-sync-test-include/layer2: Excluded
    run.go:180: Remote "GCS bucket rclone-test-maqakig0luvu", Local "Local file system at /tmp/rclone928107066", Modify Window "1ns"
2025/03/26 05:11:35 DEBUG : rclone-sync-test-ignore-file: Excluded
2025/03/26 05:11:35 DEBUG : rclone-sync-test: Excluded
2025/03/26 05:11:36 DEBUG : rclone-sync-test-include/layer2: Excluded
    run.go:180: Remote "GCS bucket rclone-test-maqakig0luvu", Local "Local file system at /tmp/rclone928107066", Modify Window "1ns"
2025/03/26 05:11:36 DEBUG : rclone-sync-test-ignore-file: Excluded
2025/03/26 05:11:37 DEBUG : rclone-sync-test: Excluded
2025/03/26 05:11:37 DEBUG : rclone-sync-test-include/layer2: Excluded
    run.go:180: Remote "GCS bucket rclone-test-maqakig0luvu", Local "Local file system at /tmp/rclone928107066", Modify Window "1ns"
2025/03/26 05:11:37 DEBUG : rclone-sync-test-ignore-file: Excluded
2025/03/26 05:11:38 DEBUG : rclone-sync-test: Excluded
2025/03/26 05:11:39 DEBUG : rclone-sync-test-include/layer2: Excluded
    run.go:180: Remote "GCS bucket rclone-test-maqakig0luvu", Local "Local file system at /tmp/rclone928107066", Modify Window "1ns"
2025/03/26 05:11:39 DEBUG : rclone-sync-test-ignore-file: Excluded
2025/03/26 05:11:40 DEBUG : rclone-sync-test: Excluded
2025/03/26 05:11:40 DEBUG : rclone-sync-test-include/layer2: Excluded
2025/03/26 05:11:40 DEBUG : rclone-sync-test-ignore-file: Excluded
2025/03/26 05:11:41 ERROR : : Entry doesn't belong in directory "" (same as directory) - ignoring
2025/03/26 05:11:41 DEBUG : rclone-sync-test: Excluded
2025/03/26 05:11:41 DEBUG : rclone-sync-test-include/layer2: Excluded
2025/03/26 05:11:41 DEBUG : GCS bucket rclone-test-maqakig0luvu path rclone-sync-test-include/layer2: Waiting for checks to finish
2025/03/26 05:11:41 DEBUG : GCS bucket rclone-test-maqakig0luvu path rclone-sync-test-include/layer2: Waiting for transfers to finish
2025/03/26 05:11:41 DEBUG : Waiting for deletions to finish
2025/03/26 05:11:41 INFO  : There was nothing to transfer
    run.go:180: Remote "GCS bucket rclone-test-maqakig0luvu", Local "Local file system at /tmp/rclone928107066", Modify Window "1ns"
2025/03/26 05:11:42 DEBUG : rclone-sync-test-ignore-file: Excluded
2025/03/26 05:11:42 DEBUG : rclone-sync-test: Excluded
2025/03/26 05:11:43 DEBUG : rclone-sync-test-include/layer2: Excluded
    run.go:180: Remote "GCS bucket rclone-test-maqakig0luvu", Local "Local file system at /tmp/rclone928107066", Modify Window "1ns"
2025/03/26 05:11:43 DEBUG : rclone-sync-test-ignore-file: Excluded
2025/03/26 05:11:43 DEBUG : rclone-sync-test: Excluded
2025/03/26 05:11:44 DEBUG : rclone-sync-test-include/layer2: Excluded
2025/03/26 05:11:44 DEBUG : rclone-sync-test-ignore-file: Excluded
2025/03/26 05:11:45 ERROR : : Entry doesn't belong in directory "" (same as directory) - ignoring
2025/03/26 05:11:45 DEBUG : rclone-sync-test: Excluded
2025/03/26 05:11:45 DEBUG : rclone-sync-test-include/layer2: Excluded
2025/03/26 05:11:45 DEBUG : GCS bucket rclone-test-maqakig0luvu: Waiting for checks to finish
2025/03/26 05:11:45 DEBUG : GCS bucket rclone-test-maqakig0luvu: Waiting for transfers to finish
2025/03/26 05:11:45 DEBUG : Waiting for deletions to finish
2025/03/26 05:11:45 INFO  : rclone-sync-test-include: Removing directory
2025/03/26 05:11:45 DEBUG : rclone-sync-test-include/: Removing directory marker
2025/03/26 05:11:45 DEBUG : rclone-sync-test-include: Failed to Rmdir: removing directory marker failed: googleapi: Error 404: No such object: rclone-test-maqakig0luvu/rclone-sync-test-include/, notFound
2025/03/26 05:11:45 DEBUG : GCS bucket rclone-test-maqakig0luvu: failed to delete 1 directories
2025/03/26 05:11:45 INFO  : There was nothing to transfer
    run.go:180: Remote "GCS bucket rclone-test-maqakig0luvu", Local "Local file system at /tmp/rclone928107066", Modify Window "1ns"
2025/03/26 05:11:46 DEBUG : rclone-sync-test-ignore-file: Excluded
2025/03/26 05:11:46 DEBUG : rclone-sync-test: Excluded
2025/03/26 05:11:47 DEBUG : rclone-sync-test-include/layer2: Excluded
    run.go:180: Remote "GCS bucket rclone-test-maqakig0luvu", Local "Local file system at /tmp/rclone928107066", Modify Window "1ns"
2025/03/26 05:11:47 DEBUG : rclone-sync-test-ignore-file: Excluded
2025/03/26 05:11:48 DEBUG : rclone-sync-test: Excluded
2025/03/26 05:11:48 DEBUG : rclone-sync-test-include/layer2: Excluded
    run.go:180: Remote "GCS bucket rclone-test-maqakig0luvu", Local "Local file system at /tmp/rclone928107066", Modify Window "1ns"
2025/03/26 05:11:49 DEBUG : rclone-sync-test-ignore-file: Excluded
2025/03/26 05:11:49 DEBUG : rclone-sync-test: Excluded
2025/03/26 05:11:50 DEBUG : rclone-sync-test-include/layer2: Excluded
    run.go:180: Remote "GCS bucket rclone-test-maqakig0luvu", Local "Local file system at /tmp/rclone928107066", Modify Window "1ns"
2025/03/26 05:11:50 DEBUG : rclone-sync-test-ignore-file: Excluded
2025/03/26 05:11:51 DEBUG : rclone-sync-test: Excluded
2025/03/26 05:11:51 DEBUG : rclone-sync-test-include/layer2: Excluded
2025/03/26 05:11:52 DEBUG : : Excluded
2025/03/26 05:11:52 DEBUG : rclone-sync-test-ignore-file: Excluded
2025/03/26 05:11:52 DEBUG : rclone-sync-test: Excluded
2025/03/26 05:11:53 DEBUG : rclone-sync-test-include/layer2: Excluded
2025/03/26 05:11:53 DEBUG : GCS bucket rclone-test-maqakig0luvu path rclone-sync-test-ignore-file: Waiting for checks to finish
2025/03/26 05:11:53 DEBUG : GCS bucket rclone-test-maqakig0luvu path rclone-sync-test-ignore-file: Waiting for transfers to finish
2025/03/26 05:11:53 DEBUG : Waiting for deletions to finish
2025/03/26 05:11:53 INFO  : There was nothing to transfer
    run.go:180: Remote "GCS bucket rclone-test-maqakig0luvu", Local "Local file system at /tmp/rclone928107066", Modify Window "1ns"
2025/03/26 05:11:53 DEBUG : rclone-sync-test-ignore-file: Excluded
2025/03/26 05:11:54 DEBUG : rclone-sync-test: Excluded
2025/03/26 05:11:54 DEBUG : rclone-sync-test-include/layer2: Excluded
    run.go:180: Remote "GCS bucket rclone-test-maqakig0luvu", Local "Local file system at /tmp/rclone928107066", Modify Window "1ns"
2025/03/26 05:11:54 DEBUG : rclone-sync-test-ignore-file: Excluded
2025/03/26 05:11:55 DEBUG : rclone-sync-test: Excluded
2025/03/26 05:11:56 DEBUG : rclone-sync-test-include/layer2: Excluded
    run.go:180: Remote "GCS bucket rclone-test-maqakig0luvu", Local "Local file system at /tmp/rclone928107066", Modify Window "1ns"
2025/03/26 05:11:56 DEBUG : rclone-sync-test-ignore-file: Excluded
2025/03/26 05:11:56 DEBUG : rclone-sync-test: Excluded
2025/03/26 05:11:57 DEBUG : rclone-sync-test-include/layer2: Excluded
    run.go:180: Remote "GCS bucket rclone-test-maqakig0luvu", Local "Local file system at /tmp/rclone928107066", Modify Window "1ns"
2025/03/26 05:11:57 DEBUG : rclone-sync-test-ignore-file: Excluded
2025/03/26 05:11:57 DEBUG : rclone-sync-test: Excluded
2025/03/26 05:11:58 DEBUG : rclone-sync-test-include/layer2: Excluded
    run.go:180: Remote "GCS bucket rclone-test-maqakig0luvu", Local "Local file system at /tmp/rclone928107066", Modify Window "1ns"
2025/03/26 05:11:58 DEBUG : rclone-sync-test-ignore-file: Excluded
2025/03/26 05:11:59 DEBUG : rclone-sync-test: Excluded
2025/03/26 05:11:59 DEBUG : rclone-sync-test-include/layer2: Excluded
2025/03/26 05:11:59 DEBUG : rclone-sync-test-include/layer2/: Removing directory marker
    run.go:125: removing dir "rclone-sync-test-include/layer2" failed - try 1/3: removing directory marker failed: googleapi: Error 404: No such object: rclone-test-maqakig0luvu/rclone-sync-test-include/layer2/, notFound
2025/03/26 05:12:00 DEBUG : rclone-sync-test-include/layer2/: Removing directory marker
    run.go:125: removing dir "rclone-sync-test-include/layer2" failed - try 2/3: removing directory marker failed: googleapi: Error 404: No such object: rclone-test-maqakig0luvu/rclone-sync-test-include/layer2/, notFound
2025/03/26 05:12:01 DEBUG : rclone-sync-test-include/layer2/: Removing directory marker
    run.go:125: removing dir "rclone-sync-test-include/layer2" failed - try 3/3: removing directory marker failed: googleapi: Error 404: No such object: rclone-test-maqakig0luvu/rclone-sync-test-include/layer2/, notFound
    run.go:128: removing dir "rclone-sync-test-include/layer2" failed: removing directory marker failed: googleapi: Error 404: No such object: rclone-test-maqakig0luvu/rclone-sync-test-include/layer2/, notFound
2025/03/26 05:12:02 DEBUG : rclone-sync-test-include/: Removing directory marker
    run.go:125: removing dir "rclone-sync-test-include" failed - try 1/3: removing directory marker failed: googleapi: Error 404: No such object: rclone-test-maqakig0luvu/rclone-sync-test-include/, notFound
2025/03/26 05:12:04 DEBUG : rclone-sync-test-include/: Removing directory marker
    run.go:125: removing dir "rclone-sync-test-include" failed - try 2/3: removing directory marker failed: googleapi: Error 404: No such object: rclone-test-maqakig0luvu/rclone-sync-test-include/, notFound
2025/03/26 05:12:05 DEBUG : rclone-sync-test-include/: Removing directory marker
    run.go:125: removing dir "rclone-sync-test-include" failed - try 3/3: removing directory marker failed: googleapi: Error 404: No such object: rclone-test-maqakig0luvu/rclone-sync-test-include/, notFound
    run.go:128: removing dir "rclone-sync-test-include" failed: removing directory marker failed: googleapi: Error 404: No such object: rclone-test-maqakig0luvu/rclone-sync-test-include/, notFound
2025/03/26 05:12:06 DEBUG : rclone-sync-test-ignore-file/: Removing directory marker
2025/03/26 05:12:06 DEBUG : rclone-sync-test-ignore-file/: Removing directory marker
    run.go:125: removing dir "rclone-sync-test-ignore-file" failed - try 1/3: removing directory marker failed: googleapi: Error 404: No such object: rclone-test-maqakig0luvu/rclone-sync-test-ignore-file/, notFound
2025/03/26 05:12:07 DEBUG : rclone-sync-test-ignore-file/: Removing directory marker
    run.go:125: removing dir "rclone-sync-test-ignore-file" failed - try 2/3: removing directory marker failed: googleapi: Error 404: No such object: rclone-test-maqakig0luvu/rclone-sync-test-ignore-file/, notFound
2025/03/26 05:12:08 DEBUG : rclone-sync-test-ignore-file/: Removing directory marker
    run.go:125: removing dir "rclone-sync-test-ignore-file" failed - try 3/3: removing directory marker failed: googleapi: Error 404: No such object: rclone-test-maqakig0luvu/rclone-sync-test-ignore-file/, notFound
    run.go:128: removing dir "rclone-sync-test-ignore-file" failed: removing directory marker failed: googleapi: Error 404: No such object: rclone-test-maqakig0luvu/rclone-sync-test-ignore-file/, notFound
2025/03/26 05:12:09 DEBUG : rclone-sync-test/: Removing directory marker
    run.go:125: removing dir "rclone-sync-test" failed - try 1/3: removing directory marker failed: googleapi: Error 404: No such object: rclone-test-maqakig0luvu/rclone-sync-test/, notFound
2025/03/26 05:12:10 DEBUG : rclone-sync-test/: Removing directory marker
    run.go:125: removing dir "rclone-sync-test" failed - try 2/3: removing directory marker failed: googleapi: Error 404: No such object: rclone-test-maqakig0luvu/rclone-sync-test/, notFound
2025/03/26 05:12:11 DEBUG : rclone-sync-test/: Removing directory marker
    run.go:125: removing dir "rclone-sync-test" failed - try 3/3: removing directory marker failed: googleapi: Error 404: No such object: rclone-test-maqakig0luvu/rclone-sync-test/, notFound
    run.go:128: removing dir "rclone-sync-test" failed: removing directory marker failed: googleapi: Error 404: No such object: rclone-test-maqakig0luvu/rclone-sync-test/, notFound
    fstest.go:292: Sleeping for 1s for list eventual consistency: 1/3
    fstest.go:292: Sleeping for 2s for list eventual consistency: 2/3
    fstest.go:292: Sleeping for 4s for list eventual consistency: 3/3
    fstest.go:321: 
        	Error Trace:	/home/rclone/go/src/github.com/rclone/rclone/fstest/fstest.go:321
        	            				/home/rclone/go/src/github.com/rclone/rclone/fstest/fstest.go:332
        	            				/home/rclone/go/src/github.com/rclone/rclone/fstest/run.go:173
        	            				/home/rclone/go/src/github.com/rclone/rclone/fstest/run.go:388
        	            				/home/rclone/go/pkg/mod/golang.org/toolchain@v0.0.1-go1.23.0.linux-amd64/src/testing/testing.go:1176
        	            				/home/rclone/go/pkg/mod/golang.org/toolchain@v0.0.1-go1.23.0.linux-amd64/src/testing/testing.go:1354
        	            				/home/rclone/go/pkg/mod/golang.org/toolchain@v0.0.1-go1.23.0.linux-amd64/src/testing/testing.go:1684
        	Error:      	Not equal: 
        	            	expected: []string{}
        	            	actual  : []string{"rclone-sync-test", "rclone-sync-test-ignore-file", "rclone-sync-test-include", "rclone-sync-test-include/layer2"}
        	            	
        	            	Diff:
        	            	--- Expected
        	            	+++ Actual
        	            	@@ -1,2 +1,6 @@
        	            	-([]string) {
        	            	+([]string) (len=4) {
        	            	+ (string) (len=16) "rclone-sync-test",
        	            	+ (string) (len=28) "rclone-sync-test-ignore-file",
        	            	+ (string) (len=24) "rclone-sync-test-include",
        	            	+ (string) (len=31) "rclone-sync-test-include/layer2"
        	            	 }
        	Test:       	TestSyncOverlapWithFilter
        	Messages:   	directories
2025/03/26 05:12:19 DEBUG : rclone-sync-test-include/layer2/: Removing directory marker
    run.go:125: removing dir "rclone-sync-test-include/layer2" failed - try 1/3: removing directory marker failed: googleapi: Error 404: No such object: rclone-test-maqakig0luvu/rclone-sync-test-include/layer2/, notFound
2025/03/26 05:12:20 DEBUG : rclone-sync-test-include/layer2/: Removing directory marker
    run.go:125: removing dir "rclone-sync-test-include/layer2" failed - try 2/3: removing directory marker failed: googleapi: Error 404: No such object: rclone-test-maqakig0luvu/rclone-sync-test-include/layer2/, notFound
2025/03/26 05:12:22 DEBUG : rclone-sync-test-include/layer2/: Removing directory marker
    run.go:125: removing dir "rclone-sync-test-include/layer2" failed - try 3/3: removing directory marker failed: googleapi: Error 404: No such object: rclone-test-maqakig0luvu/rclone-sync-test-include/layer2/, notFound
    run.go:128: removing dir "rclone-sync-test-include/layer2" failed: removing directory marker failed: googleapi: Error 404: No such object: rclone-test-maqakig0luvu/rclone-sync-test-include/layer2/, notFound
2025/03/26 05:12:23 DEBUG : rclone-sync-test-include/: Removing directory marker
    run.go:125: removing dir "rclone-sync-test-include" failed - try 1/3: removing directory marker failed: googleapi: Error 404: No such object: rclone-test-maqakig0luvu/rclone-sync-test-include/, notFound
2025/03/26 05:12:24 DEBUG : rclone-sync-test-include/: Removing directory marker
    run.go:125: removing dir "rclone-sync-test-include" failed - try 2/3: removing directory marker failed: googleapi: Error 404: No such object: rclone-test-maqakig0luvu/rclone-sync-test-include/, notFound
2025/03/26 05:12:25 DEBUG : rclone-sync-test-include/: Removing directory marker
    run.go:125: removing dir "rclone-sync-test-include" failed - try 3/3: removing directory marker failed: googleapi: Error 404: No such object: rclone-test-maqakig0luvu/rclone-sync-test-include/, notFound
    run.go:128: removing dir "rclone-sync-test-include" failed: removing directory marker failed: googleapi: Error 404: No such object: rclone-test-maqakig0luvu/rclone-sync-test-include/, notFound
2025/03/26 05:12:26 DEBUG : rclone-sync-test-ignore-file/: Removing directory marker
    run.go:125: removing dir "rclone-sync-test-ignore-file" failed - try 1/3: removing directory marker failed: googleapi: Error 404: No such object: rclone-test-maqakig0luvu/rclone-sync-test-ignore-file/, notFound
2025/03/26 05:12:27 DEBUG : rclone-sync-test-ignore-file/: Removing directory marker
    run.go:125: removing dir "rclone-sync-test-ignore-file" failed - try 2/3: removing directory marker failed: googleapi: Error 404: No such object: rclone-test-maqakig0luvu/rclone-sync-test-ignore-file/, notFound
2025/03/26 05:12:28 DEBUG : rclone-sync-test-ignore-file/: Removing directory marker
    run.go:125: removing dir "rclone-sync-test-ignore-file" failed - try 3/3: removing directory marker failed: googleapi: Error 404: No such object: rclone-test-maqakig0luvu/rclone-sync-test-ignore-file/, notFound
    run.go:128: removing dir "rclone-sync-test-ignore-file" failed: removing directory marker failed: googleapi: Error 404: No such object: rclone-test-maqakig0luvu/rclone-sync-test-ignore-file/, notFound
2025/03/26 05:12:29 DEBUG : rclone-sync-test/: Removing directory marker
    run.go:125: removing dir "rclone-sync-test" failed - try 1/3: removing directory marker failed: googleapi: Error 404: No such object: rclone-test-maqakig0luvu/rclone-sync-test/, notFound
2025/03/26 05:12:30 DEBUG : rclone-sync-test/: Removing directory marker
    run.go:125: removing dir "rclone-sync-test" failed - try 2/3: removing directory marker failed: googleapi: Error 404: No such object: rclone-test-maqakig0luvu/rclone-sync-test/, notFound
2025/03/26 05:12:31 DEBUG : rclone-sync-test/: Removing directory marker
    run.go:125: removing dir "rclone-sync-test" failed - try 3/3: removing directory marker failed: googleapi: Error 404: No such object: rclone-test-maqakig0luvu/rclone-sync-test/, notFound
    run.go:128: removing dir "rclone-sync-test" failed: removing directory marker failed: googleapi: Error 404: No such object: rclone-test-maqakig0luvu/rclone-sync-test/, notFound
    fstest.go:292: Sleeping for 1s for list eventual consistency: 1/3
    fstest.go:292: Sleeping for 2s for list eventual consistency: 2/3
    fstest.go:292: Sleeping for 4s for list eventual consistency: 3/3
    fstest.go:321: 
        	Error Trace:	/home/rclone/go/src/github.com/rclone/rclone/fstest/fstest.go:321
        	            				/home/rclone/go/src/github.com/rclone/rclone/fstest/fstest.go:332
        	            				/home/rclone/go/src/github.com/rclone/rclone/fstest/run.go:173
        	            				/home/rclone/go/src/github.com/rclone/rclone/fstest/run.go:388
        	            				/home/rclone/go/pkg/mod/golang.org/toolchain@v0.0.1-go1.23.0.linux-amd64/src/testing/testing.go:1176
        	            				/home/rclone/go/pkg/mod/golang.org/toolchain@v0.0.1-go1.23.0.linux-amd64/src/testing/testing.go:1354
        	            				/home/rclone/go/pkg/mod/golang.org/toolchain@v0.0.1-go1.23.0.linux-amd64/src/testing/testing.go:1684
        	Error:      	Not equal: 
        	            	expected: []string{}
        	            	actual  : []string{"rclone-sync-test", "rclone-sync-test-ignore-file", "rclone-sync-test-include", "rclone-sync-test-include/layer2"}
        	            	
        	            	Diff:
        	            	--- Expected
        	            	+++ Actual
        	            	@@ -1,2 +1,6 @@
        	            	-([]string) {
        	            	+([]string) (len=4) {
        	            	+ (string) (len=16) "rclone-sync-test",
        	            	+ (string) (len=28) "rclone-sync-test-ignore-file",
        	            	+ (string) (len=24) "rclone-sync-test-include",
        	            	+ (string) (len=31) "rclone-sync-test-include/layer2"
        	            	 }
        	Test:       	TestSyncOverlapWithFilter
        	Messages:   	directories
2025/03/26 05:12:39 DEBUG : rclone-sync-test-include/layer2/: Removing directory marker
    run.go:125: removing dir "rclone-sync-test-include/layer2" failed - try 1/3: removing directory marker failed: googleapi: Error 404: No such object: rclone-test-maqakig0luvu/rclone-sync-test-include/layer2/, notFound
2025/03/26 05:12:40 DEBUG : rclone-sync-test-include/layer2/: Removing directory marker
    run.go:125: removing dir "rclone-sync-test-include/layer2" failed - try 2/3: removing directory marker failed: googleapi: Error 404: No such object: rclone-test-maqakig0luvu/rclone-sync-test-include/layer2/, notFound
2025/03/26 05:12:42 DEBUG : rclone-sync-test-include/layer2/: Removing directory marker
    run.go:125: removing dir "rclone-sync-test-include/layer2" failed - try 3/3: removing directory marker failed: googleapi: Error 404: No such object: rclone-test-maqakig0luvu/rclone-sync-test-include/layer2/, notFound
    run.go:128: removing dir "rclone-sync-test-include/layer2" failed: removing directory marker failed: googleapi: Error 404: No such object: rclone-test-maqakig0luvu/rclone-sync-test-include/layer2/, notFound
2025/03/26 05:12:43 DEBUG : rclone-sync-test-include/: Removing directory marker
    run.go:125: removing dir "rclone-sync-test-include" failed - try 1/3: removing directory marker failed: googleapi: Error 404: No such object: rclone-test-maqakig0luvu/rclone-sync-test-include/, notFound
2025/03/26 05:12:44 DEBUG : rclone-sync-test-include/: Removing directory marker
    run.go:125: removing dir "rclone-sync-test-include" failed - try 2/3: removing directory marker failed: googleapi: Error 404: No such object: rclone-test-maqakig0luvu/rclone-sync-test-include/, notFound
2025/03/26 05:12:45 DEBUG : rclone-sync-test-include/: Removing directory marker
    run.go:125: removing dir "rclone-sync-test-include" failed - try 3/3: removing directory marker failed: googleapi: Error 404: No such object: rclone-test-maqakig0luvu/rclone-sync-test-include/, notFound
    run.go:128: removing dir "rclone-sync-test-include" failed: removing directory marker failed: googleapi: Error 404: No such object: rclone-test-maqakig0luvu/rclone-sync-test-include/, notFound
2025/03/26 05:12:46 DEBUG : rclone-sync-test-ignore-file/: Removing directory marker
    run.go:125: removing dir "rclone-sync-test-ignore-file" failed - try 1/3: removing directory marker failed: googleapi: Error 404: No such object: rclone-test-maqakig0luvu/rclone-sync-test-ignore-file/, notFound
2025/03/26 05:12:47 DEBUG : rclone-sync-test-ignore-file/: Removing directory marker
    run.go:125: removing dir "rclone-sync-test-ignore-file" failed - try 2/3: removing directory marker failed: googleapi: Error 404: No such object: rclone-test-maqakig0luvu/rclone-sync-test-ignore-file/, notFound
2025/03/26 05:12:48 DEBUG : rclone-sync-test-ignore-file/: Removing directory marker
    run.go:125: removing dir "rclone-sync-test-ignore-file" failed - try 3/3: removing directory marker failed: googleapi: Error 404: No such object: rclone-test-maqakig0luvu/rclone-sync-test-ignore-file/, notFound
    run.go:128: removing dir "rclone-sync-test-ignore-file" failed: removing directory marker failed: googleapi: Error 404: No such object: rclone-test-maqakig0luvu/rclone-sync-test-ignore-file/, notFound
2025/03/26 05:12:49 DEBUG : rclone-sync-test/: Removing directory marker
    run.go:125: removing dir "rclone-sync-test" failed - try 1/3: removing directory marker failed: googleapi: Error 404: No such object: rclone-test-maqakig0luvu/rclone-sync-test/, notFound
2025/03/26 05:12:50 DEBUG : rclone-sync-test/: Removing directory marker
    run.go:125: removing dir "rclone-sync-test" failed - try 2/3: removing directory marker failed: googleapi: Error 404: No such object: rclone-test-maqakig0luvu/rclone-sync-test/, notFound
2025/03/26 05:12:51 DEBUG : rclone-sync-test/: Removing directory marker
    run.go:125: removing dir "rclone-sync-test" failed - try 3/3: removing directory marker failed: googleapi: Error 404: No such object: rclone-test-maqakig0luvu/rclone-sync-test/, notFound
    run.go:128: removing dir "rclone-sync-test" failed: removing directory marker failed: googleapi: Error 404: No such object: rclone-test-maqakig0luvu/rclone-sync-test/, notFound
    fstest.go:292: Sleeping for 1s for list eventual consistency: 1/3
    fstest.go:292: Sleeping for 2s for list eventual consistency: 2/3
    fstest.go:292: Sleeping for 4s for list eventual consistency: 3/3
    fstest.go:321: 
        	Error Trace:	/home/rclone/go/src/github.com/rclone/rclone/fstest/fstest.go:321
        	            				/home/rclone/go/src/github.com/rclone/rclone/fstest/fstest.go:332
        	            				/home/rclone/go/src/github.com/rclone/rclone/fstest/run.go:173
        	            				/home/rclone/go/src/github.com/rclone/rclone/fstest/run.go:388
        	            				/home/rclone/go/pkg/mod/golang.org/toolchain@v0.0.1-go1.23.0.linux-amd64/src/testing/testing.go:1176
        	            				/home/rclone/go/pkg/mod/golang.org/toolchain@v0.0.1-go1.23.0.linux-amd64/src/testing/testing.go:1354
        	            				/home/rclone/go/pkg/mod/golang.org/toolchain@v0.0.1-go1.23.0.linux-amd64/src/testing/testing.go:1684
        	Error:      	Not equal: 
        	            	expected: []string{}
        	            	actual  : []string{"rclone-sync-test", "rclone-sync-test-ignore-file", "rclone-sync-test-include", "rclone-sync-test-include/layer2"}
        	            	
        	            	Diff:
        	            	--- Expected
        	            	+++ Actual
        	            	@@ -1,2 +1,6 @@
        	            	-([]string) {
        	            	+([]string) (len=4) {
        	            	+ (string) (len=16) "rclone-sync-test",
        	            	+ (string) (len=28) "rclone-sync-test-ignore-file",
        	            	+ (string) (len=24) "rclone-sync-test-include",
        	            	+ (string) (len=31) "rclone-sync-test-include/layer2"
        	            	 }
        	Test:       	TestSyncOverlapWithFilter
        	Messages:   	directories
2025/03/26 05:12:59 DEBUG : rclone-sync-test-include/layer2/: Removing directory marker
    run.go:125: removing dir "rclone-sync-test-include/layer2" failed - try 1/3: removing directory marker failed: googleapi: Error 404: No such object: rclone-test-maqakig0luvu/rclone-sync-test-include/layer2/, notFound
2025/03/26 05:13:00 DEBUG : rclone-sync-test-include/layer2/: Removing directory marker
    run.go:125: removing dir "rclone-sync-test-include/layer2" failed - try 2/3: removing directory marker failed: googleapi: Error 404: No such object: rclone-test-maqakig0luvu/rclone-sync-test-include/layer2/, notFound
2025/03/26 05:13:01 DEBUG : rclone-sync-test-include/layer2/: Removing directory marker
    run.go:125: removing dir "rclone-sync-test-include/layer2" failed - try 3/3: removing directory marker failed: googleapi: Error 404: No such object: rclone-test-maqakig0luvu/rclone-sync-test-include/layer2/, notFound
    run.go:128: removing dir "rclone-sync-test-include/layer2" failed: removing directory marker failed: googleapi: Error 404: No such object: rclone-test-maqakig0luvu/rclone-sync-test-include/layer2/, notFound
2025/03/26 05:13:02 DEBUG : rclone-sync-test-include/: Removing directory marker
    run.go:125: removing dir "rclone-sync-test-include" failed - try 1/3: removing directory marker failed: googleapi: Error 404: No such object: rclone-test-maqakig0luvu/rclone-sync-test-include/, notFound
2025/03/26 05:13:04 DEBUG : rclone-sync-test-include/: Removing directory marker
    run.go:125: removing dir "rclone-sync-test-include" failed - try 2/3: removing directory marker failed: googleapi: Error 404: No such object: rclone-test-maqakig0luvu/rclone-sync-test-include/, notFound
2025/03/26 05:13:05 DEBUG : rclone-sync-test-include/: Removing directory marker
    run.go:125: removing dir "rclone-sync-test-include" failed - try 3/3: removing directory marker failed: googleapi: Error 404: No such object: rclone-test-maqakig0luvu/rclone-sync-test-include/, notFound
    run.go:128: removing dir "rclone-sync-test-include" failed: removing directory marker failed: googleapi: Error 404: No such object: rclone-test-maqakig0luvu/rclone-sync-test-include/, notFound
2025/03/26 05:13:06 DEBUG : rclone-sync-test-ignore-file/: Removing directory marker
    run.go:125: removing dir "rclone-sync-test-ignore-file" failed - try 1/3: removing directory marker failed: googleapi: Error 404: No such object: rclone-test-maqakig0luvu/rclone-sync-test-ignore-file/, notFound
2025/03/26 05:13:07 DEBUG : rclone-sync-test-ignore-file/: Removing directory marker
    run.go:125: removing dir "rclone-sync-test-ignore-file" failed - try 2/3: removing directory marker failed: googleapi: Error 404: No such object: rclone-test-maqakig0luvu/rclone-sync-test-ignore-file/, notFound
2025/03/26 05:13:08 DEBUG : rclone-sync-test-ignore-file/: Removing directory marker
    run.go:125: removing dir "rclone-sync-test-ignore-file" failed - try 3/3: removing directory marker failed: googleapi: Error 404: No such object: rclone-test-maqakig0luvu/rclone-sync-test-ignore-file/, notFound
    run.go:128: removing dir "rclone-sync-test-ignore-file" failed: removing directory marker failed: googleapi: Error 404: No such object: rclone-test-maqakig0luvu/rclone-sync-test-ignore-file/, notFound
2025/03/26 05:13:09 DEBUG : rclone-sync-test/: Removing directory marker
    run.go:125: removing dir "rclone-sync-test" failed - try 1/3: removing directory marker failed: googleapi: Error 404: No such object: rclone-test-maqakig0luvu/rclone-sync-test/, notFound
2025/03/26 05:13:10 DEBUG : rclone-sync-test/: Removing directory marker
    run.go:125: removing dir "rclone-sync-test" failed - try 2/3: removing directory marker failed: googleapi: Error 404: No such object: rclone-test-maqakig0luvu/rclone-sync-test/, notFound
2025/03/26 05:13:11 DEBUG : rclone-sync-test/: Removing directory marker
    run.go:125: removing dir "rclone-sync-test" failed - try 3/3: removing directory marker failed: googleapi: Error 404: No such object: rclone-test-maqakig0luvu/rclone-sync-test/, notFound
    run.go:128: removing dir "rclone-sync-test" failed: removing directory marker failed: googleapi: Error 404: No such object: rclone-test-maqakig0luvu/rclone-sync-test/, notFound
    fstest.go:292: Sleeping for 1s for list eventual consistency: 1/3
    fstest.go:292: Sleeping for 2s for list eventual consistency: 2/3
    fstest.go:292: Sleeping for 4s for list eventual consistency: 3/3
    fstest.go:321: 
        	Error Trace:	/home/rclone/go/src/github.com/rclone/rclone/fstest/fstest.go:321
        	            				/home/rclone/go/src/github.com/rclone/rclone/fstest/fstest.go:332
        	            				/home/rclone/go/src/github.com/rclone/rclone/fstest/run.go:173
        	            				/home/rclone/go/src/github.com/rclone/rclone/fstest/run.go:388
        	            				/home/rclone/go/pkg/mod/golang.org/toolchain@v0.0.1-go1.23.0.linux-amd64/src/testing/testing.go:1176
        	            				/home/rclone/go/pkg/mod/golang.org/toolchain@v0.0.1-go1.23.0.linux-amd64/src/testing/testing.go:1354
        	            				/home/rclone/go/pkg/mod/golang.org/toolchain@v0.0.1-go1.23.0.linux-amd64/src/testing/testing.go:1684
        	Error:      	Not equal: 
        	            	expected: []string{}
        	            	actual  : []string{"rclone-sync-test", "rclone-sync-test-ignore-file", "rclone-sync-test-include", "rclone-sync-test-include/layer2"}
        	            	
        	            	Diff:
        	            	--- Expected
        	            	+++ Actual
        	            	@@ -1,2 +1,6 @@
        	            	-([]string) {
        	            	+([]string) (len=4) {
        	            	+ (string) (len=16) "rclone-sync-test",
        	            	+ (string) (len=28) "rclone-sync-test-ignore-file",
        	            	+ (string) (len=24) "rclone-sync-test-include",
        	            	+ (string) (len=31) "rclone-sync-test-include/layer2"
        	            	 }
        	Test:       	TestSyncOverlapWithFilter
        	Messages:   	directories
2025/03/26 05:13:19 DEBUG : rclone-sync-test-include/layer2/: Removing directory marker
    run.go:125: removing dir "rclone-sync-test-include/layer2" failed - try 1/3: removing directory marker failed: googleapi: Error 404: No such object: rclone-test-maqakig0luvu/rclone-sync-test-include/layer2/, notFound
2025/03/26 05:13:20 DEBUG : rclone-sync-test-include/layer2/: Removing directory marker
    run.go:125: removing dir "rclone-sync-test-include/layer2" failed - try 2/3: removing directory marker failed: googleapi: Error 404: No such object: rclone-test-maqakig0luvu/rclone-sync-test-include/layer2/, notFound
2025/03/26 05:13:21 DEBUG : rclone-sync-test-include/layer2/: Removing directory marker
    run.go:125: removing dir "rclone-sync-test-include/layer2" failed - try 3/3: removing directory marker failed: googleapi: Error 404: No such object: rclone-test-maqakig0luvu/rclone-sync-test-include/layer2/, notFound
    run.go:128: removing dir "rclone-sync-test-include/layer2" failed: removing directory marker failed: googleapi: Error 404: No such object: rclone-test-maqakig0luvu/rclone-sync-test-include/layer2/, notFound
2025/03/26 05:13:22 DEBUG : rclone-sync-test-include/: Removing directory marker
    run.go:125: removing dir "rclone-sync-test-include" failed - try 1/3: removing directory marker failed: googleapi: Error 404: No such object: rclone-test-maqakig0luvu/rclone-sync-test-include/, notFound
2025/03/26 05:13:23 DEBUG : rclone-sync-test-include/: Removing directory marker
    run.go:125: removing dir "rclone-sync-test-include" failed - try 2/3: removing directory marker failed: googleapi: Error 404: No such object: rclone-test-maqakig0luvu/rclone-sync-test-include/, notFound
2025/03/26 05:13:24 DEBUG : rclone-sync-test-include/: Removing directory marker
    run.go:125: removing dir "rclone-sync-test-include" failed - try 3/3: removing directory marker failed: googleapi: Error 404: No such object: rclone-test-maqakig0luvu/rclone-sync-test-include/, notFound
    run.go:128: removing dir "rclone-sync-test-include" failed: removing directory marker failed: googleapi: Error 404: No such object: rclone-test-maqakig0luvu/rclone-sync-test-include/, notFound
2025/03/26 05:13:25 DEBUG : rclone-sync-test-ignore-file/: Removing directory marker
    run.go:125: removing dir "rclone-sync-test-ignore-file" failed - try 1/3: removing directory marker failed: googleapi: Error 404: No such object: rclone-test-maqakig0luvu/rclone-sync-test-ignore-file/, notFound
2025/03/26 05:13:27 DEBUG : rclone-sync-test-ignore-file/: Removing directory marker
    run.go:125: removing dir "rclone-sync-test-ignore-file" failed - try 2/3: removing directory marker failed: googleapi: Error 404: No such object: rclone-test-maqakig0luvu/rclone-sync-test-ignore-file/, notFound
2025/03/26 05:13:28 DEBUG : rclone-sync-test-ignore-file/: Removing directory marker
    run.go:125: removing dir "rclone-sync-test-ignore-file" failed - try 3/3: removing directory marker failed: googleapi: Error 404: No such object: rclone-test-maqakig0luvu/rclone-sync-test-ignore-file/, notFound
    run.go:128: removing dir "rclone-sync-test-ignore-file" failed: removing directory marker failed: googleapi: Error 404: No such object: rclone-test-maqakig0luvu/rclone-sync-test-ignore-file/, notFound
2025/03/26 05:13:29 DEBUG : rclone-sync-test/: Removing directory marker
    run.go:125: removing dir "rclone-sync-test" failed - try 1/3: removing directory marker failed: googleapi: Error 404: No such object: rclone-test-maqakig0luvu/rclone-sync-test/, notFound
2025/03/26 05:13:30 DEBUG : rclone-sync-test/: Removing directory marker
    run.go:125: removing dir "rclone-sync-test" failed - try 2/3: removing directory marker failed: googleapi: Error 404: No such object: rclone-test-maqakig0luvu/rclone-sync-test/, notFound
2025/03/26 05:13:31 DEBUG : rclone-sync-test/: Removing directory marker
    run.go:125: removing dir "rclone-sync-test" failed - try 3/3: removing directory marker failed: googleapi: Error 404: No such object: rclone-test-maqakig0luvu/rclone-sync-test/, notFound
    run.go:128: removing dir "rclone-sync-test" failed: removing directory marker failed: googleapi: Error 404: No such object: rclone-test-maqakig0luvu/rclone-sync-test/, notFound
    fstest.go:292: Sleeping for 1s for list eventual consistency: 1/3
    fstest.go:292: Sleeping for 2s for list eventual consistency: 2/3
    fstest.go:292: Sleeping for 4s for list eventual consistency: 3/3
    fstest.go:321: 
        	Error Trace:	/home/rclone/go/src/github.com/rclone/rclone/fstest/fstest.go:321
        	            				/home/rclone/go/src/github.com/rclone/rclone/fstest/fstest.go:332
        	            				/home/rclone/go/src/github.com/rclone/rclone/fstest/run.go:173
        	            				/home/rclone/go/src/github.com/rclone/rclone/fstest/run.go:388
        	            				/home/rclone/go/pkg/mod/golang.org/toolchain@v0.0.1-go1.23.0.linux-amd64/src/testing/testing.go:1176
        	            				/home/rclone/go/pkg/mod/golang.org/toolchain@v0.0.1-go1.23.0.linux-amd64/src/testing/testing.go:1354
        	            				/home/rclone/go/pkg/mod/golang.org/toolchain@v0.0.1-go1.23.0.linux-amd64/src/testing/testing.go:1684
        	Error:      	Not equal: 
        	            	expected: []string{}
        	            	actual  : []string{"rclone-sync-test", "rclone-sync-test-ignore-file", "rclone-sync-test-include", "rclone-sync-test-include/layer2"}
        	            	
        	            	Diff:
        	            	--- Expected
        	            	+++ Actual
        	            	@@ -1,2 +1,6 @@
        	            	-([]string) {
        	            	+([]string) (len=4) {
        	            	+ (string) (len=16) "rclone-sync-test",
        	            	+ (string) (len=28) "rclone-sync-test-ignore-file",
        	            	+ (string) (len=24) "rclone-sync-test-include",
        	            	+ (string) (len=31) "rclone-sync-test-include/layer2"
        	            	 }
        	Test:       	TestSyncOverlapWithFilter
        	Messages:   	directories
2025/03/26 05:13:39 DEBUG : rclone-sync-test-include/layer2/: Removing directory marker
    run.go:125: removing dir "rclone-sync-test-include/layer2" failed - try 1/3: removing directory marker failed: googleapi: Error 404: No such object: rclone-test-maqakig0luvu/rclone-sync-test-include/layer2/, notFound
2025/03/26 05:13:40 DEBUG : rclone-sync-test-include/layer2/: Removing directory marker
    run.go:125: removing dir "rclone-sync-test-include/layer2" failed - try 2/3: removing directory marker failed: googleapi: Error 404: No such object: rclone-test-maqakig0luvu/rclone-sync-test-include/layer2/, notFound
2025/03/26 05:13:41 DEBUG : rclone-sync-test-include/layer2/: Removing directory marker
    run.go:125: removing dir "rclone-sync-test-include/layer2" failed - try 3/3: removing directory marker failed: googleapi: Error 404: No such object: rclone-test-maqakig0luvu/rclone-sync-test-include/layer2/, notFound
    run.go:128: removing dir "rclone-sync-test-include/layer2" failed: removing directory marker failed: googleapi: Error 404: No such object: rclone-test-maqakig0luvu/rclone-sync-test-include/layer2/, notFound
2025/03/26 05:13:42 DEBUG : rclone-sync-test-include/: Removing directory marker
    run.go:125: removing dir "rclone-sync-test-include" failed - try 1/3: removing directory marker failed: googleapi: Error 404: No such object: rclone-test-maqakig0luvu/rclone-sync-test-include/, notFound
2025/03/26 05:13:43 DEBUG : rclone-sync-test-include/: Removing directory marker
    run.go:125: removing dir "rclone-sync-test-include" failed - try 2/3: removing directory marker failed: googleapi: Error 404: No such object: rclone-test-maqakig0luvu/rclone-sync-test-include/, notFound
2025/03/26 05:13:44 DEBUG : rclone-sync-test-include/: Removing directory marker
    run.go:125: removing dir "rclone-sync-test-include" failed - try 3/3: removing directory marker failed: googleapi: Error 404: No such object: rclone-test-maqakig0luvu/rclone-sync-test-include/, notFound
    run.go:128: removing dir "rclone-sync-test-include" failed: removing directory marker failed: googleapi: Error 404: No such object: rclone-test-maqakig0luvu/rclone-sync-test-include/, notFound
2025/03/26 05:13:45 DEBUG : rclone-sync-test-ignore-file/: Removing directory marker
    run.go:125: removing dir "rclone-sync-test-ignore-file" failed - try 1/3: removing directory marker failed: googleapi: Error 404: No such object: rclone-test-maqakig0luvu/rclone-sync-test-ignore-file/, notFound
2025/03/26 05:13:46 DEBUG : rclone-sync-test-ignore-file/: Removing directory marker
    run.go:125: removing dir "rclone-sync-test-ignore-file" failed - try 2/3: removing directory marker failed: googleapi: Error 404: No such object: rclone-test-maqakig0luvu/rclone-sync-test-ignore-file/, notFound
2025/03/26 05:13:47 DEBUG : rclone-sync-test-ignore-file/: Removing directory marker
    run.go:125: removing dir "rclone-sync-test-ignore-file" failed - try 3/3: removing directory marker failed: googleapi: Error 404: No such object: rclone-test-maqakig0luvu/rclone-sync-test-ignore-file/, notFound
    run.go:128: removing dir "rclone-sync-test-ignore-file" failed: removing directory marker failed: googleapi: Error 404: No such object: rclone-test-maqakig0luvu/rclone-sync-test-ignore-file/, notFound
2025/03/26 05:13:49 DEBUG : rclone-sync-test/: Removing directory marker
    run.go:125: removing dir "rclone-sync-test" failed - try 1/3: removing directory marker failed: googleapi: Error 404: No such object: rclone-test-maqakig0luvu/rclone-sync-test/, notFound
2025/03/26 05:13:50 DEBUG : rclone-sync-test/: Removing directory marker
    run.go:125: removing dir "rclone-sync-test" failed - try 2/3: removing directory marker failed: googleapi: Error 404: No such object: rclone-test-maqakig0luvu/rclone-sync-test/, notFound
2025/03/26 05:13:51 DEBUG : rclone-sync-test/: Removing directory marker
    run.go:125: removing dir "rclone-sync-test" failed - try 3/3: removing directory marker failed: googleapi: Error 404: No such object: rclone-test-maqakig0luvu/rclone-sync-test/, notFound
    run.go:128: removing dir "rclone-sync-test" failed: removing directory marker failed: googleapi: Error 404: No such object: rclone-test-maqakig0luvu/rclone-sync-test/, notFound
    fstest.go:292: Sleeping for 1s for list eventual consistency: 1/3
    fstest.go:292: Sleeping for 2s for list eventual consistency: 2/3
    fstest.go:292: Sleeping for 4s for list eventual consistency: 3/3
    fstest.go:321: 
        	Error Trace:	/home/rclone/go/src/github.com/rclone/rclone/fstest/fstest.go:321
        	            				/home/rclone/go/src/github.com/rclone/rclone/fstest/fstest.go:332
        	            				/home/rclone/go/src/github.com/rclone/rclone/fstest/run.go:173
        	            				/home/rclone/go/src/github.com/rclone/rclone/fstest/run.go:388
        	            				/home/rclone/go/pkg/mod/golang.org/toolchain@v0.0.1-go1.23.0.linux-amd64/src/testing/testing.go:1176
        	            				/home/rclone/go/pkg/mod/golang.org/toolchain@v0.0.1-go1.23.0.linux-amd64/src/testing/testing.go:1354
        	            				/home/rclone/go/pkg/mod/golang.org/toolchain@v0.0.1-go1.23.0.linux-amd64/src/testing/testing.go:1684
        	Error:      	Not equal: 
        	            	expected: []string{}
        	            	actual  : []string{"rclone-sync-test", "rclone-sync-test-ignore-file", "rclone-sync-test-include", "rclone-sync-test-include/layer2"}
        	            	
        	            	Diff:
        	            	--- Expected
        	            	+++ Actual
        	            	@@ -1,2 +1,6 @@
        	            	-([]string) {
        	            	+([]string) (len=4) {
        	            	+ (string) (len=16) "rclone-sync-test",
        	            	+ (string) (len=28) "rclone-sync-test-ignore-file",
        	            	+ (string) (len=24) "rclone-sync-test-include",
        	            	+ (string) (len=31) "rclone-sync-test-include/layer2"
        	            	 }
        	Test:       	TestSyncOverlapWithFilter
        	Messages:   	directories
2025/03/26 05:13:59 DEBUG : rclone-sync-test-include/layer2/: Removing directory marker
    run.go:125: removing dir "rclone-sync-test-include/layer2" failed - try 1/3: removing directory marker failed: googleapi: Error 404: No such object: rclone-test-maqakig0luvu/rclone-sync-test-include/layer2/, notFound
2025/03/26 05:14:00 DEBUG : rclone-sync-test-include/layer2/: Removing directory marker
    run.go:125: removing dir "rclone-sync-test-include/layer2" failed - try 2/3: removing directory marker failed: googleapi: Error 404: No such object: rclone-test-maqakig0luvu/rclone-sync-test-include/layer2/, notFound
2025/03/26 05:14:01 DEBUG : rclone-sync-test-include/layer2/: Removing directory marker
    run.go:125: removing dir "rclone-sync-test-include/layer2" failed - try 3/3: removing directory marker failed: googleapi: Error 404: No such object: rclone-test-maqakig0luvu/rclone-sync-test-include/layer2/, notFound
    run.go:128: removing dir "rclone-sync-test-include/layer2" failed: removing directory marker failed: googleapi: Error 404: No such object: rclone-test-maqakig0luvu/rclone-sync-test-include/layer2/, notFound
2025/03/26 05:14:02 DEBUG : rclone-sync-test-include/: Removing directory marker
    run.go:125: removing dir "rclone-sync-test-include" failed - try 1/3: removing directory marker failed: googleapi: Error 404: No such object: rclone-test-maqakig0luvu/rclone-sync-test-include/, notFound
2025/03/26 05:14:03 DEBUG : rclone-sync-test-include/: Removing directory marker
    run.go:125: removing dir "rclone-sync-test-include" failed - try 2/3: removing directory marker failed: googleapi: Error 404: No such object: rclone-test-maqakig0luvu/rclone-sync-test-include/, notFound
2025/03/26 05:14:04 DEBUG : rclone-sync-test-include/: Removing directory marker
    run.go:125: removing dir "rclone-sync-test-include" failed - try 3/3: removing directory marker failed: googleapi: Error 404: No such object: rclone-test-maqakig0luvu/rclone-sync-test-include/, notFound
    run.go:128: removing dir "rclone-sync-test-include" failed: removing directory marker failed: googleapi: Error 404: No such object: rclone-test-maqakig0luvu/rclone-sync-test-include/, notFound
2025/03/26 05:14:05 DEBUG : rclone-sync-test-ignore-file/: Removing directory marker
    run.go:125: removing dir "rclone-sync-test-ignore-file" failed - try 1/3: removing directory marker failed: googleapi: Error 404: No such object: rclone-test-maqakig0luvu/rclone-sync-test-ignore-file/, notFound
2025/03/26 05:14:06 DEBUG : rclone-sync-test-ignore-file/: Removing directory marker
    run.go:125: removing dir "rclone-sync-test-ignore-file" failed - try 2/3: removing directory marker failed: googleapi: Error 404: No such object: rclone-test-maqakig0luvu/rclone-sync-test-ignore-file/, notFound
2025/03/26 05:14:07 DEBUG : rclone-sync-test-ignore-file/: Removing directory marker
    run.go:125: removing dir "rclone-sync-test-ignore-file" failed - try 3/3: removing directory marker failed: googleapi: Error 404: No such object: rclone-test-maqakig0luvu/rclone-sync-test-ignore-file/, notFound
    run.go:128: removing dir "rclone-sync-test-ignore-file" failed: removing directory marker failed: googleapi: Error 404: No such object: rclone-test-maqakig0luvu/rclone-sync-test-ignore-file/, notFound
2025/03/26 05:14:08 DEBUG : rclone-sync-test/: Removing directory marker
    run.go:125: removing dir "rclone-sync-test" failed - try 1/3: removing directory marker failed: googleapi: Error 404: No such object: rclone-test-maqakig0luvu/rclone-sync-test/, notFound
2025/03/26 05:14:09 DEBUG : rclone-sync-test/: Removing directory marker
    run.go:125: removing dir "rclone-sync-test" failed - try 2/3: removing directory marker failed: googleapi: Error 404: No such object: rclone-test-maqakig0luvu/rclone-sync-test/, notFound
2025/03/26 05:14:10 DEBUG : rclone-sync-test/: Removing directory marker
    run.go:125: removing dir "rclone-sync-test" failed - try 3/3: removing directory marker failed: googleapi: Error 404: No such object: rclone-test-maqakig0luvu/rclone-sync-test/, notFound
    run.go:128: removing dir "rclone-sync-test" failed: removing directory marker failed: googleapi: Error 404: No such object: rclone-test-maqakig0luvu/rclone-sync-test/, notFound
    fstest.go:292: Sleeping for 1s for list eventual consistency: 1/3
    fstest.go:292: Sleeping for 2s for list eventual consistency: 2/3
    fstest.go:292: Sleeping for 4s for list eventual consistency: 3/3
    fstest.go:321: 
        	Error Trace:	/home/rclone/go/src/github.com/rclone/rclone/fstest/fstest.go:321
        	            				/home/rclone/go/src/github.com/rclone/rclone/fstest/fstest.go:332
        	            				/home/rclone/go/src/github.com/rclone/rclone/fstest/run.go:173
        	            				/home/rclone/go/src/github.com/rclone/rclone/fstest/run.go:388
        	            				/home/rclone/go/pkg/mod/golang.org/toolchain@v0.0.1-go1.23.0.linux-amd64/src/testing/testing.go:1176
        	            				/home/rclone/go/pkg/mod/golang.org/toolchain@v0.0.1-go1.23.0.linux-amd64/src/testing/testing.go:1354
        	            				/home/rclone/go/pkg/mod/golang.org/toolchain@v0.0.1-go1.23.0.linux-amd64/src/testing/testing.go:1684
        	Error:      	Not equal: 
        	            	expected: []string{}
        	            	actual  : []string{"rclone-sync-test", "rclone-sync-test-ignore-file", "rclone-sync-test-include", "rclone-sync-test-include/layer2"}
        	            	
        	            	Diff:
        	            	--- Expected
        	            	+++ Actual
        	            	@@ -1,2 +1,6 @@
        	            	-([]string) {
        	            	+([]string) (len=4) {
        	            	+ (string) (len=16) "rclone-sync-test",
        	            	+ (string) (len=28) "rclone-sync-test-ignore-file",
        	            	+ (string) (len=24) "rclone-sync-test-include",
        	            	+ (string) (len=31) "rclone-sync-test-include/layer2"
        	            	 }
        	Test:       	TestSyncOverlapWithFilter
        	Messages:   	directories
2025/03/26 05:14:19 DEBUG : rclone-sync-test-include/layer2/: Removing directory marker
    run.go:125: removing dir "rclone-sync-test-include/layer2" failed - try 1/3: removing directory marker failed: googleapi: Error 404: No such object: rclone-test-maqakig0luvu/rclone-sync-test-include/layer2/, notFound
2025/03/26 05:14:20 DEBUG : rclone-sync-test-include/layer2/: Removing directory marker
    run.go:125: removing dir "rclone-sync-test-include/layer2" failed - try 2/3: removing directory marker failed: googleapi: Error 404: No such object: rclone-test-maqakig0luvu/rclone-sync-test-include/layer2/, notFound
2025/03/26 05:14:21 DEBUG : rclone-sync-test-include/layer2/: Removing directory marker
    run.go:125: removing dir "rclone-sync-test-include/layer2" failed - try 3/3: removing directory marker failed: googleapi: Error 404: No such object: rclone-test-maqakig0luvu/rclone-sync-test-include/layer2/, notFound
    run.go:128: removing dir "rclone-sync-test-include/layer2" failed: removing directory marker failed: googleapi: Error 404: No such object: rclone-test-maqakig0luvu/rclone-sync-test-include/layer2/, notFound
2025/03/26 05:14:22 DEBUG : rclone-sync-test-include/: Removing directory marker
    run.go:125: removing dir "rclone-sync-test-include" failed - try 1/3: removing directory marker failed: googleapi: Error 404: No such object: rclone-test-maqakig0luvu/rclone-sync-test-include/, notFound
2025/03/26 05:14:23 DEBUG : rclone-sync-test-include/: Removing directory marker
    run.go:125: removing dir "rclone-sync-test-include" failed - try 2/3: removing directory marker failed: googleapi: Error 404: No such object: rclone-test-maqakig0luvu/rclone-sync-test-include/, notFound
2025/03/26 05:14:24 DEBUG : rclone-sync-test-include/: Removing directory marker
    run.go:125: removing dir "rclone-sync-test-include" failed - try 3/3: removing directory marker failed: googleapi: Error 404: No such object: rclone-test-maqakig0luvu/rclone-sync-test-include/, notFound
    run.go:128: removing dir "rclone-sync-test-include" failed: removing directory marker failed: googleapi: Error 404: No such object: rclone-test-maqakig0luvu/rclone-sync-test-include/, notFound
2025/03/26 05:14:25 DEBUG : rclone-sync-test-ignore-file/: Removing directory marker
    run.go:125: removing dir "rclone-sync-test-ignore-file" failed - try 1/3: removing directory marker failed: googleapi: Error 404: No such object: rclone-test-maqakig0luvu/rclone-sync-test-ignore-file/, notFound
2025/03/26 05:14:26 DEBUG : rclone-sync-test-ignore-file/: Removing directory marker
    run.go:125: removing dir "rclone-sync-test-ignore-file" failed - try 2/3: removing directory marker failed: googleapi: Error 404: No such object: rclone-test-maqakig0luvu/rclone-sync-test-ignore-file/, notFound
2025/03/26 05:14:27 DEBUG : rclone-sync-test-ignore-file/: Removing directory marker
    run.go:125: removing dir "rclone-sync-test-ignore-file" failed - try 3/3: removing directory marker failed: googleapi: Error 404: No such object: rclone-test-maqakig0luvu/rclone-sync-test-ignore-file/, notFound
    run.go:128: removing dir "rclone-sync-test-ignore-file" failed: removing directory marker failed: googleapi: Error 404: No such object: rclone-test-maqakig0luvu/rclone-sync-test-ignore-file/, notFound
2025/03/26 05:14:28 DEBUG : rclone-sync-test/: Removing directory marker
    run.go:125: removing dir "rclone-sync-test" failed - try 1/3: removing directory marker failed: googleapi: Error 404: No such object: rclone-test-maqakig0luvu/rclone-sync-test/, notFound
2025/03/26 05:14:29 DEBUG : rclone-sync-test/: Removing directory marker
    run.go:125: removing dir "rclone-sync-test" failed - try 2/3: removing directory marker failed: googleapi: Error 404: No such object: rclone-test-maqakig0luvu/rclone-sync-test/, notFound
2025/03/26 05:14:30 DEBUG : rclone-sync-test/: Removing directory marker
    run.go:125: removing dir "rclone-sync-test" failed - try 3/3: removing directory marker failed: googleapi: Error 404: No such object: rclone-test-maqakig0luvu/rclone-sync-test/, notFound
    run.go:128: removing dir "rclone-sync-test" failed: removing directory marker failed: googleapi: Error 404: No such object: rclone-test-maqakig0luvu/rclone-sync-test/, notFound
    fstest.go:292: Sleeping for 1s for list eventual consistency: 1/3
    fstest.go:292: Sleeping for 2s for list eventual consistency: 2/3
    fstest.go:292: Sleeping for 4s for list eventual consistency: 3/3
    fstest.go:321: 
        	Error Trace:	/home/rclone/go/src/github.com/rclone/rclone/fstest/fstest.go:321
        	            				/home/rclone/go/src/github.com/rclone/rclone/fstest/fstest.go:332
        	            				/home/rclone/go/src/github.com/rclone/rclone/fstest/run.go:173
        	            				/home/rclone/go/src/github.com/rclone/rclone/fstest/run.go:388
        	            				/home/rclone/go/pkg/mod/golang.org/toolchain@v0.0.1-go1.23.0.linux-amd64/src/testing/testing.go:1176
        	            				/home/rclone/go/pkg/mod/golang.org/toolchain@v0.0.1-go1.23.0.linux-amd64/src/testing/testing.go:1354
        	            				/home/rclone/go/pkg/mod/golang.org/toolchain@v0.0.1-go1.23.0.linux-amd64/src/testing/testing.go:1684
        	Error:      	Not equal: 
        	            	expected: []string{}
        	            	actual  : []string{"rclone-sync-test", "rclone-sync-test-ignore-file", "rclone-sync-test-include", "rclone-sync-test-include/layer2"}
        	            	
        	            	Diff:
        	            	--- Expected
        	            	+++ Actual
        	            	@@ -1,2 +1,6 @@
        	            	-([]string) {
        	            	+([]string) (len=4) {
        	            	+ (string) (len=16) "rclone-sync-test",
        	            	+ (string) (len=28) "rclone-sync-test-ignore-file",
        	            	+ (string) (len=24) "rclone-sync-test-include",
        	            	+ (string) (len=31) "rclone-sync-test-include/layer2"
        	            	 }
        	Test:       	TestSyncOverlapWithFilter
        	Messages:   	directories
2025/03/26 05:14:39 DEBUG : rclone-sync-test-include/layer2/: Removing directory marker
    run.go:125: removing dir "rclone-sync-test-include/layer2" failed - try 1/3: removing directory marker failed: googleapi: Error 404: No such object: rclone-test-maqakig0luvu/rclone-sync-test-include/layer2/, notFound
2025/03/26 05:14:40 DEBUG : rclone-sync-test-include/layer2/: Removing directory marker
    run.go:125: removing dir "rclone-sync-test-include/layer2" failed - try 2/3: removing directory marker failed: googleapi: Error 404: No such object: rclone-test-maqakig0luvu/rclone-sync-test-include/layer2/, notFound
2025/03/26 05:14:41 DEBUG : rclone-sync-test-include/layer2/: Removing directory marker
    run.go:125: removing dir "rclone-sync-test-include/layer2" failed - try 3/3: removing directory marker failed: googleapi: Error 404: No such object: rclone-test-maqakig0luvu/rclone-sync-test-include/layer2/, notFound
    run.go:128: removing dir "rclone-sync-test-include/layer2" failed: removing directory marker failed: googleapi: Error 404: No such object: rclone-test-maqakig0luvu/rclone-sync-test-include/layer2/, notFound
2025/03/26 05:14:42 DEBUG : rclone-sync-test-include/: Removing directory marker
    run.go:125: removing dir "rclone-sync-test-include" failed - try 1/3: removing directory marker failed: googleapi: Error 404: No such object: rclone-test-maqakig0luvu/rclone-sync-test-include/, notFound
2025/03/26 05:14:43 DEBUG : rclone-sync-test-include/: Removing directory marker
    run.go:125: removing dir "rclone-sync-test-include" failed - try 2/3: removing directory marker failed: googleapi: Error 404: No such object: rclone-test-maqakig0luvu/rclone-sync-test-include/, notFound
2025/03/26 05:14:44 DEBUG : rclone-sync-test-include/: Removing directory marker
    run.go:125: removing dir "rclone-sync-test-include" failed - try 3/3: removing directory marker failed: googleapi: Error 404: No such object: rclone-test-maqakig0luvu/rclone-sync-test-include/, notFound
    run.go:128: removing dir "rclone-sync-test-include" failed: removing directory marker failed: googleapi: Error 404: No such object: rclone-test-maqakig0luvu/rclone-sync-test-include/, notFound
2025/03/26 05:14:45 DEBUG : rclone-sync-test-ignore-file/: Removing directory marker
    run.go:125: removing dir "rclone-sync-test-ignore-file" failed - try 1/3: removing directory marker failed: googleapi: Error 404: No such object: rclone-test-maqakig0luvu/rclone-sync-test-ignore-file/, notFound
2025/03/26 05:14:46 DEBUG : rclone-sync-test-ignore-file/: Removing directory marker
    run.go:125: removing dir "rclone-sync-test-ignore-file" failed - try 2/3: removing directory marker failed: googleapi: Error 404: No such object: rclone-test-maqakig0luvu/rclone-sync-test-ignore-file/, notFound
2025/03/26 05:14:47 DEBUG : rclone-sync-test-ignore-file/: Removing directory marker
    run.go:125: removing dir "rclone-sync-test-ignore-file" failed - try 3/3: removing directory marker failed: googleapi: Error 404: No such object: rclone-test-maqakig0luvu/rclone-sync-test-ignore-file/, notFound
    run.go:128: removing dir "rclone-sync-test-ignore-file" failed: removing directory marker failed: googleapi: Error 404: No such object: rclone-test-maqakig0luvu/rclone-sync-test-ignore-file/, notFound
2025/03/26 05:14:48 DEBUG : rclone-sync-test/: Removing directory marker
    run.go:125: removing dir "rclone-sync-test" failed - try 1/3: removing directory marker failed: googleapi: Error 404: No such object: rclone-test-maqakig0luvu/rclone-sync-test/, notFound
2025/03/26 05:14:49 DEBUG : rclone-sync-test/: Removing directory marker
    run.go:125: removing dir "rclone-sync-test" failed - try 2/3: removing directory marker failed: googleapi: Error 404: No such object: rclone-test-maqakig0luvu/rclone-sync-test/, notFound
2025/03/26 05:14:50 DEBUG : rclone-sync-test/: Removing directory marker
    run.go:125: removing dir "rclone-sync-test" failed - try 3/3: removing directory marker failed: googleapi: Error 404: No such object: rclone-test-maqakig0luvu/rclone-sync-test/, notFound
    run.go:128: removing dir "rclone-sync-test" failed: removing directory marker failed: googleapi: Error 404: No such object: rclone-test-maqakig0luvu/rclone-sync-test/, notFound
    fstest.go:292: Sleeping for 1s for list eventual consistency: 1/3
    fstest.go:292: Sleeping for 2s for list eventual consistency: 2/3
    fstest.go:292: Sleeping for 4s for list eventual consistency: 3/3
    fstest.go:321: 
        	Error Trace:	/home/rclone/go/src/github.com/rclone/rclone/fstest/fstest.go:321
        	            				/home/rclone/go/src/github.com/rclone/rclone/fstest/fstest.go:332
        	            				/home/rclone/go/src/github.com/rclone/rclone/fstest/run.go:173
        	            				/home/rclone/go/src/github.com/rclone/rclone/fstest/run.go:388
        	            				/home/rclone/go/pkg/mod/golang.org/toolchain@v0.0.1-go1.23.0.linux-amd64/src/testing/testing.go:1176
        	            				/home/rclone/go/pkg/mod/golang.org/toolchain@v0.0.1-go1.23.0.linux-amd64/src/testing/testing.go:1354
        	            				/home/rclone/go/pkg/mod/golang.org/toolchain@v0.0.1-go1.23.0.linux-amd64/src/testing/testing.go:1684
        	Error:      	Not equal: 
        	            	expected: []string{}
        	            	actual  : []string{"rclone-sync-test", "rclone-sync-test-ignore-file", "rclone-sync-test-include", "rclone-sync-test-include/layer2"}
        	            	
        	            	Diff:
        	            	--- Expected
        	            	+++ Actual
        	            	@@ -1,2 +1,6 @@
        	            	-([]string) {
        	            	+([]string) (len=4) {
        	            	+ (string) (len=16) "rclone-sync-test",
        	            	+ (string) (len=28) "rclone-sync-test-ignore-file",
        	            	+ (string) (len=24) "rclone-sync-test-include",
        	            	+ (string) (len=31) "rclone-sync-test-include/layer2"
        	            	 }
        	Test:       	TestSyncOverlapWithFilter
        	Messages:   	directories
2025/03/26 05:14:59 DEBUG : rclone-sync-test-include/layer2/: Removing directory marker
    run.go:125: removing dir "rclone-sync-test-include/layer2" failed - try 1/3: removing directory marker failed: googleapi: Error 404: No such object: rclone-test-maqakig0luvu/rclone-sync-test-include/layer2/, notFound
2025/03/26 05:15:00 DEBUG : rclone-sync-test-include/layer2/: Removing directory marker
    run.go:125: removing dir "rclone-sync-test-include/layer2" failed - try 2/3: removing directory marker failed: googleapi: Error 404: No such object: rclone-test-maqakig0luvu/rclone-sync-test-include/layer2/, notFound
2025/03/26 05:15:01 DEBUG : rclone-sync-test-include/layer2/: Removing directory marker
    run.go:125: removing dir "rclone-sync-test-include/layer2" failed - try 3/3: removing directory marker failed: googleapi: Error 404: No such object: rclone-test-maqakig0luvu/rclone-sync-test-include/layer2/, notFound
    run.go:128: removing dir "rclone-sync-test-include/layer2" failed: removing directory marker failed: googleapi: Error 404: No such object: rclone-test-maqakig0luvu/rclone-sync-test-include/layer2/, notFound
2025/03/26 05:15:02 DEBUG : rclone-sync-test-include/: Removing directory marker
    run.go:125: removing dir "rclone-sync-test-include" failed - try 1/3: removing directory marker failed: googleapi: Error 404: No such object: rclone-test-maqakig0luvu/rclone-sync-test-include/, notFound
2025/03/26 05:15:03 DEBUG : rclone-sync-test-include/: Removing directory marker
    run.go:125: removing dir "rclone-sync-test-include" failed - try 2/3: removing directory marker failed: googleapi: Error 404: No such object: rclone-test-maqakig0luvu/rclone-sync-test-include/, notFound
2025/03/26 05:15:04 DEBUG : rclone-sync-test-include/: Removing directory marker
    run.go:125: removing dir "rclone-sync-test-include" failed - try 3/3: removing directory marker failed: googleapi: Error 404: No such object: rclone-test-maqakig0luvu/rclone-sync-test-include/, notFound
    run.go:128: removing dir "rclone-sync-test-include" failed: removing directory marker failed: googleapi: Error 404: No such object: rclone-test-maqakig0luvu/rclone-sync-test-include/, notFound
2025/03/26 05:15:05 DEBUG : rclone-sync-test-ignore-file/: Removing directory marker
    run.go:125: removing dir "rclone-sync-test-ignore-file" failed - try 1/3: removing directory marker failed: googleapi: Error 404: No such object: rclone-test-maqakig0luvu/rclone-sync-test-ignore-file/, notFound
2025/03/26 05:15:06 DEBUG : rclone-sync-test-ignore-file/: Removing directory marker
    run.go:125: removing dir "rclone-sync-test-ignore-file" failed - try 2/3: removing directory marker failed: googleapi: Error 404: No such object: rclone-test-maqakig0luvu/rclone-sync-test-ignore-file/, notFound
2025/03/26 05:15:07 DEBUG : rclone-sync-test-ignore-file/: Removing directory marker
    run.go:125: removing dir "rclone-sync-test-ignore-file" failed - try 3/3: removing directory marker failed: googleapi: Error 404: No such object: rclone-test-maqakig0luvu/rclone-sync-test-ignore-file/, notFound
    run.go:128: removing dir "rclone-sync-test-ignore-file" failed: removing directory marker failed: googleapi: Error 404: No such object: rclone-test-maqakig0luvu/rclone-sync-test-ignore-file/, notFound
2025/03/26 05:15:08 DEBUG : rclone-sync-test/: Removing directory marker
    run.go:125: removing dir "rclone-sync-test" failed - try 1/3: removing directory marker failed: googleapi: Error 404: No such object: rclone-test-maqakig0luvu/rclone-sync-test/, notFound
2025/03/26 05:15:09 DEBUG : rclone-sync-test/: Removing directory marker
    run.go:125: removing dir "rclone-sync-test" failed - try 2/3: removing directory marker failed: googleapi: Error 404: No such object: rclone-test-maqakig0luvu/rclone-sync-test/, notFound
2025/03/26 05:15:10 DEBUG : rclone-sync-test/: Removing directory marker
    run.go:125: removing dir "rclone-sync-test" failed - try 3/3: removing directory marker failed: googleapi: Error 404: No such object: rclone-test-maqakig0luvu/rclone-sync-test/, notFound
    run.go:128: removing dir "rclone-sync-test" failed: removing directory marker failed: googleapi: Error 404: No such object: rclone-test-maqakig0luvu/rclone-sync-test/, notFound
    fstest.go:292: Sleeping for 1s for list eventual consistency: 1/3
    fstest.go:292: Sleeping for 2s for list eventual consistency: 2/3
    fstest.go:292: Sleeping for 4s for list eventual consistency: 3/3
    fstest.go:321: 
        	Error Trace:	/home/rclone/go/src/github.com/rclone/rclone/fstest/fstest.go:321
        	            				/home/rclone/go/src/github.com/rclone/rclone/fstest/fstest.go:332
        	            				/home/rclone/go/src/github.com/rclone/rclone/fstest/run.go:173
        	            				/home/rclone/go/src/github.com/rclone/rclone/fstest/run.go:388
        	            				/home/rclone/go/pkg/mod/golang.org/toolchain@v0.0.1-go1.23.0.linux-amd64/src/testing/testing.go:1176
        	            				/home/rclone/go/pkg/mod/golang.org/toolchain@v0.0.1-go1.23.0.linux-amd64/src/testing/testing.go:1354
        	            				/home/rclone/go/pkg/mod/golang.org/toolchain@v0.0.1-go1.23.0.linux-amd64/src/testing/testing.go:1684
        	Error:      	Not equal: 
        	            	expected: []string{}
        	            	actual  : []string{"rclone-sync-test", "rclone-sync-test-ignore-file", "rclone-sync-test-include", "rclone-sync-test-include/layer2"}
        	            	
        	            	Diff:
        	            	--- Expected
        	            	+++ Actual
        	            	@@ -1,2 +1,6 @@
        	            	-([]string) {
        	            	+([]string) (len=4) {
        	            	+ (string) (len=16) "rclone-sync-test",
        	            	+ (string) (len=28) "rclone-sync-test-ignore-file",
        	            	+ (string) (len=24) "rclone-sync-test-include",
        	            	+ (string) (len=31) "rclone-sync-test-include/layer2"
        	            	 }
        	Test:       	TestSyncOverlapWithFilter
        	Messages:   	directories
2025/03/26 05:15:18 DEBUG : rclone-sync-test-include/layer2/: Removing directory marker
    run.go:125: removing dir "rclone-sync-test-include/layer2" failed - try 1/3: removing directory marker failed: googleapi: Error 404: No such object: rclone-test-maqakig0luvu/rclone-sync-test-include/layer2/, notFound
2025/03/26 05:15:19 DEBUG : rclone-sync-test-include/layer2/: Removing directory marker
    run.go:125: removing dir "rclone-sync-test-include/layer2" failed - try 2/3: removing directory marker failed: googleapi: Error 404: No such object: rclone-test-maqakig0luvu/rclone-sync-test-include/layer2/, notFound
2025/03/26 05:15:21 DEBUG : rclone-sync-test-include/layer2/: Removing directory marker
    run.go:125: removing dir "rclone-sync-test-include/layer2" failed - try 3/3: removing directory marker failed: googleapi: Error 404: No such object: rclone-test-maqakig0luvu/rclone-sync-test-include/layer2/, notFound
    run.go:128: removing dir "rclone-sync-test-include/layer2" failed: removing directory marker failed: googleapi: Error 404: No such object: rclone-test-maqakig0luvu/rclone-sync-test-include/layer2/, notFound
2025/03/26 05:15:22 DEBUG : rclone-sync-test-include/: Removing directory marker
    run.go:125: removing dir "rclone-sync-test-include" failed - try 1/3: removing directory marker failed: googleapi: Error 404: No such object: rclone-test-maqakig0luvu/rclone-sync-test-include/, notFound
2025/03/26 05:15:23 DEBUG : rclone-sync-test-include/: Removing directory marker
    run.go:125: removing dir "rclone-sync-test-include" failed - try 2/3: removing directory marker failed: googleapi: Error 404: No such object: rclone-test-maqakig0luvu/rclone-sync-test-include/, notFound
2025/03/26 05:15:24 DEBUG : rclone-sync-test-include/: Removing directory marker
    run.go:125: removing dir "rclone-sync-test-include" failed - try 3/3: removing directory marker failed: googleapi: Error 404: No such object: rclone-test-maqakig0luvu/rclone-sync-test-include/, notFound
    run.go:128: removing dir "rclone-sync-test-include" failed: removing directory marker failed: googleapi: Error 404: No such object: rclone-test-maqakig0luvu/rclone-sync-test-include/, notFound
2025/03/26 05:15:25 DEBUG : rclone-sync-test-ignore-file/: Removing directory marker
    run.go:125: removing dir "rclone-sync-test-ignore-file" failed - try 1/3: removing directory marker failed: googleapi: Error 404: No such object: rclone-test-maqakig0luvu/rclone-sync-test-ignore-file/, notFound
2025/03/26 05:15:26 DEBUG : rclone-sync-test-ignore-file/: Removing directory marker
    run.go:125: removing dir "rclone-sync-test-ignore-file" failed - try 2/3: removing directory marker failed: googleapi: Error 404: No such object: rclone-test-maqakig0luvu/rclone-sync-test-ignore-file/, notFound
2025/03/26 05:15:27 DEBUG : rclone-sync-test-ignore-file/: Removing directory marker
    run.go:125: removing dir "rclone-sync-test-ignore-file" failed - try 3/3: removing directory marker failed: googleapi: Error 404: No such object: rclone-test-maqakig0luvu/rclone-sync-test-ignore-file/, notFound
    run.go:128: removing dir "rclone-sync-test-ignore-file" failed: removing directory marker failed: googleapi: Error 404: No such object: rclone-test-maqakig0luvu/rclone-sync-test-ignore-file/, notFound
2025/03/26 05:15:28 DEBUG : rclone-sync-test/: Removing directory marker
    run.go:125: removing dir "rclone-sync-test" failed - try 1/3: removing directory marker failed: googleapi: Error 404: No such object: rclone-test-maqakig0luvu/rclone-sync-test/, notFound
2025/03/26 05:15:29 DEBUG : rclone-sync-test/: Removing directory marker
    run.go:125: removing dir "rclone-sync-test" failed - try 2/3: removing directory marker failed: googleapi: Error 404: No such object: rclone-test-maqakig0luvu/rclone-sync-test/, notFound
2025/03/26 05:15:30 DEBUG : rclone-sync-test/: Removing directory marker
    run.go:125: removing dir "rclone-sync-test" failed - try 3/3: removing directory marker failed: googleapi: Error 404: No such object: rclone-test-maqakig0luvu/rclone-sync-test/, notFound
    run.go:128: removing dir "rclone-sync-test" failed: removing directory marker failed: googleapi: Error 404: No such object: rclone-test-maqakig0luvu/rclone-sync-test/, notFound
    fstest.go:292: Sleeping for 1s for list eventual consistency: 1/3
    fstest.go:292: Sleeping for 2s for list eventual consistency: 2/3
    fstest.go:292: Sleeping for 4s for list eventual consistency: 3/3
    fstest.go:321: 
        	Error Trace:	/home/rclone/go/src/github.com/rclone/rclone/fstest/fstest.go:321
        	            				/home/rclone/go/src/github.com/rclone/rclone/fstest/fstest.go:332
        	            				/home/rclone/go/src/github.com/rclone/rclone/fstest/run.go:173
        	            				/home/rclone/go/src/github.com/rclone/rclone/fstest/run.go:388
        	            				/home/rclone/go/pkg/mod/golang.org/toolchain@v0.0.1-go1.23.0.linux-amd64/src/testing/testing.go:1176
        	            				/home/rclone/go/pkg/mod/golang.org/toolchain@v0.0.1-go1.23.0.linux-amd64/src/testing/testing.go:1354
        	            				/home/rclone/go/pkg/mod/golang.org/toolchain@v0.0.1-go1.23.0.linux-amd64/src/testing/testing.go:1684
        	Error:      	Not equal: 
        	            	expected: []string{}
        	            	actual  : []string{"rclone-sync-test", "rclone-sync-test-ignore-file", "rclone-sync-test-include", "rclone-sync-test-include/layer2"}
        	            	
        	            	Diff:
        	            	--- Expected
        	            	+++ Actual
        	            	@@ -1,2 +1,6 @@
        	            	-([]string) {
        	            	+([]string) (len=4) {
        	            	+ (string) (len=16) "rclone-sync-test",
        	            	+ (string) (len=28) "rclone-sync-test-ignore-file",
        	            	+ (string) (len=24) "rclone-sync-test-include",
        	            	+ (string) (len=31) "rclone-sync-test-include/layer2"
        	            	 }
        	Test:       	TestSyncOverlapWithFilter
        	Messages:   	directories
2025/03/26 05:15:38 DEBUG : rclone-sync-test-include/layer2/: Removing directory marker
    run.go:125: removing dir "rclone-sync-test-include/layer2" failed - try 1/3: removing directory marker failed: googleapi: Error 404: No such object: rclone-test-maqakig0luvu/rclone-sync-test-include/layer2/, notFound
2025/03/26 05:15:40 DEBUG : rclone-sync-test-include/layer2/: Removing directory marker
    run.go:125: removing dir "rclone-sync-test-include/layer2" failed - try 2/3: removing directory marker failed: googleapi: Error 404: No such object: rclone-test-maqakig0luvu/rclone-sync-test-include/layer2/, notFound
2025/03/26 05:15:41 DEBUG : rclone-sync-test-include/layer2/: Removing directory marker
    run.go:125: removing dir "rclone-sync-test-include/layer2" failed - try 3/3: removing directory marker failed: googleapi: Error 404: No such object: rclone-test-maqakig0luvu/rclone-sync-test-include/layer2/, notFound
    run.go:128: removing dir "rclone-sync-test-include/layer2" failed: removing directory marker failed: googleapi: Error 404: No such object: rclone-test-maqakig0luvu/rclone-sync-test-include/layer2/, notFound
2025/03/26 05:15:42 DEBUG : rclone-sync-test-include/: Removing directory marker
    run.go:125: removing dir "rclone-sync-test-include" failed - try 1/3: removing directory marker failed: googleapi: Error 404: No such object: rclone-test-maqakig0luvu/rclone-sync-test-include/, notFound
2025/03/26 05:15:43 DEBUG : rclone-sync-test-include/: Removing directory marker
    run.go:125: removing dir "rclone-sync-test-include" failed - try 2/3: removing directory marker failed: googleapi: Error 404: No such object: rclone-test-maqakig0luvu/rclone-sync-test-include/, notFound
2025/03/26 05:15:44 DEBUG : rclone-sync-test-include/: Removing directory marker
    run.go:125: removing dir "rclone-sync-test-include" failed - try 3/3: removing directory marker failed: googleapi: Error 404: No such object: rclone-test-maqakig0luvu/rclone-sync-test-include/, notFound
    run.go:128: removing dir "rclone-sync-test-include" failed: removing directory marker failed: googleapi: Error 404: No such object: rclone-test-maqakig0luvu/rclone-sync-test-include/, notFound
2025/03/26 05:15:45 DEBUG : rclone-sync-test-ignore-file/: Removing directory marker
    run.go:125: removing dir "rclone-sync-test-ignore-file" failed - try 1/3: removing directory marker failed: googleapi: Error 404: No such object: rclone-test-maqakig0luvu/rclone-sync-test-ignore-file/, notFound
2025/03/26 05:15:46 DEBUG : rclone-sync-test-ignore-file/: Removing directory marker
    run.go:125: removing dir "rclone-sync-test-ignore-file" failed - try 2/3: removing directory marker failed: googleapi: Error 404: No such object: rclone-test-maqakig0luvu/rclone-sync-test-ignore-file/, notFound
2025/03/26 05:15:47 DEBUG : rclone-sync-test-ignore-file/: Removing directory marker
    run.go:125: removing dir "rclone-sync-test-ignore-file" failed - try 3/3: removing directory marker failed: googleapi: Error 404: No such object: rclone-test-maqakig0luvu/rclone-sync-test-ignore-file/, notFound
    run.go:128: removing dir "rclone-sync-test-ignore-file" failed: removing directory marker failed: googleapi: Error 404: No such object: rclone-test-maqakig0luvu/rclone-sync-test-ignore-file/, notFound
2025/03/26 05:15:48 DEBUG : rclone-sync-test/: Removing directory marker
    run.go:125: removing dir "rclone-sync-test" failed - try 1/3: removing directory marker failed: googleapi: Error 404: No such object: rclone-test-maqakig0luvu/rclone-sync-test/, notFound
2025/03/26 05:15:49 DEBUG : rclone-sync-test/: Removing directory marker
    run.go:125: removing dir "rclone-sync-test" failed - try 2/3: removing directory marker failed: googleapi: Error 404: No such object: rclone-test-maqakig0luvu/rclone-sync-test/, notFound
2025/03/26 05:15:50 DEBUG : rclone-sync-test/: Removing directory marker
    run.go:125: removing dir "rclone-sync-test" failed - try 3/3: removing directory marker failed: googleapi: Error 404: No such object: rclone-test-maqakig0luvu/rclone-sync-test/, notFound
    run.go:128: removing dir "rclone-sync-test" failed: removing directory marker failed: googleapi: Error 404: No such object: rclone-test-maqakig0luvu/rclone-sync-test/, notFound
    fstest.go:292: Sleeping for 1s for list eventual consistency: 1/3
    fstest.go:292: Sleeping for 2s for list eventual consistency: 2/3
    fstest.go:292: Sleeping for 4s for list eventual consistency: 3/3
    fstest.go:321: 
        	Error Trace:	/home/rclone/go/src/github.com/rclone/rclone/fstest/fstest.go:321
        	            				/home/rclone/go/src/github.com/rclone/rclone/fstest/fstest.go:332
        	            				/home/rclone/go/src/github.com/rclone/rclone/fstest/run.go:173
        	            				/home/rclone/go/src/github.com/rclone/rclone/fstest/run.go:388
        	            				/home/rclone/go/pkg/mod/golang.org/toolchain@v0.0.1-go1.23.0.linux-amd64/src/testing/testing.go:1176
        	            				/home/rclone/go/pkg/mod/golang.org/toolchain@v0.0.1-go1.23.0.linux-amd64/src/testing/testing.go:1354
        	            				/home/rclone/go/pkg/mod/golang.org/toolchain@v0.0.1-go1.23.0.linux-amd64/src/testing/testing.go:1684
        	Error:      	Not equal: 
        	            	expected: []string{}
        	            	actual  : []string{"rclone-sync-test", "rclone-sync-test-ignore-file", "rclone-sync-test-include", "rclone-sync-test-include/layer2"}
        	            	
        	            	Diff:
        	            	--- Expected
        	            	+++ Actual
        	            	@@ -1,2 +1,6 @@
        	            	-([]string) {
        	            	+([]string) (len=4) {
        	            	+ (string) (len=16) "rclone-sync-test",
        	            	+ (string) (len=28) "rclone-sync-test-ignore-file",
        	            	+ (string) (len=24) "rclone-sync-test-include",
        	            	+ (string) (len=31) "rclone-sync-test-include/layer2"
        	            	 }
        	Test:       	TestSyncOverlapWithFilter
        	Messages:   	directories
2025/03/26 05:15:59 DEBUG : rclone-sync-test-include/layer2/: Removing directory marker
    run.go:125: removing dir "rclone-sync-test-include/layer2" failed - try 1/3: removing directory marker failed: googleapi: Error 404: No such object: rclone-test-maqakig0luvu/rclone-sync-test-include/layer2/, notFound
2025/03/26 05:16:00 DEBUG : rclone-sync-test-include/layer2/: Removing directory marker
    run.go:125: removing dir "rclone-sync-test-include/layer2" failed - try 2/3: removing directory marker failed: googleapi: Error 404: No such object: rclone-test-maqakig0luvu/rclone-sync-test-include/layer2/, notFound
2025/03/26 05:16:01 DEBUG : rclone-sync-test-include/layer2/: Removing directory marker
    run.go:125: removing dir "rclone-sync-test-include/layer2" failed - try 3/3: removing directory marker failed: googleapi: Error 404: No such object: rclone-test-maqakig0luvu/rclone-sync-test-include/layer2/, notFound
    run.go:128: removing dir "rclone-sync-test-include/layer2" failed: removing directory marker failed: googleapi: Error 404: No such object: rclone-test-maqakig0luvu/rclone-sync-test-include/layer2/, notFound
2025/03/26 05:16:02 DEBUG : rclone-sync-test-include/: Removing directory marker
    run.go:125: removing dir "rclone-sync-test-include" failed - try 1/3: removing directory marker failed: googleapi: Error 404: No such object: rclone-test-maqakig0luvu/rclone-sync-test-include/, notFound
2025/03/26 05:16:03 DEBUG : rclone-sync-test-include/: Removing directory marker
    run.go:125: removing dir "rclone-sync-test-include" failed - try 2/3: removing directory marker failed: googleapi: Error 404: No such object: rclone-test-maqakig0luvu/rclone-sync-test-include/, notFound
2025/03/26 05:16:04 DEBUG : rclone-sync-test-include/: Removing directory marker
    run.go:125: removing dir "rclone-sync-test-include" failed - try 3/3: removing directory marker failed: googleapi: Error 404: No such object: rclone-test-maqakig0luvu/rclone-sync-test-include/, notFound
    run.go:128: removing dir "rclone-sync-test-include" failed: removing directory marker failed: googleapi: Error 404: No such object: rclone-test-maqakig0luvu/rclone-sync-test-include/, notFound
2025/03/26 05:16:05 DEBUG : rclone-sync-test-ignore-file/: Removing directory marker
    run.go:125: removing dir "rclone-sync-test-ignore-file" failed - try 1/3: removing directory marker failed: googleapi: Error 404: No such object: rclone-test-maqakig0luvu/rclone-sync-test-ignore-file/, notFound
2025/03/26 05:16:06 DEBUG : rclone-sync-test-ignore-file/: Removing directory marker
    run.go:125: removing dir "rclone-sync-test-ignore-file" failed - try 2/3: removing directory marker failed: googleapi: Error 404: No such object: rclone-test-maqakig0luvu/rclone-sync-test-ignore-file/, notFound
2025/03/26 05:16:07 DEBUG : rclone-sync-test-ignore-file/: Removing directory marker
    run.go:125: removing dir "rclone-sync-test-ignore-file" failed - try 3/3: removing directory marker failed: googleapi: Error 404: No such object: rclone-test-maqakig0luvu/rclone-sync-test-ignore-file/, notFound
    run.go:128: removing dir "rclone-sync-test-ignore-file" failed: removing directory marker failed: googleapi: Error 404: No such object: rclone-test-maqakig0luvu/rclone-sync-test-ignore-file/, notFound
2025/03/26 05:16:08 DEBUG : rclone-sync-test/: Removing directory marker
    run.go:125: removing dir "rclone-sync-test" failed - try 1/3: removing directory marker failed: googleapi: Error 404: No such object: rclone-test-maqakig0luvu/rclone-sync-test/, notFound
2025/03/26 05:16:09 DEBUG : rclone-sync-test/: Removing directory marker
    run.go:125: removing dir "rclone-sync-test" failed - try 2/3: removing directory marker failed: googleapi: Error 404: No such object: rclone-test-maqakig0luvu/rclone-sync-test/, notFound
2025/03/26 05:16:10 DEBUG : rclone-sync-test/: Removing directory marker
    run.go:125: removing dir "rclone-sync-test" failed - try 3/3: removing directory marker failed: googleapi: Error 404: No such object: rclone-test-maqakig0luvu/rclone-sync-test/, notFound
    run.go:128: removing dir "rclone-sync-test" failed: removing directory marker failed: googleapi: Error 404: No such object: rclone-test-maqakig0luvu/rclone-sync-test/, notFound
    fstest.go:292: Sleeping for 1s for list eventual consistency: 1/3
    fstest.go:292: Sleeping for 2s for list eventual consistency: 2/3
    fstest.go:292: Sleeping for 4s for list eventual consistency: 3/3
    fstest.go:321: 
        	Error Trace:	/home/rclone/go/src/github.com/rclone/rclone/fstest/fstest.go:321
        	            				/home/rclone/go/src/github.com/rclone/rclone/fstest/fstest.go:332
        	            				/home/rclone/go/src/github.com/rclone/rclone/fstest/run.go:173
        	            				/home/rclone/go/src/github.com/rclone/rclone/fstest/run.go:388
        	            				/home/rclone/go/pkg/mod/golang.org/toolchain@v0.0.1-go1.23.0.linux-amd64/src/testing/testing.go:1176
        	            				/home/rclone/go/pkg/mod/golang.org/toolchain@v0.0.1-go1.23.0.linux-amd64/src/testing/testing.go:1354
        	            				/home/rclone/go/pkg/mod/golang.org/toolchain@v0.0.1-go1.23.0.linux-amd64/src/testing/testing.go:1684
        	Error:      	Not equal: 
        	            	expected: []string{}
        	            	actual  : []string{"rclone-sync-test", "rclone-sync-test-ignore-file", "rclone-sync-test-include", "rclone-sync-test-include/layer2"}
        	            	
        	            	Diff:
        	            	--- Expected
        	            	+++ Actual
        	            	@@ -1,2 +1,6 @@
        	            	-([]string) {
        	            	+([]string) (len=4) {
        	            	+ (string) (len=16) "rclone-sync-test",
        	            	+ (string) (len=28) "rclone-sync-test-ignore-file",
        	            	+ (string) (len=24) "rclone-sync-test-include",
        	            	+ (string) (len=31) "rclone-sync-test-include/layer2"
        	            	 }
        	Test:       	TestSyncOverlapWithFilter
        	Messages:   	directories
2025/03/26 05:16:19 DEBUG : rclone-sync-test-include/layer2/: Removing directory marker
    run.go:125: removing dir "rclone-sync-test-include/layer2" failed - try 1/3: removing directory marker failed: googleapi: Error 404: No such object: rclone-test-maqakig0luvu/rclone-sync-test-include/layer2/, notFound
2025/03/26 05:16:20 DEBUG : rclone-sync-test-include/layer2/: Removing directory marker
    run.go:125: removing dir "rclone-sync-test-include/layer2" failed - try 2/3: removing directory marker failed: googleapi: Error 404: No such object: rclone-test-maqakig0luvu/rclone-sync-test-include/layer2/, notFound
2025/03/26 05:16:21 DEBUG : rclone-sync-test-include/layer2/: Removing directory marker
    run.go:125: removing dir "rclone-sync-test-include/layer2" failed - try 3/3: removing directory marker failed: googleapi: Error 404: No such object: rclone-test-maqakig0luvu/rclone-sync-test-include/layer2/, notFound
    run.go:128: removing dir "rclone-sync-test-include/layer2" failed: removing directory marker failed: googleapi: Error 404: No such object: rclone-test-maqakig0luvu/rclone-sync-test-include/layer2/, notFound
2025/03/26 05:16:22 DEBUG : rclone-sync-test-include/: Removing directory marker
    run.go:125: removing dir "rclone-sync-test-include" failed - try 1/3: removing directory marker failed: googleapi: Error 404: No such object: rclone-test-maqakig0luvu/rclone-sync-test-include/, notFound
2025/03/26 05:16:23 DEBUG : rclone-sync-test-include/: Removing directory marker
    run.go:125: removing dir "rclone-sync-test-include" failed - try 2/3: removing directory marker failed: googleapi: Error 404: No such object: rclone-test-maqakig0luvu/rclone-sync-test-include/, notFound
2025/03/26 05:16:24 DEBUG : rclone-sync-test-include/: Removing directory marker
    run.go:125: removing dir "rclone-sync-test-include" failed - try 3/3: removing directory marker failed: googleapi: Error 404: No such object: rclone-test-maqakig0luvu/rclone-sync-test-include/, notFound
    run.go:128: removing dir "rclone-sync-test-include" failed: removing directory marker failed: googleapi: Error 404: No such object: rclone-test-maqakig0luvu/rclone-sync-test-include/, notFound
2025/03/26 05:16:25 DEBUG : rclone-sync-test-ignore-file/: Removing directory marker
    run.go:125: removing dir "rclone-sync-test-ignore-file" failed - try 1/3: removing directory marker failed: googleapi: Error 404: No such object: rclone-test-maqakig0luvu/rclone-sync-test-ignore-file/, notFound
2025/03/26 05:16:26 DEBUG : rclone-sync-test-ignore-file/: Removing directory marker
    run.go:125: removing dir "rclone-sync-test-ignore-file" failed - try 2/3: removing directory marker failed: googleapi: Error 404: No such object: rclone-test-maqakig0luvu/rclone-sync-test-ignore-file/, notFound
2025/03/26 05:16:27 DEBUG : rclone-sync-test-ignore-file/: Removing directory marker
    run.go:125: removing dir "rclone-sync-test-ignore-file" failed - try 3/3: removing directory marker failed: googleapi: Error 404: No such object: rclone-test-maqakig0luvu/rclone-sync-test-ignore-file/, notFound
    run.go:128: removing dir "rclone-sync-test-ignore-file" failed: removing directory marker failed: googleapi: Error 404: No such object: rclone-test-maqakig0luvu/rclone-sync-test-ignore-file/, notFound
2025/03/26 05:16:28 DEBUG : rclone-sync-test/: Removing directory marker
    run.go:125: removing dir "rclone-sync-test" failed - try 1/3: removing directory marker failed: googleapi: Error 404: No such object: rclone-test-maqakig0luvu/rclone-sync-test/, notFound
2025/03/26 05:16:29 DEBUG : rclone-sync-test/: Removing directory marker
    run.go:125: removing dir "rclone-sync-test" failed - try 2/3: removing directory marker failed: googleapi: Error 404: No such object: rclone-test-maqakig0luvu/rclone-sync-test/, notFound
2025/03/26 05:16:30 DEBUG : rclone-sync-test/: Removing directory marker
    run.go:125: removing dir "rclone-sync-test" failed - try 3/3: removing directory marker failed: googleapi: Error 404: No such object: rclone-test-maqakig0luvu/rclone-sync-test/, notFound
    run.go:128: removing dir "rclone-sync-test" failed: removing directory marker failed: googleapi: Error 404: No such object: rclone-test-maqakig0luvu/rclone-sync-test/, notFound
    fstest.go:292: Sleeping for 1s for list eventual consistency: 1/3
    fstest.go:292: Sleeping for 2s for list eventual consistency: 2/3
    fstest.go:292: Sleeping for 4s for list eventual consistency: 3/3
    fstest.go:321: 
        	Error Trace:	/home/rclone/go/src/github.com/rclone/rclone/fstest/fstest.go:321
        	            				/home/rclone/go/src/github.com/rclone/rclone/fstest/fstest.go:332
        	            				/home/rclone/go/src/github.com/rclone/rclone/fstest/run.go:173
        	            				/home/rclone/go/src/github.com/rclone/rclone/fstest/run.go:388
        	            				/home/rclone/go/pkg/mod/golang.org/toolchain@v0.0.1-go1.23.0.linux-amd64/src/testing/testing.go:1176
        	            				/home/rclone/go/pkg/mod/golang.org/toolchain@v0.0.1-go1.23.0.linux-amd64/src/testing/testing.go:1354
        	            				/home/rclone/go/pkg/mod/golang.org/toolchain@v0.0.1-go1.23.0.linux-amd64/src/testing/testing.go:1684
        	Error:      	Not equal: 
        	            	expected: []string{}
        	            	actual  : []string{"rclone-sync-test", "rclone-sync-test-ignore-file", "rclone-sync-test-include", "rclone-sync-test-include/layer2"}
        	            	
        	            	Diff:
        	            	--- Expected
        	            	+++ Actual
        	            	@@ -1,2 +1,6 @@
        	            	-([]string) {
        	            	+([]string) (len=4) {
        	            	+ (string) (len=16) "rclone-sync-test",
        	            	+ (string) (len=28) "rclone-sync-test-ignore-file",
        	            	+ (string) (len=24) "rclone-sync-test-include",
        	            	+ (string) (len=31) "rclone-sync-test-include/layer2"
        	            	 }
        	Test:       	TestSyncOverlapWithFilter
        	Messages:   	directories
2025/03/26 05:16:39 DEBUG : rclone-sync-test-include/layer2/: Removing directory marker
    run.go:125: removing dir "rclone-sync-test-include/layer2" failed - try 1/3: removing directory marker failed: googleapi: Error 404: No such object: rclone-test-maqakig0luvu/rclone-sync-test-include/layer2/, notFound
2025/03/26 05:16:40 DEBUG : rclone-sync-test-include/layer2/: Removing directory marker
    run.go:125: removing dir "rclone-sync-test-include/layer2" failed - try 2/3: removing directory marker failed: googleapi: Error 404: No such object: rclone-test-maqakig0luvu/rclone-sync-test-include/layer2/, notFound
2025/03/26 05:16:41 DEBUG : rclone-sync-test-include/layer2/: Removing directory marker
    run.go:125: removing dir "rclone-sync-test-include/layer2" failed - try 3/3: removing directory marker failed: googleapi: Error 404: No such object: rclone-test-maqakig0luvu/rclone-sync-test-include/layer2/, notFound
    run.go:128: removing dir "rclone-sync-test-include/layer2" failed: removing directory marker failed: googleapi: Error 404: No such object: rclone-test-maqakig0luvu/rclone-sync-test-include/layer2/, notFound
2025/03/26 05:16:42 DEBUG : rclone-sync-test-include/: Removing directory marker
    run.go:125: removing dir "rclone-sync-test-include" failed - try 1/3: removing directory marker failed: googleapi: Error 404: No such object: rclone-test-maqakig0luvu/rclone-sync-test-include/, notFound
2025/03/26 05:16:43 DEBUG : rclone-sync-test-include/: Removing directory marker
    run.go:125: removing dir "rclone-sync-test-include" failed - try 2/3: removing directory marker failed: googleapi: Error 404: No such object: rclone-test-maqakig0luvu/rclone-sync-test-include/, notFound
2025/03/26 05:16:44 DEBUG : rclone-sync-test-include/: Removing directory marker
    run.go:125: removing dir "rclone-sync-test-include" failed - try 3/3: removing directory marker failed: googleapi: Error 404: No such object: rclone-test-maqakig0luvu/rclone-sync-test-include/, notFound
    run.go:128: removing dir "rclone-sync-test-include" failed: removing directory marker failed: googleapi: Error 404: No such object: rclone-test-maqakig0luvu/rclone-sync-test-include/, notFound
2025/03/26 05:16:45 DEBUG : rclone-sync-test-ignore-file/: Removing directory marker
    run.go:125: removing dir "rclone-sync-test-ignore-file" failed - try 1/3: removing directory marker failed: googleapi: Error 404: No such object: rclone-test-maqakig0luvu/rclone-sync-test-ignore-file/, notFound
2025/03/26 05:16:46 DEBUG : rclone-sync-test-ignore-file/: Removing directory marker
    run.go:125: removing dir "rclone-sync-test-ignore-file" failed - try 2/3: removing directory marker failed: googleapi: Error 404: No such object: rclone-test-maqakig0luvu/rclone-sync-test-ignore-file/, notFound
2025/03/26 05:16:47 DEBUG : rclone-sync-test-ignore-file/: Removing directory marker
    run.go:125: removing dir "rclone-sync-test-ignore-file" failed - try 3/3: removing directory marker failed: googleapi: Error 404: No such object: rclone-test-maqakig0luvu/rclone-sync-test-ignore-file/, notFound
    run.go:128: removing dir "rclone-sync-test-ignore-file" failed: removing directory marker failed: googleapi: Error 404: No such object: rclone-test-maqakig0luvu/rclone-sync-test-ignore-file/, notFound
2025/03/26 05:16:48 DEBUG : rclone-sync-test/: Removing directory marker
    run.go:125: removing dir "rclone-sync-test" failed - try 1/3: removing directory marker failed: googleapi: Error 404: No such object: rclone-test-maqakig0luvu/rclone-sync-test/, notFound
2025/03/26 05:16:49 DEBUG : rclone-sync-test/: Removing directory marker
    run.go:125: removing dir "rclone-sync-test" failed - try 2/3: removing directory marker failed: googleapi: Error 404: No such object: rclone-test-maqakig0luvu/rclone-sync-test/, notFound
2025/03/26 05:16:50 DEBUG : rclone-sync-test/: Removing directory marker
    run.go:125: removing dir "rclone-sync-test" failed - try 3/3: removing directory marker failed: googleapi: Error 404: No such object: rclone-test-maqakig0luvu/rclone-sync-test/, notFound
    run.go:128: removing dir "rclone-sync-test" failed: removing directory marker failed: googleapi: Error 404: No such object: rclone-test-maqakig0luvu/rclone-sync-test/, notFound
    fstest.go:292: Sleeping for 1s for list eventual consistency: 1/3
    fstest.go:292: Sleeping for 2s for list eventual consistency: 2/3
    fstest.go:292: Sleeping for 4s for list eventual consistency: 3/3
    fstest.go:321: 
        	Error Trace:	/home/rclone/go/src/github.com/rclone/rclone/fstest/fstest.go:321
        	            				/home/rclone/go/src/github.com/rclone/rclone/fstest/fstest.go:332
        	            				/home/rclone/go/src/github.com/rclone/rclone/fstest/run.go:173
        	            				/home/rclone/go/src/github.com/rclone/rclone/fstest/run.go:388
        	            				/home/rclone/go/pkg/mod/golang.org/toolchain@v0.0.1-go1.23.0.linux-amd64/src/testing/testing.go:1176
        	            				/home/rclone/go/pkg/mod/golang.org/toolchain@v0.0.1-go1.23.0.linux-amd64/src/testing/testing.go:1354
        	            				/home/rclone/go/pkg/mod/golang.org/toolchain@v0.0.1-go1.23.0.linux-amd64/src/testing/testing.go:1684
        	Error:      	Not equal: 
        	            	expected: []string{}
        	            	actual  : []string{"rclone-sync-test", "rclone-sync-test-ignore-file", "rclone-sync-test-include", "rclone-sync-test-include/layer2"}
        	            	
        	            	Diff:
        	            	--- Expected
        	            	+++ Actual
        	            	@@ -1,2 +1,6 @@
        	            	-([]string) {
        	            	+([]string) (len=4) {
        	            	+ (string) (len=16) "rclone-sync-test",
        	            	+ (string) (len=28) "rclone-sync-test-ignore-file",
        	            	+ (string) (len=24) "rclone-sync-test-include",
        	            	+ (string) (len=31) "rclone-sync-test-include/layer2"
        	            	 }
        	Test:       	TestSyncOverlapWithFilter
        	Messages:   	directories
2025/03/26 05:16:58 DEBUG : rclone-sync-test-include/layer2/: Removing directory marker
    run.go:125: removing dir "rclone-sync-test-include/layer2" failed - try 1/3: removing directory marker failed: googleapi: Error 404: No such object: rclone-test-maqakig0luvu/rclone-sync-test-include/layer2/, notFound
2025/03/26 05:17:00 DEBUG : rclone-sync-test-include/layer2/: Removing directory marker
    run.go:125: removing dir "rclone-sync-test-include/layer2" failed - try 2/3: removing directory marker failed: googleapi: Error 404: No such object: rclone-test-maqakig0luvu/rclone-sync-test-include/layer2/, notFound
2025/03/26 05:17:01 DEBUG : rclone-sync-test-include/layer2/: Removing directory marker
    run.go:125: removing dir "rclone-sync-test-include/layer2" failed - try 3/3: removing directory marker failed: googleapi: Error 404: No such object: rclone-test-maqakig0luvu/rclone-sync-test-include/layer2/, notFound
    run.go:128: removing dir "rclone-sync-test-include/layer2" failed: removing directory marker failed: googleapi: Error 404: No such object: rclone-test-maqakig0luvu/rclone-sync-test-include/layer2/, notFound
2025/03/26 05:17:02 DEBUG : rclone-sync-test-include/: Removing directory marker
    run.go:125: removing dir "rclone-sync-test-include" failed - try 1/3: removing directory marker failed: googleapi: Error 404: No such object: rclone-test-maqakig0luvu/rclone-sync-test-include/, notFound
2025/03/26 05:17:03 DEBUG : rclone-sync-test-include/: Removing directory marker
    run.go:125: removing dir "rclone-sync-test-include" failed - try 2/3: removing directory marker failed: googleapi: Error 404: No such object: rclone-test-maqakig0luvu/rclone-sync-test-include/, notFound
2025/03/26 05:17:04 DEBUG : rclone-sync-test-include/: Removing directory marker
    run.go:125: removing dir "rclone-sync-test-include" failed - try 3/3: removing directory marker failed: googleapi: Error 404: No such object: rclone-test-maqakig0luvu/rclone-sync-test-include/, notFound
    run.go:128: removing dir "rclone-sync-test-include" failed: removing directory marker failed: googleapi: Error 404: No such object: rclone-test-maqakig0luvu/rclone-sync-test-include/, notFound
2025/03/26 05:17:05 DEBUG : rclone-sync-test-ignore-file/: Removing directory marker
    run.go:125: removing dir "rclone-sync-test-ignore-file" failed - try 1/3: removing directory marker failed: googleapi: Error 404: No such object: rclone-test-maqakig0luvu/rclone-sync-test-ignore-file/, notFound
2025/03/26 05:17:06 DEBUG : rclone-sync-test-ignore-file/: Removing directory marker
    run.go:125: removing dir "rclone-sync-test-ignore-file" failed - try 2/3: removing directory marker failed: googleapi: Error 404: No such object: rclone-test-maqakig0luvu/rclone-sync-test-ignore-file/, notFound
2025/03/26 05:17:07 DEBUG : rclone-sync-test-ignore-file/: Removing directory marker
    run.go:125: removing dir "rclone-sync-test-ignore-file" failed - try 3/3: removing directory marker failed: googleapi: Error 404: No such object: rclone-test-maqakig0luvu/rclone-sync-test-ignore-file/, notFound
    run.go:128: removing dir "rclone-sync-test-ignore-file" failed: removing directory marker failed: googleapi: Error 404: No such object: rclone-test-maqakig0luvu/rclone-sync-test-ignore-file/, notFound
2025/03/26 05:17:08 DEBUG : rclone-sync-test/: Removing directory marker
    run.go:125: removing dir "rclone-sync-test" failed - try 1/3: removing directory marker failed: googleapi: Error 404: No such object: rclone-test-maqakig0luvu/rclone-sync-test/, notFound
2025/03/26 05:17:09 DEBUG : rclone-sync-test/: Removing directory marker
    run.go:125: removing dir "rclone-sync-test" failed - try 2/3: removing directory marker failed: googleapi: Error 404: No such object: rclone-test-maqakig0luvu/rclone-sync-test/, notFound
2025/03/26 05:17:10 DEBUG : rclone-sync-test/: Removing directory marker
    run.go:125: removing dir "rclone-sync-test" failed - try 3/3: removing directory marker failed: googleapi: Error 404: No such object: rclone-test-maqakig0luvu/rclone-sync-test/, notFound
    run.go:128: removing dir "rclone-sync-test" failed: removing directory marker failed: googleapi: Error 404: No such object: rclone-test-maqakig0luvu/rclone-sync-test/, notFound
    fstest.go:292: Sleeping for 1s for list eventual consistency: 1/3
    fstest.go:292: Sleeping for 2s for list eventual consistency: 2/3
    fstest.go:292: Sleeping for 4s for list eventual consistency: 3/3
    fstest.go:321: 
        	Error Trace:	/home/rclone/go/src/github.com/rclone/rclone/fstest/fstest.go:321
        	            				/home/rclone/go/src/github.com/rclone/rclone/fstest/fstest.go:332
        	            				/home/rclone/go/src/github.com/rclone/rclone/fstest/run.go:173
        	            				/home/rclone/go/src/github.com/rclone/rclone/fstest/run.go:388
        	            				/home/rclone/go/pkg/mod/golang.org/toolchain@v0.0.1-go1.23.0.linux-amd64/src/testing/testing.go:1176
        	            				/home/rclone/go/pkg/mod/golang.org/toolchain@v0.0.1-go1.23.0.linux-amd64/src/testing/testing.go:1354
        	            				/home/rclone/go/pkg/mod/golang.org/toolchain@v0.0.1-go1.23.0.linux-amd64/src/testing/testing.go:1684
        	Error:      	Not equal: 
        	            	expected: []string{}
        	            	actual  : []string{"rclone-sync-test", "rclone-sync-test-ignore-file", "rclone-sync-test-include", "rclone-sync-test-include/layer2"}
        	            	
        	            	Diff:
        	            	--- Expected
        	            	+++ Actual
        	            	@@ -1,2 +1,6 @@
        	            	-([]string) {
        	            	+([]string) (len=4) {
        	            	+ (string) (len=16) "rclone-sync-test",
        	            	+ (string) (len=28) "rclone-sync-test-ignore-file",
        	            	+ (string) (len=24) "rclone-sync-test-include",
        	            	+ (string) (len=31) "rclone-sync-test-include/layer2"
        	            	 }
        	Test:       	TestSyncOverlapWithFilter
        	Messages:   	directories
2025/03/26 05:17:18 DEBUG : rclone-sync-test-include/layer2/: Removing directory marker
    run.go:125: removing dir "rclone-sync-test-include/layer2" failed - try 1/3: removing directory marker failed: googleapi: Error 404: No such object: rclone-test-maqakig0luvu/rclone-sync-test-include/layer2/, notFound
2025/03/26 05:17:19 DEBUG : rclone-sync-test-include/layer2/: Removing directory marker
    run.go:125: removing dir "rclone-sync-test-include/layer2" failed - try 2/3: removing directory marker failed: googleapi: Error 404: No such object: rclone-test-maqakig0luvu/rclone-sync-test-include/layer2/, notFound
2025/03/26 05:17:21 DEBUG : rclone-sync-test-include/layer2/: Removing directory marker
    run.go:125: removing dir "rclone-sync-test-include/layer2" failed - try 3/3: removing directory marker failed: googleapi: Error 404: No such object: rclone-test-maqakig0luvu/rclone-sync-test-include/layer2/, notFound
    run.go:128: removing dir "rclone-sync-test-include/layer2" failed: removing directory marker failed: googleapi: Error 404: No such object: rclone-test-maqakig0luvu/rclone-sync-test-include/layer2/, notFound
2025/03/26 05:17:22 DEBUG : rclone-sync-test-include/: Removing directory marker
    run.go:125: removing dir "rclone-sync-test-include" failed - try 1/3: removing directory marker failed: googleapi: Error 404: No such object: rclone-test-maqakig0luvu/rclone-sync-test-include/, notFound
2025/03/26 05:17:23 DEBUG : rclone-sync-test-include/: Removing directory marker
    run.go:125: removing dir "rclone-sync-test-include" failed - try 2/3: removing directory marker failed: googleapi: Error 404: No such object: rclone-test-maqakig0luvu/rclone-sync-test-include/, notFound
2025/03/26 05:17:24 DEBUG : rclone-sync-test-include/: Removing directory marker
    run.go:125: removing dir "rclone-sync-test-include" failed - try 3/3: removing directory marker failed: googleapi: Error 404: No such object: rclone-test-maqakig0luvu/rclone-sync-test-include/, notFound
    run.go:128: removing dir "rclone-sync-test-include" failed: removing directory marker failed: googleapi: Error 404: No such object: rclone-test-maqakig0luvu/rclone-sync-test-include/, notFound
2025/03/26 05:17:25 DEBUG : rclone-sync-test-ignore-file/: Removing directory marker
    run.go:125: removing dir "rclone-sync-test-ignore-file" failed - try 1/3: removing directory marker failed: googleapi: Error 404: No such object: rclone-test-maqakig0luvu/rclone-sync-test-ignore-file/, notFound
2025/03/26 05:17:26 DEBUG : rclone-sync-test-ignore-file/: Removing directory marker
    run.go:125: removing dir "rclone-sync-test-ignore-file" failed - try 2/3: removing directory marker failed: googleapi: Error 404: No such object: rclone-test-maqakig0luvu/rclone-sync-test-ignore-file/, notFound
2025/03/26 05:17:27 DEBUG : rclone-sync-test-ignore-file/: Removing directory marker
    run.go:125: removing dir "rclone-sync-test-ignore-file" failed - try 3/3: removing directory marker failed: googleapi: Error 404: No such object: rclone-test-maqakig0luvu/rclone-sync-test-ignore-file/, notFound
    run.go:128: removing dir "rclone-sync-test-ignore-file" failed: removing directory marker failed: googleapi: Error 404: No such object: rclone-test-maqakig0luvu/rclone-sync-test-ignore-file/, notFound
2025/03/26 05:17:28 DEBUG : rclone-sync-test/: Removing directory marker
    run.go:125: removing dir "rclone-sync-test" failed - try 1/3: removing directory marker failed: googleapi: Error 404: No such object: rclone-test-maqakig0luvu/rclone-sync-test/, notFound
2025/03/26 05:17:29 DEBUG : rclone-sync-test/: Removing directory marker
    run.go:125: removing dir "rclone-sync-test" failed - try 2/3: removing directory marker failed: googleapi: Error 404: No such object: rclone-test-maqakig0luvu/rclone-sync-test/, notFound
2025/03/26 05:17:30 DEBUG : rclone-sync-test/: Removing directory marker
    run.go:125: removing dir "rclone-sync-test" failed - try 3/3: removing directory marker failed: googleapi: Error 404: No such object: rclone-test-maqakig0luvu/rclone-sync-test/, notFound
    run.go:128: removing dir "rclone-sync-test" failed: removing directory marker failed: googleapi: Error 404: No such object: rclone-test-maqakig0luvu/rclone-sync-test/, notFound
    fstest.go:292: Sleeping for 1s for list eventual consistency: 1/3
    fstest.go:292: Sleeping for 2s for list eventual consistency: 2/3
    fstest.go:292: Sleeping for 4s for list eventual consistency: 3/3
    fstest.go:321: 
        	Error Trace:	/home/rclone/go/src/github.com/rclone/rclone/fstest/fstest.go:321
        	            				/home/rclone/go/src/github.com/rclone/rclone/fstest/fstest.go:332
        	            				/home/rclone/go/src/github.com/rclone/rclone/fstest/run.go:173
        	            				/home/rclone/go/src/github.com/rclone/rclone/fstest/run.go:388
        	            				/home/rclone/go/pkg/mod/golang.org/toolchain@v0.0.1-go1.23.0.linux-amd64/src/testing/testing.go:1176
        	            				/home/rclone/go/pkg/mod/golang.org/toolchain@v0.0.1-go1.23.0.linux-amd64/src/testing/testing.go:1354
        	            				/home/rclone/go/pkg/mod/golang.org/toolchain@v0.0.1-go1.23.0.linux-amd64/src/testing/testing.go:1684
        	Error:      	Not equal: 
        	            	expected: []string{}
        	            	actual  : []string{"rclone-sync-test", "rclone-sync-test-ignore-file", "rclone-sync-test-include", "rclone-sync-test-include/layer2"}
        	            	
        	            	Diff:
        	            	--- Expected
        	            	+++ Actual
        	            	@@ -1,2 +1,6 @@
        	            	-([]string) {
        	            	+([]string) (len=4) {
        	            	+ (string) (len=16) "rclone-sync-test",
        	            	+ (string) (len=28) "rclone-sync-test-ignore-file",
        	            	+ (string) (len=24) "rclone-sync-test-include",
        	            	+ (string) (len=31) "rclone-sync-test-include/layer2"
        	            	 }
        	Test:       	TestSyncOverlapWithFilter
        	Messages:   	directories
2025/03/26 05:17:38 DEBUG : rclone-sync-test-include/layer2/: Removing directory marker
    run.go:125: removing dir "rclone-sync-test-include/layer2" failed - try 1/3: removing directory marker failed: googleapi: Error 404: No such object: rclone-test-maqakig0luvu/rclone-sync-test-include/layer2/, notFound
2025/03/26 05:17:39 DEBUG : rclone-sync-test-include/layer2/: Removing directory marker
    run.go:125: removing dir "rclone-sync-test-include/layer2" failed - try 2/3: removing directory marker failed: googleapi: Error 404: No such object: rclone-test-maqakig0luvu/rclone-sync-test-include/layer2/, notFound
2025/03/26 05:17:40 DEBUG : rclone-sync-test-include/layer2/: Removing directory marker
    run.go:125: removing dir "rclone-sync-test-include/layer2" failed - try 3/3: removing directory marker failed: googleapi: Error 404: No such object: rclone-test-maqakig0luvu/rclone-sync-test-include/layer2/, notFound
    run.go:128: removing dir "rclone-sync-test-include/layer2" failed: removing directory marker failed: googleapi: Error 404: No such object: rclone-test-maqakig0luvu/rclone-sync-test-include/layer2/, notFound
2025/03/26 05:17:41 DEBUG : rclone-sync-test-include/: Removing directory marker
    run.go:125: removing dir "rclone-sync-test-include" failed - try 1/3: removing directory marker failed: googleapi: Error 404: No such object: rclone-test-maqakig0luvu/rclone-sync-test-include/, notFound
2025/03/26 05:17:43 DEBUG : rclone-sync-test-include/: Removing directory marker
    run.go:125: removing dir "rclone-sync-test-include" failed - try 2/3: removing directory marker failed: googleapi: Error 404: No such object: rclone-test-maqakig0luvu/rclone-sync-test-include/, notFound
2025/03/26 05:17:44 DEBUG : rclone-sync-test-include/: Removing directory marker
    run.go:125: removing dir "rclone-sync-test-include" failed - try 3/3: removing directory marker failed: googleapi: Error 404: No such object: rclone-test-maqakig0luvu/rclone-sync-test-include/, notFound
    run.go:128: removing dir "rclone-sync-test-include" failed: removing directory marker failed: googleapi: Error 404: No such object: rclone-test-maqakig0luvu/rclone-sync-test-include/, notFound
2025/03/26 05:17:45 DEBUG : rclone-sync-test-ignore-file/: Removing directory marker
    run.go:125: removing dir "rclone-sync-test-ignore-file" failed - try 1/3: removing directory marker failed: googleapi: Error 404: No such object: rclone-test-maqakig0luvu/rclone-sync-test-ignore-file/, notFound
2025/03/26 05:17:46 DEBUG : rclone-sync-test-ignore-file/: Removing directory marker
    run.go:125: removing dir "rclone-sync-test-ignore-file" failed - try 2/3: removing directory marker failed: googleapi: Error 404: No such object: rclone-test-maqakig0luvu/rclone-sync-test-ignore-file/, notFound
2025/03/26 05:17:47 DEBUG : rclone-sync-test-ignore-file/: Removing directory marker
    run.go:125: removing dir "rclone-sync-test-ignore-file" failed - try 3/3: removing directory marker failed: googleapi: Error 404: No such object: rclone-test-maqakig0luvu/rclone-sync-test-ignore-file/, notFound
    run.go:128: removing dir "rclone-sync-test-ignore-file" failed: removing directory marker failed: googleapi: Error 404: No such object: rclone-test-maqakig0luvu/rclone-sync-test-ignore-file/, notFound
2025/03/26 05:17:48 DEBUG : rclone-sync-test/: Removing directory marker
    run.go:125: removing dir "rclone-sync-test" failed - try 1/3: removing directory marker failed: googleapi: Error 404: No such object: rclone-test-maqakig0luvu/rclone-sync-test/, notFound
2025/03/26 05:17:49 DEBUG : rclone-sync-test/: Removing directory marker
    run.go:125: removing dir "rclone-sync-test" failed - try 2/3: removing directory marker failed: googleapi: Error 404: No such object: rclone-test-maqakig0luvu/rclone-sync-test/, notFound
2025/03/26 05:17:50 DEBUG : rclone-sync-test/: Removing directory marker
    run.go:125: removing dir "rclone-sync-test" failed - try 3/3: removing directory marker failed: googleapi: Error 404: No such object: rclone-test-maqakig0luvu/rclone-sync-test/, notFound
    run.go:128: removing dir "rclone-sync-test" failed: removing directory marker failed: googleapi: Error 404: No such object: rclone-test-maqakig0luvu/rclone-sync-test/, notFound
    fstest.go:292: Sleeping for 1s for list eventual consistency: 1/3
    fstest.go:292: Sleeping for 2s for list eventual consistency: 2/3
    fstest.go:292: Sleeping for 4s for list eventual consistency: 3/3
    fstest.go:321: 
        	Error Trace:	/home/rclone/go/src/github.com/rclone/rclone/fstest/fstest.go:321
        	            				/home/rclone/go/src/github.com/rclone/rclone/fstest/fstest.go:332
        	            				/home/rclone/go/src/github.com/rclone/rclone/fstest/run.go:173
        	            				/home/rclone/go/src/github.com/rclone/rclone/fstest/run.go:388
        	            				/home/rclone/go/pkg/mod/golang.org/toolchain@v0.0.1-go1.23.0.linux-amd64/src/testing/testing.go:1176
        	            				/home/rclone/go/pkg/mod/golang.org/toolchain@v0.0.1-go1.23.0.linux-amd64/src/testing/testing.go:1354
        	            				/home/rclone/go/pkg/mod/golang.org/toolchain@v0.0.1-go1.23.0.linux-amd64/src/testing/testing.go:1684
        	Error:      	Not equal: 
        	            	expected: []string{}
        	            	actual  : []string{"rclone-sync-test", "rclone-sync-test-ignore-file", "rclone-sync-test-include", "rclone-sync-test-include/layer2"}
        	            	
        	            	Diff:
        	            	--- Expected
        	            	+++ Actual
        	            	@@ -1,2 +1,6 @@
        	            	-([]string) {
        	            	+([]string) (len=4) {
        	            	+ (string) (len=16) "rclone-sync-test",
        	            	+ (string) (len=28) "rclone-sync-test-ignore-file",
        	            	+ (string) (len=24) "rclone-sync-test-include",
        	            	+ (string) (len=31) "rclone-sync-test-include/layer2"
        	            	 }
        	Test:       	TestSyncOverlapWithFilter
        	Messages:   	directories
--- FAIL: TestSyncOverlapWithFilter (395.87s)
=== RUN   TestSyncCompareDest
    run.go:180: Remote "GCS bucket rclone-test-maqakig0luvu", Local "Local file system at /tmp/rclone928107066", Modify Window "1ns"
2025/03/26 05:17:58 DEBUG : Creating backend with remote "TestGoogleCloudStorage,directory_markers:rclone-test-maqakig0luvu/dst"
2025/03/26 05:17:58 DEBUG : TestGoogleCloudStorage: detected overridden config - adding "{juk_h}" suffix to name
2025/03/26 05:17:58 DEBUG : Creating backend with remote "TestGoogleCloudStorage,directory_markers:rclone-test-maqakig0luvu/CompareDest"
2025/03/26 05:17:58 DEBUG : TestGoogleCloudStorage: detected overridden config - adding "{juk_h}" suffix to name
2025/03/26 05:17:59 DEBUG : fs cache: renaming cache item "TestGoogleCloudStorage,directory_markers:rclone-test-maqakig0luvu/CompareDest" to be canonical "TestGoogleCloudStorage{juk_h}:rclone-test-maqakig0luvu/CompareDest"
2025/03/26 05:18:00 DEBUG : one: Need to transfer - File not found at Destination
2025/03/26 05:18:00 DEBUG : GCS bucket rclone-test-maqakig0luvu path dst: Waiting for checks to finish
2025/03/26 05:18:00 DEBUG : GCS bucket rclone-test-maqakig0luvu path dst: Waiting for transfers to finish
2025/03/26 05:18:00 DEBUG : /: Creating directory marker
2025/03/26 05:18:00 DEBUG : one: md5 = f97c5d29941bfb1b2fdab0874906ab82 OK
2025/03/26 05:18:00 INFO  : one: Copied (new)
2025/03/26 05:18:00 DEBUG : Waiting for deletions to finish
2025/03/26 05:18:01 DEBUG : fs cache: switching user supplied name "TestGoogleCloudStorage,directory_markers:rclone-test-maqakig0luvu/CompareDest" for canonical name "TestGoogleCloudStorage{juk_h}:rclone-test-maqakig0luvu/CompareDest"
2025/03/26 05:18:01 ERROR : : Entry doesn't belong in directory "" (same as directory) - ignoring
2025/03/26 05:18:01 DEBUG : GCS bucket rclone-test-maqakig0luvu path dst: Waiting for checks to finish
2025/03/26 05:18:01 DEBUG : one: Sizes differ (src 5 vs dst 3)
2025/03/26 05:18:01 DEBUG : GCS bucket rclone-test-maqakig0luvu path dst: Waiting for transfers to finish
2025/03/26 05:18:01 DEBUG : one: md5 = 07912d142f5d63ee918b34796b5a2432 OK
2025/03/26 05:18:01 INFO  : one: Copied (replaced existing)
2025/03/26 05:18:01 DEBUG : Waiting for deletions to finish
2025/03/26 05:18:01 DEBUG : dst/: Creating directory marker
2025/03/26 05:18:02 DEBUG : CompareDest/: Creating directory marker
2025/03/26 05:18:02 DEBUG : fs cache: switching user supplied name "TestGoogleCloudStorage,directory_markers:rclone-test-maqakig0luvu/CompareDest" for canonical name "TestGoogleCloudStorage{juk_h}:rclone-test-maqakig0luvu/CompareDest"
2025/03/26 05:18:03 ERROR : : Entry doesn't belong in directory "" (same as directory) - ignoring
2025/03/26 05:18:03 DEBUG : one: Sizes differ (src 5 vs dst 3)
2025/03/26 05:18:03 DEBUG : GCS bucket rclone-test-maqakig0luvu path dst: Waiting for checks to finish
2025/03/26 05:18:03 DEBUG : one: Size and modification time the same (differ by 0s, within tolerance 1ns)
2025/03/26 05:18:03 DEBUG : one: Destination found in --compare-dest, skipping
2025/03/26 05:18:03 DEBUG : GCS bucket rclone-test-maqakig0luvu path dst: Waiting for transfers to finish
2025/03/26 05:18:03 DEBUG : Waiting for deletions to finish
2025/03/26 05:18:03 INFO  : There was nothing to transfer
2025/03/26 05:18:03 DEBUG : fs cache: switching user supplied name "TestGoogleCloudStorage,directory_markers:rclone-test-maqakig0luvu/CompareDest" for canonical name "TestGoogleCloudStorage{juk_h}:rclone-test-maqakig0luvu/CompareDest"
2025/03/26 05:18:03 ERROR : : Entry doesn't belong in directory "" (same as directory) - ignoring
2025/03/26 05:18:04 DEBUG : two: Size and modification time the same (differ by 0s, within tolerance 1ns)
2025/03/26 05:18:04 DEBUG : two: Destination found in --compare-dest, skipping
2025/03/26 05:18:04 DEBUG : one: Sizes differ (src 5 vs dst 3)
2025/03/26 05:18:04 DEBUG : GCS bucket rclone-test-maqakig0luvu path dst: Waiting for checks to finish
2025/03/26 05:18:04 DEBUG : one: Size and modification time the same (differ by 0s, within tolerance 1ns)
2025/03/26 05:18:04 DEBUG : one: Destination found in --compare-dest, skipping
2025/03/26 05:18:04 DEBUG : GCS bucket rclone-test-maqakig0luvu path dst: Waiting for transfers to finish
2025/03/26 05:18:04 DEBUG : Waiting for deletions to finish
2025/03/26 05:18:04 INFO  : There was nothing to transfer
2025/03/26 05:18:04 DEBUG : fs cache: switching user supplied name "TestGoogleCloudStorage,directory_markers:rclone-test-maqakig0luvu/CompareDest" for canonical name "TestGoogleCloudStorage{juk_h}:rclone-test-maqakig0luvu/CompareDest"
2025/03/26 05:18:04 ERROR : : Entry doesn't belong in directory "" (same as directory) - ignoring
2025/03/26 05:18:04 DEBUG : two: Size and modification time the same (differ by 0s, within tolerance 1ns)
2025/03/26 05:18:04 DEBUG : two: Destination found in --compare-dest, skipping
2025/03/26 05:18:04 DEBUG : one: Sizes differ (src 5 vs dst 3)
2025/03/26 05:18:04 DEBUG : GCS bucket rclone-test-maqakig0luvu path dst: Waiting for checks to finish
2025/03/26 05:18:04 DEBUG : one: Size and modification time the same (differ by 0s, within tolerance 1ns)
2025/03/26 05:18:04 DEBUG : one: Destination found in --compare-dest, skipping
2025/03/26 05:18:04 DEBUG : GCS bucket rclone-test-maqakig0luvu path dst: Waiting for transfers to finish
2025/03/26 05:18:04 DEBUG : Waiting for deletions to finish
2025/03/26 05:18:04 INFO  : There was nothing to transfer
2025/03/26 05:18:04 DEBUG : fs cache: switching user supplied name "TestGoogleCloudStorage,directory_markers:rclone-test-maqakig0luvu/CompareDest" for canonical name "TestGoogleCloudStorage{juk_h}:rclone-test-maqakig0luvu/CompareDest"
2025/03/26 05:18:04 ERROR : : Entry doesn't belong in directory "" (same as directory) - ignoring
2025/03/26 05:18:04 DEBUG : two: Modification times differ by -119h59m59.876543211s: 2011-12-30 12:59:59 +0000 UTC, 2011-12-25 12:59:59.123456789 +0000 UTC
2025/03/26 05:18:04 DEBUG : two: md5 = b8a9f715dbb64fd5c56e7783c6820a61 OK
2025/03/26 05:18:04 DEBUG : two: Destination found in --compare-dest, skipping
2025/03/26 05:18:04 DEBUG : one: Sizes differ (src 5 vs dst 3)
2025/03/26 05:18:04 DEBUG : GCS bucket rclone-test-maqakig0luvu path dst: Waiting for checks to finish
2025/03/26 05:18:05 DEBUG : one: Size and modification time the same (differ by 0s, within tolerance 1ns)
2025/03/26 05:18:05 DEBUG : one: Destination found in --compare-dest, skipping
2025/03/26 05:18:05 DEBUG : GCS bucket rclone-test-maqakig0luvu path dst: Waiting for transfers to finish
2025/03/26 05:18:05 DEBUG : Waiting for deletions to finish
2025/03/26 05:18:05 INFO  : There was nothing to transfer
2025/03/26 05:18:05 DEBUG : fs cache: switching user supplied name "TestGoogleCloudStorage,directory_markers:rclone-test-maqakig0luvu/CompareDest" for canonical name "TestGoogleCloudStorage{juk_h}:rclone-test-maqakig0luvu/CompareDest"
2025/03/26 05:18:05 ERROR : : Entry doesn't belong in directory "" (same as directory) - ignoring
2025/03/26 05:18:05 DEBUG : two: Sizes differ (src 5 vs dst 3)
2025/03/26 05:18:05 DEBUG : two: Need to transfer - File not found at Destination
2025/03/26 05:18:05 DEBUG : one: Sizes differ (src 5 vs dst 3)
2025/03/26 05:18:05 DEBUG : GCS bucket rclone-test-maqakig0luvu path dst: Waiting for checks to finish
2025/03/26 05:18:05 DEBUG : one: Size and modification time the same (differ by 0s, within tolerance 1ns)
2025/03/26 05:18:05 DEBUG : one: Destination found in --compare-dest, skipping
2025/03/26 05:18:05 DEBUG : GCS bucket rclone-test-maqakig0luvu path dst: Waiting for transfers to finish
2025/03/26 05:18:05 DEBUG : two: md5 = 2379e4ce8c3380e996ab0509f17069ad OK
2025/03/26 05:18:05 INFO  : two: Copied (new)
2025/03/26 05:18:05 DEBUG : Waiting for deletions to finish
2025/03/26 05:18:06 DEBUG : rclone-sync-test-include/layer2/: Removing directory marker
    run.go:125: removing dir "rclone-sync-test-include/layer2" failed - try 1/3: removing directory marker failed: googleapi: Error 404: No such object: rclone-test-maqakig0luvu/rclone-sync-test-include/layer2/, notFound
2025/03/26 05:18:07 DEBUG : rclone-sync-test-include/layer2/: Removing directory marker
    run.go:125: removing dir "rclone-sync-test-include/layer2" failed - try 2/3: removing directory marker failed: googleapi: Error 404: No such object: rclone-test-maqakig0luvu/rclone-sync-test-include/layer2/, notFound
2025/03/26 05:18:08 DEBUG : rclone-sync-test-include/layer2/: Removing directory marker
    run.go:125: removing dir "rclone-sync-test-include/layer2" failed - try 3/3: removing directory marker failed: googleapi: Error 404: No such object: rclone-test-maqakig0luvu/rclone-sync-test-include/layer2/, notFound
    run.go:128: removing dir "rclone-sync-test-include/layer2" failed: removing directory marker failed: googleapi: Error 404: No such object: rclone-test-maqakig0luvu/rclone-sync-test-include/layer2/, notFound
2025/03/26 05:18:09 DEBUG : rclone-sync-test-include/: Removing directory marker
    run.go:125: removing dir "rclone-sync-test-include" failed - try 1/3: removing directory marker failed: googleapi: Error 404: No such object: rclone-test-maqakig0luvu/rclone-sync-test-include/, notFound
2025/03/26 05:18:10 DEBUG : rclone-sync-test-include/: Removing directory marker
    run.go:125: removing dir "rclone-sync-test-include" failed - try 2/3: removing directory marker failed: googleapi: Error 404: No such object: rclone-test-maqakig0luvu/rclone-sync-test-include/, notFound
2025/03/26 05:18:11 DEBUG : rclone-sync-test-include/: Removing directory marker
    run.go:125: removing dir "rclone-sync-test-include" failed - try 3/3: removing directory marker failed: googleapi: Error 404: No such object: rclone-test-maqakig0luvu/rclone-sync-test-include/, notFound
    run.go:128: removing dir "rclone-sync-test-include" failed: removing directory marker failed: googleapi: Error 404: No such object: rclone-test-maqakig0luvu/rclone-sync-test-include/, notFound
2025/03/26 05:18:12 DEBUG : rclone-sync-test-ignore-file/: Removing directory marker
    run.go:125: removing dir "rclone-sync-test-ignore-file" failed - try 1/3: removing directory marker failed: googleapi: Error 404: No such object: rclone-test-maqakig0luvu/rclone-sync-test-ignore-file/, notFound
2025/03/26 05:18:13 DEBUG : rclone-sync-test-ignore-file/: Removing directory marker
    run.go:125: removing dir "rclone-sync-test-ignore-file" failed - try 2/3: removing directory marker failed: googleapi: Error 404: No such object: rclone-test-maqakig0luvu/rclone-sync-test-ignore-file/, notFound
2025/03/26 05:18:14 DEBUG : rclone-sync-test-ignore-file/: Removing directory marker
    run.go:125: removing dir "rclone-sync-test-ignore-file" failed - try 3/3: removing directory marker failed: googleapi: Error 404: No such object: rclone-test-maqakig0luvu/rclone-sync-test-ignore-file/, notFound
    run.go:128: removing dir "rclone-sync-test-ignore-file" failed: removing directory marker failed: googleapi: Error 404: No such object: rclone-test-maqakig0luvu/rclone-sync-test-ignore-file/, notFound
2025/03/26 05:18:15 DEBUG : rclone-sync-test/: Removing directory marker
    run.go:125: removing dir "rclone-sync-test" failed - try 1/3: removing directory marker failed: googleapi: Error 404: No such object: rclone-test-maqakig0luvu/rclone-sync-test/, notFound
2025/03/26 05:18:16 DEBUG : rclone-sync-test/: Removing directory marker
    run.go:125: removing dir "rclone-sync-test" failed - try 2/3: removing directory marker failed: googleapi: Error 404: No such object: rclone-test-maqakig0luvu/rclone-sync-test/, notFound
2025/03/26 05:18:17 DEBUG : rclone-sync-test/: Removing directory marker
    run.go:125: removing dir "rclone-sync-test" failed - try 3/3: removing directory marker failed: googleapi: Error 404: No such object: rclone-test-maqakig0luvu/rclone-sync-test/, notFound
    run.go:128: removing dir "rclone-sync-test" failed: removing directory marker failed: googleapi: Error 404: No such object: rclone-test-maqakig0luvu/rclone-sync-test/, notFound
2025/03/26 05:18:18 DEBUG : dst/: Removing directory marker
2025/03/26 05:18:18 DEBUG : dst/: Removing directory marker
    run.go:125: removing dir "dst" failed - try 1/3: removing directory marker failed: googleapi: Error 404: No such object: rclone-test-maqakig0luvu/dst/, notFound
2025/03/26 05:18:19 DEBUG : dst/: Removing directory marker
    run.go:125: removing dir "dst" failed - try 2/3: removing directory marker failed: googleapi: Error 404: No such object: rclone-test-maqakig0luvu/dst/, notFound
2025/03/26 05:18:20 DEBUG : dst/: Removing directory marker
    run.go:125: removing dir "dst" failed - try 3/3: removing directory marker failed: googleapi: Error 404: No such object: rclone-test-maqakig0luvu/dst/, notFound
    run.go:128: removing dir "dst" failed: removing directory marker failed: googleapi: Error 404: No such object: rclone-test-maqakig0luvu/dst/, notFound
2025/03/26 05:18:21 DEBUG : CompareDest/: Removing directory marker
    fstest.go:292: Sleeping for 1s for list eventual consistency: 1/3
    fstest.go:292: Sleeping for 2s for list eventual consistency: 2/3
    fstest.go:292: Sleeping for 4s for list eventual consistency: 3/3
    fstest.go:321: 
        	Error Trace:	/home/rclone/go/src/github.com/rclone/rclone/fstest/fstest.go:321
        	            				/home/rclone/go/src/github.com/rclone/rclone/fstest/fstest.go:332
        	            				/home/rclone/go/src/github.com/rclone/rclone/fstest/run.go:173
        	            				/home/rclone/go/src/github.com/rclone/rclone/fstest/run.go:388
        	            				/home/rclone/go/pkg/mod/golang.org/toolchain@v0.0.1-go1.23.0.linux-amd64/src/testing/testing.go:1176
        	            				/home/rclone/go/pkg/mod/golang.org/toolchain@v0.0.1-go1.23.0.linux-amd64/src/testing/testing.go:1354
        	            				/home/rclone/go/pkg/mod/golang.org/toolchain@v0.0.1-go1.23.0.linux-amd64/src/testing/testing.go:1684
        	Error:      	Not equal: 
        	            	expected: []string{}
        	            	actual  : []string{"dst", "rclone-sync-test", "rclone-sync-test-ignore-file", "rclone-sync-test-include", "rclone-sync-test-include/layer2"}
        	            	
        	            	Diff:
        	            	--- Expected
        	            	+++ Actual
        	            	@@ -1,2 +1,7 @@
        	            	-([]string) {
        	            	+([]string) (len=5) {
        	            	+ (string) (len=3) "dst",
        	            	+ (string) (len=16) "rclone-sync-test",
        	            	+ (string) (len=28) "rclone-sync-test-ignore-file",
        	            	+ (string) (len=24) "rclone-sync-test-include",
        	            	+ (string) (len=31) "rclone-sync-test-include/layer2"
        	            	 }
        	Test:       	TestSyncCompareDest
        	Messages:   	directories
--- FAIL: TestSyncCompareDest (30.61s)
=== RUN   TestSyncMultipleCompareDest
    run.go:180: Remote "GCS bucket rclone-test-maqakig0luvu", Local "Local file system at /tmp/rclone928107066", Modify Window "1ns"
2025/03/26 05:18:29 DEBUG : pre-dest1/: Creating directory marker
2025/03/26 05:18:30 DEBUG : pre-dest2/: Creating directory marker
2025/03/26 05:18:30 DEBUG : Creating backend with remote "TestGoogleCloudStorage,directory_markers:rclone-test-maqakig0luvu/dest"
2025/03/26 05:18:30 DEBUG : TestGoogleCloudStorage: detected overridden config - adding "{juk_h}" suffix to name
2025/03/26 05:18:30 DEBUG : Creating backend with remote "TestGoogleCloudStorage,directory_markers:rclone-test-maqakig0luvu/pre-dest1"
2025/03/26 05:18:30 DEBUG : TestGoogleCloudStorage: detected overridden config - adding "{juk_h}" suffix to name
2025/03/26 05:18:31 DEBUG : fs cache: renaming cache item "TestGoogleCloudStorage,directory_markers:rclone-test-maqakig0luvu/pre-dest1" to be canonical "TestGoogleCloudStorage{juk_h}:rclone-test-maqakig0luvu/pre-dest1"
2025/03/26 05:18:31 DEBUG : Creating backend with remote "TestGoogleCloudStorage,directory_markers:rclone-test-maqakig0luvu/pre-dest2"
2025/03/26 05:18:31 DEBUG : TestGoogleCloudStorage: detected overridden config - adding "{juk_h}" suffix to name
2025/03/26 05:18:31 DEBUG : fs cache: renaming cache item "TestGoogleCloudStorage,directory_markers:rclone-test-maqakig0luvu/pre-dest2" to be canonical "TestGoogleCloudStorage{juk_h}:rclone-test-maqakig0luvu/pre-dest2"
2025/03/26 05:18:32 DEBUG : 1: Size and modification time the same (differ by 0s, within tolerance 1ns)
2025/03/26 05:18:32 DEBUG : 1: Destination found in --compare-dest, skipping
2025/03/26 05:18:32 DEBUG : 2: Size and modification time the same (differ by 0s, within tolerance 1ns)
2025/03/26 05:18:32 DEBUG : 2: Destination found in --compare-dest, skipping
2025/03/26 05:18:33 DEBUG : 3: Need to transfer - File not found at Destination
2025/03/26 05:18:33 DEBUG : GCS bucket rclone-test-maqakig0luvu path dest: Waiting for checks to finish
2025/03/26 05:18:33 DEBUG : GCS bucket rclone-test-maqakig0luvu path dest: Waiting for transfers to finish
2025/03/26 05:18:33 DEBUG : /: Creating directory marker
2025/03/26 05:18:34 DEBUG : 3: md5 = eccbc87e4b5ce2fe28308fd9f2a7baf3 OK
2025/03/26 05:18:34 INFO  : 3: Copied (new)
2025/03/26 05:18:34 DEBUG : Waiting for deletions to finish
2025/03/26 05:18:34 DEBUG : rclone-sync-test-include/layer2/: Removing directory marker
    run.go:125: removing dir "rclone-sync-test-include/layer2" failed - try 1/3: removing directory marker failed: googleapi: Error 404: No such object: rclone-test-maqakig0luvu/rclone-sync-test-include/layer2/, notFound
2025/03/26 05:18:35 DEBUG : rclone-sync-test-include/layer2/: Removing directory marker
    run.go:125: removing dir "rclone-sync-test-include/layer2" failed - try 2/3: removing directory marker failed: googleapi: Error 404: No such object: rclone-test-maqakig0luvu/rclone-sync-test-include/layer2/, notFound
2025/03/26 05:18:36 DEBUG : rclone-sync-test-include/layer2/: Removing directory marker
    run.go:125: removing dir "rclone-sync-test-include/layer2" failed - try 3/3: removing directory marker failed: googleapi: Error 404: No such object: rclone-test-maqakig0luvu/rclone-sync-test-include/layer2/, notFound
    run.go:128: removing dir "rclone-sync-test-include/layer2" failed: removing directory marker failed: googleapi: Error 404: No such object: rclone-test-maqakig0luvu/rclone-sync-test-include/layer2/, notFound
2025/03/26 05:18:37 DEBUG : rclone-sync-test-include/: Removing directory marker
    run.go:125: removing dir "rclone-sync-test-include" failed - try 1/3: removing directory marker failed: googleapi: Error 404: No such object: rclone-test-maqakig0luvu/rclone-sync-test-include/, notFound
2025/03/26 05:18:38 DEBUG : rclone-sync-test-include/: Removing directory marker
    run.go:125: removing dir "rclone-sync-test-include" failed - try 2/3: removing directory marker failed: googleapi: Error 404: No such object: rclone-test-maqakig0luvu/rclone-sync-test-include/, notFound
2025/03/26 05:18:39 DEBUG : rclone-sync-test-include/: Removing directory marker
    run.go:125: removing dir "rclone-sync-test-include" failed - try 3/3: removing directory marker failed: googleapi: Error 404: No such object: rclone-test-maqakig0luvu/rclone-sync-test-include/, notFound
    run.go:128: removing dir "rclone-sync-test-include" failed: removing directory marker failed: googleapi: Error 404: No such object: rclone-test-maqakig0luvu/rclone-sync-test-include/, notFound
2025/03/26 05:18:40 DEBUG : rclone-sync-test-ignore-file/: Removing directory marker
    run.go:125: removing dir "rclone-sync-test-ignore-file" failed - try 1/3: removing directory marker failed: googleapi: Error 404: No such object: rclone-test-maqakig0luvu/rclone-sync-test-ignore-file/, notFound
2025/03/26 05:18:41 DEBUG : rclone-sync-test-ignore-file/: Removing directory marker
    run.go:125: removing dir "rclone-sync-test-ignore-file" failed - try 2/3: removing directory marker failed: googleapi: Error 404: No such object: rclone-test-maqakig0luvu/rclone-sync-test-ignore-file/, notFound
2025/03/26 05:18:42 DEBUG : rclone-sync-test-ignore-file/: Removing directory marker
    run.go:125: removing dir "rclone-sync-test-ignore-file" failed - try 3/3: removing directory marker failed: googleapi: Error 404: No such object: rclone-test-maqakig0luvu/rclone-sync-test-ignore-file/, notFound
    run.go:128: removing dir "rclone-sync-test-ignore-file" failed: removing directory marker failed: googleapi: Error 404: No such object: rclone-test-maqakig0luvu/rclone-sync-test-ignore-file/, notFound
2025/03/26 05:18:43 DEBUG : rclone-sync-test/: Removing directory marker
    run.go:125: removing dir "rclone-sync-test" failed - try 1/3: removing directory marker failed: googleapi: Error 404: No such object: rclone-test-maqakig0luvu/rclone-sync-test/, notFound
2025/03/26 05:18:45 DEBUG : rclone-sync-test/: Removing directory marker
    run.go:125: removing dir "rclone-sync-test" failed - try 2/3: removing directory marker failed: googleapi: Error 404: No such object: rclone-test-maqakig0luvu/rclone-sync-test/, notFound
2025/03/26 05:18:46 DEBUG : rclone-sync-test/: Removing directory marker
    run.go:125: removing dir "rclone-sync-test" failed - try 3/3: removing directory marker failed: googleapi: Error 404: No such object: rclone-test-maqakig0luvu/rclone-sync-test/, notFound
    run.go:128: removing dir "rclone-sync-test" failed: removing directory marker failed: googleapi: Error 404: No such object: rclone-test-maqakig0luvu/rclone-sync-test/, notFound
2025/03/26 05:18:47 DEBUG : pre-dest2/: Removing directory marker
2025/03/26 05:18:47 DEBUG : pre-dest1/: Removing directory marker
2025/03/26 05:18:47 DEBUG : dst/: Removing directory marker
    run.go:125: removing dir "dst" failed - try 1/3: removing directory marker failed: googleapi: Error 404: No such object: rclone-test-maqakig0luvu/dst/, notFound
2025/03/26 05:18:48 DEBUG : dst/: Removing directory marker
    run.go:125: removing dir "dst" failed - try 2/3: removing directory marker failed: googleapi: Error 404: No such object: rclone-test-maqakig0luvu/dst/, notFound
2025/03/26 05:18:49 DEBUG : dst/: Removing directory marker
    run.go:125: removing dir "dst" failed - try 3/3: removing directory marker failed: googleapi: Error 404: No such object: rclone-test-maqakig0luvu/dst/, notFound
    run.go:128: removing dir "dst" failed: removing directory marker failed: googleapi: Error 404: No such object: rclone-test-maqakig0luvu/dst/, notFound
2025/03/26 05:18:50 DEBUG : dest/: Removing directory marker
    run.go:125: removing dir "dest" failed - try 1/3: removing directory marker failed: googleapi: Error 404: No such object: rclone-test-maqakig0luvu/dest/, notFound
2025/03/26 05:18:51 DEBUG : dest/: Removing directory marker
    run.go:125: removing dir "dest" failed - try 2/3: removing directory marker failed: googleapi: Error 404: No such object: rclone-test-maqakig0luvu/dest/, notFound
2025/03/26 05:18:52 DEBUG : dest/: Removing directory marker
    run.go:125: removing dir "dest" failed - try 3/3: removing directory marker failed: googleapi: Error 404: No such object: rclone-test-maqakig0luvu/dest/, notFound
    run.go:128: removing dir "dest" failed: removing directory marker failed: googleapi: Error 404: No such object: rclone-test-maqakig0luvu/dest/, notFound
    fstest.go:292: Sleeping for 1s for list eventual consistency: 1/3
    fstest.go:292: Sleeping for 2s for list eventual consistency: 2/3
    fstest.go:292: Sleeping for 4s for list eventual consistency: 3/3
    fstest.go:321: 
        	Error Trace:	/home/rclone/go/src/github.com/rclone/rclone/fstest/fstest.go:321
        	            				/home/rclone/go/src/github.com/rclone/rclone/fstest/fstest.go:332
        	            				/home/rclone/go/src/github.com/rclone/rclone/fstest/run.go:173
        	            				/home/rclone/go/src/github.com/rclone/rclone/fstest/run.go:388
        	            				/home/rclone/go/pkg/mod/golang.org/toolchain@v0.0.1-go1.23.0.linux-amd64/src/testing/testing.go:1176
        	            				/home/rclone/go/pkg/mod/golang.org/toolchain@v0.0.1-go1.23.0.linux-amd64/src/testing/testing.go:1354
        	            				/home/rclone/go/pkg/mod/golang.org/toolchain@v0.0.1-go1.23.0.linux-amd64/src/testing/testing.go:1684
        	            				/home/rclone/go/pkg/mod/golang.org/toolchain@v0.0.1-go1.23.0.linux-amd64/src/runtime/panic.go:785
        	            				/home/rclone/go/pkg/mod/golang.org/toolchain@v0.0.1-go1.23.0.linux-amd64/src/runtime/panic.go:155
        	            				/home/rclone/go/src/github.com/rclone/rclone/backend/googlecloudstorage/googlecloudstorage.go:717
        	            				/home/rclone/go/src/github.com/rclone/rclone/backend/googlecloudstorage/googlecloudstorage.go:850
        	            				/home/rclone/go/src/github.com/rclone/rclone/backend/googlecloudstorage/googlecloudstorage.go:877
        	            				/home/rclone/go/src/github.com/rclone/rclone/fs/walk/walk.go:298
        	            				/home/rclone/go/src/github.com/rclone/rclone/fs/walk/walk.go:162
        	            				/home/rclone/go/src/github.com/rclone/rclone/fs/walk/walk.go:631
        	            				/home/rclone/go/src/github.com/rclone/rclone/fstest/fstest.go:274
        	            				/home/rclone/go/src/github.com/rclone/rclone/fstest/fstest.go:332
        	            				/home/rclone/go/src/github.com/rclone/rclone/fstest/fstest.go:344
        	            				/home/rclone/go/src/github.com/rclone/rclone/fs/sync/sync_test.go:2224
        	Error:      	Not equal: 
        	            	expected: []string{}
        	            	actual  : []string{"dest", "dst", "rclone-sync-test", "rclone-sync-test-ignore-file", "rclone-sync-test-include", "rclone-sync-test-include/layer2"}
        	            	
        	            	Diff:
        	            	--- Expected
        	            	+++ Actual
        	            	@@ -1,2 +1,8 @@
        	            	-([]string) {
        	            	+([]string) (len=6) {
        	            	+ (string) (len=4) "dest",
        	            	+ (string) (len=3) "dst",
        	            	+ (string) (len=16) "rclone-sync-test",
        	            	+ (string) (len=28) "rclone-sync-test-ignore-file",
        	            	+ (string) (len=24) "rclone-sync-test-include",
        	            	+ (string) (len=31) "rclone-sync-test-include/layer2"
        	            	 }
        	Test:       	TestSyncMultipleCompareDest
        	Messages:   	directories
--- FAIL: TestSyncMultipleCompareDest (31.54s)
panic: runtime error: slice bounds out of range [5:4] [recovered]
	panic: runtime error: slice bounds out of range [5:4]

goroutine 1895 [running]:
testing.tRunner.func1.2({0x2410fc0, 0xc00090a1b0})
	/home/rclone/go/pkg/mod/golang.org/toolchain@v0.0.1-go1.23.0.linux-amd64/src/testing/testing.go:1632 +0x230
testing.tRunner.func1()
	/home/rclone/go/pkg/mod/golang.org/toolchain@v0.0.1-go1.23.0.linux-amd64/src/testing/testing.go:1635 +0x35e
panic({0x2410fc0?, 0xc00090a1b0?})
	/home/rclone/go/pkg/mod/golang.org/toolchain@v0.0.1-go1.23.0.linux-amd64/src/runtime/panic.go:785 +0x132
github.com/rclone/rclone/backend/googlecloudstorage.(*Fs).list(0xc000316280, {0x29e9c40, 0x3d1cb20}, {0xc000908489, 0x18}, {0xc0009084a2, 0x4}, {0xc0009084a2, 0x4}, 0x0, ...)
	/home/rclone/go/src/github.com/rclone/rclone/backend/googlecloudstorage/googlecloudstorage.go:717 +0xffe
github.com/rclone/rclone/backend/googlecloudstorage.(*Fs).ListR.func1({0xc000908489?, 0x0?}, {0xc0009084a2?, 0x47233d?}, {0xc0009084a2?, 0xc0000b4120?}, 0x1d?)
	/home/rclone/go/src/github.com/rclone/rclone/backend/googlecloudstorage/googlecloudstorage.go:850 +0x95
github.com/rclone/rclone/backend/googlecloudstorage.(*Fs).ListR(0xc000316280, {0x29e9c40, 0x3d1cb20}, {0x0?, 0x24db300?}, 0xc000892690)
	/home/rclone/go/src/github.com/rclone/rclone/backend/googlecloudstorage/googlecloudstorage.go:877 +0x12a
github.com/rclone/rclone/fs/walk.listR({0x29e9c40, 0x3d1cb20}, {0x29fe600, 0xc000316280}, {0x0, 0x0}, 0x1, 0x3, 0xc000914138, 0xc00011e8b8, ...)
	/home/rclone/go/src/github.com/rclone/rclone/fs/walk/walk.go:298 +0x2a3
github.com/rclone/rclone/fs/walk.ListR({0x29e9c40, 0x3d1cb20}, {0x29fe600, 0xc000316280}, {0x0, 0x0}, 0x1, 0xffffffffffffffff, 0x3, 0xc000914138)
	/home/rclone/go/src/github.com/rclone/rclone/fs/walk/walk.go:162 +0x1d5
github.com/rclone/rclone/fs/walk.GetAll({0x29e9c40, 0x3d1cb20}, {0x29fe600, 0xc000316280}, {0x0, 0x0}, 0x1, 0xffffffffffffffff)
	/home/rclone/go/src/github.com/rclone/rclone/fs/walk/walk.go:631 +0x105
github.com/rclone/rclone/fstest.CheckListingWithRoot(0xc000182000, {0x29fe600, 0xc000316280}, {0x0, 0x0}, {0xc0002c3440, 0x1, 0x1}, {0x0, 0x0, ...}, ...)
	/home/rclone/go/src/github.com/rclone/rclone/fstest/fstest.go:274 +0x3d6
github.com/rclone/rclone/fstest.CheckListingWithPrecision(...)
	/home/rclone/go/src/github.com/rclone/rclone/fstest/fstest.go:332
github.com/rclone/rclone/fstest.CheckItemsWithPrecision(...)
	/home/rclone/go/src/github.com/rclone/rclone/fstest/fstest.go:344
github.com/rclone/rclone/fs/sync.TestSyncMultipleCompareDest(0xc000182000)
	/home/rclone/go/src/github.com/rclone/rclone/fs/sync/sync_test.go:2224 +0xa0b
testing.tRunner(0xc000182000, 0x270f080)
	/home/rclone/go/pkg/mod/golang.org/toolchain@v0.0.1-go1.23.0.linux-amd64/src/testing/testing.go:1690 +0xf4
created by testing.(*T).Run in goroutine 1
	/home/rclone/go/pkg/mod/golang.org/toolchain@v0.0.1-go1.23.0.linux-amd64/src/testing/testing.go:1743 +0x390
"./sync.test -test.v -test.timeout 1h0m0s -remote 'TestGoogleCloudStorage,directory_markers:' -verbose -test.run '^(TestSyncCompareDest|TestSyncMultipleCompareDest|TestSyncOverlapWithFilter)$'" - Finished ERROR in 7m38.07402488s (try 3/5): exit status 2: Failed [TestSyncOverlapWithFilter TestSyncCompareDest TestSyncMultipleCompareDest]