"./bisync.test -test.v -test.timeout 1h0m0s -remote TestFTPProftpd: -verbose -test.run '^TestBisyncRemoteLocal$/^(changes|check_access)$'" - Starting (try 2/5)
2025/03/22 06:21:55 DEBUG : Creating backend with remote "TestFTPProftpd:rclone-test-hapumuq9biro"
2025/03/22 06:21:55 DEBUG : Using config file from "/home/rclone/.rclone.conf"
2025/03/22 06:21:55 DEBUG : Setting type="ftp" for "TestFTPProftpd" from environment variable RCLONE_CONFIG_TESTFTPPROFTPD_TYPE
2025/03/22 06:21:55 DEBUG : Setting host="172.17.0.3" for "TestFTPProftpd" from environment variable RCLONE_CONFIG_TESTFTPPROFTPD_HOST
2025/03/22 06:21:55 DEBUG : Setting user="rclone" for "TestFTPProftpd" from environment variable RCLONE_CONFIG_TESTFTPPROFTPD_USER
2025/03/22 06:21:55 DEBUG : Setting pass="qBDOB7N4Nk3bjunblZOFYStheCGgNwjUA50eoaEMiOcYFA" for "TestFTPProftpd" from environment variable RCLONE_CONFIG_TESTFTPPROFTPD_PASS
2025/03/22 06:21:55 DEBUG : Setting encoding="Asterisk,Ctl,Dot,Slash" for "TestFTPProftpd" from environment variable RCLONE_CONFIG_TESTFTPPROFTPD_ENCODING
2025/03/22 06:21:55 DEBUG : TestFTPProftpd: detected overridden config - adding "{jitBN}" suffix to name
2025/03/22 06:21:55 DEBUG : Setting host="172.17.0.3" for "TestFTPProftpd" from environment variable RCLONE_CONFIG_TESTFTPPROFTPD_HOST
2025/03/22 06:21:55 DEBUG : Setting user="rclone" for "TestFTPProftpd" from environment variable RCLONE_CONFIG_TESTFTPPROFTPD_USER
2025/03/22 06:21:55 DEBUG : Setting pass="qBDOB7N4Nk3bjunblZOFYStheCGgNwjUA50eoaEMiOcYFA" for "TestFTPProftpd" from environment variable RCLONE_CONFIG_TESTFTPPROFTPD_PASS
2025/03/22 06:21:55 DEBUG : Setting encoding="Asterisk,Ctl,Dot,Slash" for "TestFTPProftpd" from environment variable RCLONE_CONFIG_TESTFTPPROFTPD_ENCODING
2025/03/22 06:21:55 DEBUG : ftp://172.17.0.3:21/rclone-test-hapumuq9biro: Connecting to FTP server
2025/03/22 06:21:55 DEBUG : ftp://172.17.0.3:21/rclone-test-hapumuq9biro: dial("tcp","172.17.0.3:21")
2025/03/22 06:21:55 DEBUG : ftp://172.17.0.3:21/rclone-test-hapumuq9biro: > dial: conn=*fshttp.timeoutConn, err=<nil>
2025/03/22 06:21:55 DEBUG : Creating backend with remote "/tmp/rclone3034860330"
=== RUN   TestBisyncRemoteLocal
2025/03/22 06:21:55 DEBUG : Creating backend with remote "TestFTPProftpd:rclone-test-lecevix6pomu"
2025/03/22 06:21:55 DEBUG : Setting type="ftp" for "TestFTPProftpd" from environment variable RCLONE_CONFIG_TESTFTPPROFTPD_TYPE
2025/03/22 06:21:55 DEBUG : Setting host="172.17.0.3" for "TestFTPProftpd" from environment variable RCLONE_CONFIG_TESTFTPPROFTPD_HOST
2025/03/22 06:21:55 DEBUG : Setting user="rclone" for "TestFTPProftpd" from environment variable RCLONE_CONFIG_TESTFTPPROFTPD_USER
2025/03/22 06:21:55 DEBUG : Setting pass="qBDOB7N4Nk3bjunblZOFYStheCGgNwjUA50eoaEMiOcYFA" for "TestFTPProftpd" from environment variable RCLONE_CONFIG_TESTFTPPROFTPD_PASS
2025/03/22 06:21:55 DEBUG : Setting encoding="Asterisk,Ctl,Dot,Slash" for "TestFTPProftpd" from environment variable RCLONE_CONFIG_TESTFTPPROFTPD_ENCODING
2025/03/22 06:21:55 DEBUG : TestFTPProftpd: detected overridden config - adding "{jitBN}" suffix to name
2025/03/22 06:21:55 DEBUG : Setting host="172.17.0.3" for "TestFTPProftpd" from environment variable RCLONE_CONFIG_TESTFTPPROFTPD_HOST
2025/03/22 06:21:55 DEBUG : Setting user="rclone" for "TestFTPProftpd" from environment variable RCLONE_CONFIG_TESTFTPPROFTPD_USER
2025/03/22 06:21:55 DEBUG : Setting pass="qBDOB7N4Nk3bjunblZOFYStheCGgNwjUA50eoaEMiOcYFA" for "TestFTPProftpd" from environment variable RCLONE_CONFIG_TESTFTPPROFTPD_PASS
2025/03/22 06:21:55 DEBUG : Setting encoding="Asterisk,Ctl,Dot,Slash" for "TestFTPProftpd" from environment variable RCLONE_CONFIG_TESTFTPPROFTPD_ENCODING
2025/03/22 06:21:55 DEBUG : ftp://172.17.0.3:21/rclone-test-lecevix6pomu: Connecting to FTP server
2025/03/22 06:21:55 DEBUG : ftp://172.17.0.3:21/rclone-test-lecevix6pomu: dial("tcp","172.17.0.3:21")
2025/03/22 06:21:55 DEBUG : ftp://172.17.0.3:21/rclone-test-lecevix6pomu: > dial: conn=*fshttp.timeoutConn, err=<nil>
2025/03/22 06:21:55 NOTICE: remote: TestFTPProftpd:rclone-test-lecevix6pomu
=== RUN   TestBisyncRemoteLocal/changes
2025/03/22 06:21:55 DEBUG : Creating backend with remote "TestFTPProftpd:rclone-test-lecevix6pomu/062155cu"
2025/03/22 06:21:55 DEBUG : Using config file from "/home/rclone/.rclone.conf"
2025/03/22 06:21:55 DEBUG : Setting type="ftp" for "TestFTPProftpd" from environment variable RCLONE_CONFIG_TESTFTPPROFTPD_TYPE
2025/03/22 06:21:55 DEBUG : Setting host="172.17.0.3" for "TestFTPProftpd" from environment variable RCLONE_CONFIG_TESTFTPPROFTPD_HOST
2025/03/22 06:21:55 DEBUG : Setting user="rclone" for "TestFTPProftpd" from environment variable RCLONE_CONFIG_TESTFTPPROFTPD_USER
2025/03/22 06:21:55 DEBUG : Setting pass="qBDOB7N4Nk3bjunblZOFYStheCGgNwjUA50eoaEMiOcYFA" for "TestFTPProftpd" from environment variable RCLONE_CONFIG_TESTFTPPROFTPD_PASS
2025/03/22 06:21:55 DEBUG : Setting encoding="Asterisk,Ctl,Dot,Slash" for "TestFTPProftpd" from environment variable RCLONE_CONFIG_TESTFTPPROFTPD_ENCODING
2025/03/22 06:21:55 DEBUG : TestFTPProftpd: detected overridden config - adding "{jitBN}" suffix to name
2025/03/22 06:21:55 DEBUG : Setting host="172.17.0.3" for "TestFTPProftpd" from environment variable RCLONE_CONFIG_TESTFTPPROFTPD_HOST
2025/03/22 06:21:55 DEBUG : Setting user="rclone" for "TestFTPProftpd" from environment variable RCLONE_CONFIG_TESTFTPPROFTPD_USER
2025/03/22 06:21:55 DEBUG : Setting pass="qBDOB7N4Nk3bjunblZOFYStheCGgNwjUA50eoaEMiOcYFA" for "TestFTPProftpd" from environment variable RCLONE_CONFIG_TESTFTPPROFTPD_PASS
2025/03/22 06:21:55 DEBUG : Setting encoding="Asterisk,Ctl,Dot,Slash" for "TestFTPProftpd" from environment variable RCLONE_CONFIG_TESTFTPPROFTPD_ENCODING
2025/03/22 06:21:55 DEBUG : ftp://172.17.0.3:21/rclone-test-lecevix6pomu/062155cu: Connecting to FTP server
2025/03/22 06:21:55 DEBUG : ftp://172.17.0.3:21/rclone-test-lecevix6pomu/062155cu: dial("tcp","172.17.0.3:21")
2025/03/22 06:21:55 DEBUG : ftp://172.17.0.3:21/rclone-test-lecevix6pomu/062155cu: > dial: conn=*fshttp.timeoutConn, err=<nil>
2025/03/22 06:21:55 DEBUG : fs cache: renaming cache item "TestFTPProftpd:rclone-test-lecevix6pomu/062155cu" to be canonical "TestFTPProftpd{jitBN}:rclone-test-lecevix6pomu/062155cu"
2025/03/22 06:21:55 INFO  : path1: Making directory
2025/03/22 06:21:55 DEBUG : Creating backend with remote "TestFTPProftpd:rclone-test-lecevix6pomu/062155cu/changes/path1"
2025/03/22 06:21:55 DEBUG : Setting type="ftp" for "TestFTPProftpd" from environment variable RCLONE_CONFIG_TESTFTPPROFTPD_TYPE
2025/03/22 06:21:55 DEBUG : Setting host="172.17.0.3" for "TestFTPProftpd" from environment variable RCLONE_CONFIG_TESTFTPPROFTPD_HOST
2025/03/22 06:21:55 DEBUG : Setting user="rclone" for "TestFTPProftpd" from environment variable RCLONE_CONFIG_TESTFTPPROFTPD_USER
2025/03/22 06:21:55 DEBUG : Setting pass="qBDOB7N4Nk3bjunblZOFYStheCGgNwjUA50eoaEMiOcYFA" for "TestFTPProftpd" from environment variable RCLONE_CONFIG_TESTFTPPROFTPD_PASS
2025/03/22 06:21:55 DEBUG : Setting encoding="Asterisk,Ctl,Dot,Slash" for "TestFTPProftpd" from environment variable RCLONE_CONFIG_TESTFTPPROFTPD_ENCODING
2025/03/22 06:21:55 DEBUG : TestFTPProftpd: detected overridden config - adding "{jitBN}" suffix to name
2025/03/22 06:21:55 DEBUG : Setting host="172.17.0.3" for "TestFTPProftpd" from environment variable RCLONE_CONFIG_TESTFTPPROFTPD_HOST
2025/03/22 06:21:55 DEBUG : Setting user="rclone" for "TestFTPProftpd" from environment variable RCLONE_CONFIG_TESTFTPPROFTPD_USER
2025/03/22 06:21:55 DEBUG : Setting pass="qBDOB7N4Nk3bjunblZOFYStheCGgNwjUA50eoaEMiOcYFA" for "TestFTPProftpd" from environment variable RCLONE_CONFIG_TESTFTPPROFTPD_PASS
2025/03/22 06:21:55 DEBUG : Setting encoding="Asterisk,Ctl,Dot,Slash" for "TestFTPProftpd" from environment variable RCLONE_CONFIG_TESTFTPPROFTPD_ENCODING
2025/03/22 06:21:55 DEBUG : ftp://172.17.0.3:21/rclone-test-lecevix6pomu/062155cu/changes/path1: Connecting to FTP server
2025/03/22 06:21:55 DEBUG : ftp://172.17.0.3:21/rclone-test-lecevix6pomu/062155cu/changes/path1: dial("tcp","172.17.0.3:21")
2025/03/22 06:21:55 DEBUG : ftp://172.17.0.3:21/rclone-test-lecevix6pomu/062155cu/changes/path1: > dial: conn=*fshttp.timeoutConn, err=<nil>
2025/03/22 06:21:55 DEBUG : fs cache: renaming cache item "TestFTPProftpd:rclone-test-lecevix6pomu/062155cu/changes/path1" to be canonical "TestFTPProftpd{jitBN}:rclone-test-lecevix6pomu/062155cu/changes/path1"
2025/03/22 06:21:55 DEBUG : Creating backend with remote "/tmp/062155cu"
2025/03/22 06:21:55 DEBUG : Creating backend with remote "/tmp/062155cu/changes/path2"
2025/03/22 06:21:55 DEBUG : Creating backend with remote "/home/rclone/go/src/github.com/rclone/rclone/cmd/bisync/testdata/test_changes/initial"
2025/03/22 06:21:55 DEBUG : Creating backend with remote "/tmp/062155cu/initdir/test_changes-jobocuz9"
2025/03/22 06:21:55 DEBUG : RCLONE_TEST: Need to transfer - File not found at Destination
2025/03/22 06:21:55 DEBUG : file1.txt: Need to transfer - File not found at Destination
2025/03/22 06:21:55 DEBUG : file2.txt: Need to transfer - File not found at Destination
2025/03/22 06:21:55 DEBUG : file3.txt: Need to transfer - File not found at Destination
2025/03/22 06:21:55 DEBUG : file4.txt: Need to transfer - File not found at Destination
2025/03/22 06:21:55 DEBUG : file5.txt: Need to transfer - File not found at Destination
2025/03/22 06:21:55 DEBUG : file6.txt: Need to transfer - File not found at Destination
2025/03/22 06:21:55 DEBUG : file7.txt: Need to transfer - File not found at Destination
2025/03/22 06:21:55 DEBUG : file8.txt: Need to transfer - File not found at Destination
2025/03/22 06:21:55 DEBUG : file2.txt: md5 = d41d8cd98f00b204e9800998ecf8427e OK
2025/03/22 06:21:55 DEBUG : file2.txt.5028a97.partial: renamed to: file2.txt
2025/03/22 06:21:55 INFO  : file2.txt: Copied (new)
2025/03/22 06:21:55 DEBUG : file3.txt: md5 = d41d8cd98f00b204e9800998ecf8427e OK
2025/03/22 06:21:55 DEBUG : file3.txt.5028a97.partial: renamed to: file3.txt
2025/03/22 06:21:55 INFO  : file3.txt: Copied (new)
2025/03/22 06:21:55 DEBUG : Local file system at /tmp/062155cu/initdir/test_changes-jobocuz9: Waiting for checks to finish
2025/03/22 06:21:55 DEBUG : Local file system at /tmp/062155cu/initdir/test_changes-jobocuz9: Waiting for transfers to finish
2025/03/22 06:21:55 DEBUG : file5.txt: md5 = d41d8cd98f00b204e9800998ecf8427e OK
2025/03/22 06:21:55 DEBUG : file5.txt.5028a97.partial: renamed to: file5.txt
2025/03/22 06:21:55 INFO  : file5.txt: Copied (new)
2025/03/22 06:21:55 DEBUG : file4.txt: md5 = d41d8cd98f00b204e9800998ecf8427e OK
2025/03/22 06:21:55 DEBUG : file4.txt.5028a97.partial: renamed to: file4.txt
2025/03/22 06:21:55 INFO  : file4.txt: Copied (new)
2025/03/22 06:21:55 DEBUG : file6.txt: md5 = d41d8cd98f00b204e9800998ecf8427e OK
2025/03/22 06:21:55 DEBUG : file6.txt.5028a97.partial: renamed to: file6.txt
2025/03/22 06:21:55 INFO  : file6.txt: Copied (new)
2025/03/22 06:21:55 DEBUG : file7.txt: md5 = d41d8cd98f00b204e9800998ecf8427e OK
2025/03/22 06:21:55 DEBUG : file8.txt: md5 = d41d8cd98f00b204e9800998ecf8427e OK
2025/03/22 06:21:55 DEBUG : file8.txt.5028a97.partial: renamed to: file8.txt
2025/03/22 06:21:55 INFO  : file8.txt: Copied (new)
2025/03/22 06:21:55 DEBUG : file7.txt.5028a97.partial: renamed to: file7.txt
2025/03/22 06:21:55 INFO  : file7.txt: Copied (new)
2025/03/22 06:21:55 DEBUG : RCLONE_TEST: md5 = 294d25b294ff26a5243dba914ac3fbf7 OK
2025/03/22 06:21:55 DEBUG : RCLONE_TEST.cf9a93ac.partial: renamed to: RCLONE_TEST
2025/03/22 06:21:55 INFO  : RCLONE_TEST: Copied (new)
2025/03/22 06:21:55 DEBUG : file1.txt: md5 = d41d8cd98f00b204e9800998ecf8427e OK
2025/03/22 06:21:55 DEBUG : file1.txt.5028a97.partial: renamed to: file1.txt
2025/03/22 06:21:55 INFO  : file1.txt: Copied (new)
2025/03/22 06:21:55 DEBUG : Creating backend with remote "/home/rclone/go/src/github.com/rclone/rclone/cmd/bisync/testdata/test_changes/modfiles"
2025/03/22 06:21:55 DEBUG : Creating backend with remote "/tmp/062155cu/datadir/test_changes-quhizoq7"
2025/03/22 06:21:55 DEBUG : file1.txt: Need to transfer - File not found at Destination
2025/03/22 06:21:55 DEBUG : file10.txt: Need to transfer - File not found at Destination
2025/03/22 06:21:55 DEBUG : file11.txt: Need to transfer - File not found at Destination
2025/03/22 06:21:55 DEBUG : file2.txt: Need to transfer - File not found at Destination
2025/03/22 06:21:55 DEBUG : file5L.txt: Need to transfer - File not found at Destination
2025/03/22 06:21:55 DEBUG : file5R.txt: Need to transfer - File not found at Destination
2025/03/22 06:21:55 DEBUG : file6.txt: Need to transfer - File not found at Destination
2025/03/22 06:21:55 DEBUG : file7.txt: Need to transfer - File not found at Destination
2025/03/22 06:21:55 DEBUG : Local file system at /tmp/062155cu/datadir/test_changes-quhizoq7: Waiting for checks to finish
2025/03/22 06:21:55 DEBUG : Local file system at /tmp/062155cu/datadir/test_changes-quhizoq7: Waiting for transfers to finish
2025/03/22 06:21:55 DEBUG : file1.txt: md5 = 7fe98ed88552b828777d8630900346b8 OK
2025/03/22 06:21:55 DEBUG : file1.txt.925c801f.partial: renamed to: file1.txt
2025/03/22 06:21:55 INFO  : file1.txt: Copied (new)
2025/03/22 06:21:55 DEBUG : file11.txt: md5 = 7fe98ed88552b828777d8630900346b8 OK
2025/03/22 06:21:55 DEBUG : file11.txt.925c801f.partial: renamed to: file11.txt
2025/03/22 06:21:55 INFO  : file11.txt: Copied (new)
2025/03/22 06:21:55 DEBUG : file10.txt: md5 = 7fe98ed88552b828777d8630900346b8 OK
2025/03/22 06:21:55 DEBUG : file2.txt: md5 = fb3ecfb2800400fb01b0bfd39903e9fb OK
2025/03/22 06:21:55 DEBUG : file10.txt.925c801f.partial: renamed to: file10.txt
2025/03/22 06:21:55 INFO  : file10.txt: Copied (new)
2025/03/22 06:21:55 DEBUG : file2.txt.f8ac1735.partial: renamed to: file2.txt
2025/03/22 06:21:55 DEBUG : file5L.txt: md5 = 0860a03592626642f8fd6c8bfb447d2a OK
2025/03/22 06:21:55 DEBUG : file5L.txt.c32cc336.partial: renamed to: file5L.txt
2025/03/22 06:21:55 INFO  : file5L.txt: Copied (new)
2025/03/22 06:21:55 INFO  : file2.txt: Copied (new)
2025/03/22 06:21:55 DEBUG : file5R.txt: md5 = 979a803b15d27df0c31ad7d29006d10b OK
2025/03/22 06:21:55 DEBUG : file5R.txt.aa998d0a.partial: renamed to: file5R.txt
2025/03/22 06:21:55 INFO  : file5R.txt: Copied (new)
2025/03/22 06:21:55 DEBUG : file6.txt: md5 = 7fe98ed88552b828777d8630900346b8 OK
2025/03/22 06:21:55 DEBUG : file7.txt: md5 = 7fe98ed88552b828777d8630900346b8 OK
2025/03/22 06:21:55 DEBUG : file7.txt.925c801f.partial: renamed to: file7.txt
2025/03/22 06:21:55 DEBUG : file6.txt.925c801f.partial: renamed to: file6.txt
2025/03/22 06:21:55 INFO  : file6.txt: Copied (new)
2025/03/22 06:21:55 INFO  : file7.txt: Copied (new)
2025/03/22 06:21:55 DEBUG : ftp://172.17.0.3:21/rclone-test-lecevix6pomu/062155cu/changes/path1: dial("tcp","172.17.0.3:30179")
2025/03/22 06:21:55 DEBUG : ftp://172.17.0.3:21/rclone-test-lecevix6pomu/062155cu/changes/path1: > dial: conn=*fshttp.timeoutConn, err=<nil>
2025/03/22 06:21:55 ERROR : : error listing: directory not found
2025/03/22 06:21:55 ERROR : : error listing: directory not found
2025/03/22 06:21:55 NOTICE: checking initFs Local file system at /tmp/062155cu/initdir/test_changes-jobocuz9
2025/03/22 06:21:55 DEBUG : ftp://172.17.0.3:21/rclone-test-lecevix6pomu/062155cu/changes/path1: dial("tcp","172.17.0.3:61416")
2025/03/22 06:21:55 DEBUG : ftp://172.17.0.3:21/rclone-test-lecevix6pomu/062155cu/changes/path1: > dial: conn=*fshttp.timeoutConn, err=<nil>
2025/03/22 06:21:55 DEBUG : RCLONE_TEST: Need to transfer - File not found at Destination
2025/03/22 06:21:55 DEBUG : file1.txt: Need to transfer - File not found at Destination
2025/03/22 06:21:55 DEBUG : file2.txt: Need to transfer - File not found at Destination
2025/03/22 06:21:55 DEBUG : file3.txt: Need to transfer - File not found at Destination
2025/03/22 06:21:55 DEBUG : file4.txt: Need to transfer - File not found at Destination
2025/03/22 06:21:55 DEBUG : file5.txt: Need to transfer - File not found at Destination
2025/03/22 06:21:55 DEBUG : file6.txt: Need to transfer - File not found at Destination
2025/03/22 06:21:55 DEBUG : file7.txt: Need to transfer - File not found at Destination
2025/03/22 06:21:55 DEBUG : file8.txt: Need to transfer - File not found at Destination
2025/03/22 06:21:55 DEBUG : ftp://172.17.0.3:21/rclone-test-lecevix6pomu/062155cu/changes/path1: Waiting for checks to finish
2025/03/22 06:21:55 DEBUG : ftp://172.17.0.3:21/rclone-test-lecevix6pomu/062155cu/changes/path1: Connecting to FTP server
2025/03/22 06:21:55 DEBUG : ftp://172.17.0.3:21/rclone-test-lecevix6pomu/062155cu/changes/path1: dial("tcp","172.17.0.3:21")
2025/03/22 06:21:55 DEBUG : ftp://172.17.0.3:21/rclone-test-lecevix6pomu/062155cu/changes/path1: Connecting to FTP server
2025/03/22 06:21:55 DEBUG : ftp://172.17.0.3:21/rclone-test-lecevix6pomu/062155cu/changes/path1: Waiting for transfers to finish
2025/03/22 06:21:55 DEBUG : ftp://172.17.0.3:21/rclone-test-lecevix6pomu/062155cu/changes/path1: Connecting to FTP server
2025/03/22 06:21:55 DEBUG : ftp://172.17.0.3:21/rclone-test-lecevix6pomu/062155cu/changes/path1: > dial: conn=*fshttp.timeoutConn, err=<nil>
2025/03/22 06:21:55 DEBUG : ftp://172.17.0.3:21/rclone-test-lecevix6pomu/062155cu/changes/path1: dial("tcp","172.17.0.3:48975")
2025/03/22 06:21:55 DEBUG : ftp://172.17.0.3:21/rclone-test-lecevix6pomu/062155cu/changes/path1: > dial: conn=*fshttp.timeoutConn, err=<nil>
2025/03/22 06:21:55 DEBUG : ftp://172.17.0.3:21/rclone-test-lecevix6pomu/062155cu/changes/path1: dial("tcp","172.17.0.3:12453")
2025/03/22 06:21:55 DEBUG : ftp://172.17.0.3:21/rclone-test-lecevix6pomu/062155cu/changes/path1: > dial: conn=*fshttp.timeoutConn, err=<nil>
2025/03/22 06:21:55 DEBUG : ftp://172.17.0.3:21/rclone-test-lecevix6pomu/062155cu/changes/path1: dial("tcp","172.17.0.3:21")
2025/03/22 06:21:55 DEBUG : ftp://172.17.0.3:21/rclone-test-lecevix6pomu/062155cu/changes/path1: > dial: conn=*fshttp.timeoutConn, err=<nil>
2025/03/22 06:21:55 DEBUG : RCLONE_TEST.cf9a93ac.partial: renamed to: RCLONE_TEST
2025/03/22 06:21:55 INFO  : RCLONE_TEST: Copied (new)
2025/03/22 06:21:55 DEBUG : ftp://172.17.0.3:21/rclone-test-lecevix6pomu/062155cu/changes/path1: dial("tcp","172.17.0.3:52395")
2025/03/22 06:21:55 DEBUG : ftp://172.17.0.3:21/rclone-test-lecevix6pomu/062155cu/changes/path1: > dial: conn=*fshttp.timeoutConn, err=<nil>
2025/03/22 06:21:55 DEBUG : file1.txt.5028a97.partial: renamed to: file1.txt
2025/03/22 06:21:55 INFO  : file1.txt: Copied (new)
2025/03/22 06:21:55 DEBUG : ftp://172.17.0.3:21/rclone-test-lecevix6pomu/062155cu/changes/path1: dial("tcp","172.17.0.3:55451")
2025/03/22 06:21:55 DEBUG : ftp://172.17.0.3:21/rclone-test-lecevix6pomu/062155cu/changes/path1: > dial: conn=*fshttp.timeoutConn, err=<nil>
2025/03/22 06:21:55 DEBUG : file4.txt.5028a97.partial: renamed to: file4.txt
2025/03/22 06:21:55 INFO  : file4.txt: Copied (new)
2025/03/22 06:21:55 DEBUG : ftp://172.17.0.3:21/rclone-test-lecevix6pomu/062155cu/changes/path1: dial("tcp","172.17.0.3:4824")
2025/03/22 06:21:55 DEBUG : ftp://172.17.0.3:21/rclone-test-lecevix6pomu/062155cu/changes/path1: > dial: conn=*fshttp.timeoutConn, err=<nil>
2025/03/22 06:21:55 DEBUG : file5.txt.5028a97.partial: renamed to: file5.txt
2025/03/22 06:21:55 INFO  : file5.txt: Copied (new)
2025/03/22 06:21:55 DEBUG : ftp://172.17.0.3:21/rclone-test-lecevix6pomu/062155cu/changes/path1: dial("tcp","172.17.0.3:13236")
2025/03/22 06:21:55 DEBUG : ftp://172.17.0.3:21/rclone-test-lecevix6pomu/062155cu/changes/path1: > dial: conn=*fshttp.timeoutConn, err=<nil>
2025/03/22 06:21:55 DEBUG : file6.txt.5028a97.partial: renamed to: file6.txt
2025/03/22 06:21:55 INFO  : file6.txt: Copied (new)
2025/03/22 06:21:55 DEBUG : ftp://172.17.0.3:21/rclone-test-lecevix6pomu/062155cu/changes/path1: dial("tcp","172.17.0.3:21")
2025/03/22 06:21:55 DEBUG : ftp://172.17.0.3:21/rclone-test-lecevix6pomu/062155cu/changes/path1: > dial: conn=*fshttp.timeoutConn, err=<nil>
2025/03/22 06:21:55 DEBUG : ftp://172.17.0.3:21/rclone-test-lecevix6pomu/062155cu/changes/path1: dial("tcp","172.17.0.3:51379")
2025/03/22 06:21:55 DEBUG : ftp://172.17.0.3:21/rclone-test-lecevix6pomu/062155cu/changes/path1: > dial: conn=*fshttp.timeoutConn, err=<nil>
2025/03/22 06:21:55 DEBUG : ftp://172.17.0.3:21/rclone-test-lecevix6pomu/062155cu/changes/path1: dial("tcp","172.17.0.3:32892")
2025/03/22 06:21:55 DEBUG : ftp://172.17.0.3:21/rclone-test-lecevix6pomu/062155cu/changes/path1: > dial: conn=*fshttp.timeoutConn, err=<nil>
2025/03/22 06:21:55 DEBUG : file7.txt.5028a97.partial: renamed to: file7.txt
2025/03/22 06:21:55 INFO  : file7.txt: Copied (new)
2025/03/22 06:21:55 DEBUG : file8.txt.5028a97.partial: renamed to: file8.txt
2025/03/22 06:21:55 INFO  : file8.txt: Copied (new)
2025/03/22 06:21:55 DEBUG : file2.txt.5028a97.partial: renamed to: file2.txt
2025/03/22 06:21:55 INFO  : file2.txt: Copied (new)
2025/03/22 06:21:55 DEBUG : ftp://172.17.0.3:21/rclone-test-lecevix6pomu/062155cu/changes/path1: dial("tcp","172.17.0.3:19537")
2025/03/22 06:21:55 DEBUG : ftp://172.17.0.3:21/rclone-test-lecevix6pomu/062155cu/changes/path1: > dial: conn=*fshttp.timeoutConn, err=<nil>
2025/03/22 06:21:55 DEBUG : file3.txt.5028a97.partial: renamed to: file3.txt
2025/03/22 06:21:55 INFO  : file3.txt: Copied (new)
2025/03/22 06:21:55 NOTICE: checking Path1 ftp://172.17.0.3:21/rclone-test-lecevix6pomu/062155cu/changes/path1
2025/03/22 06:21:55 DEBUG : ftp://172.17.0.3:21/rclone-test-lecevix6pomu/062155cu/changes/path1: dial("tcp","172.17.0.3:64402")
2025/03/22 06:21:55 DEBUG : ftp://172.17.0.3:21/rclone-test-lecevix6pomu/062155cu/changes/path1: > dial: conn=*fshttp.timeoutConn, err=<nil>
2025/03/22 06:21:55 DEBUG : RCLONE_TEST: Need to transfer - File not found at Destination
2025/03/22 06:21:55 DEBUG : file1.txt: Need to transfer - File not found at Destination
2025/03/22 06:21:55 DEBUG : file2.txt: Need to transfer - File not found at Destination
2025/03/22 06:21:55 DEBUG : file3.txt: Need to transfer - File not found at Destination
2025/03/22 06:21:55 DEBUG : file4.txt: Need to transfer - File not found at Destination
2025/03/22 06:21:55 DEBUG : file5.txt: Need to transfer - File not found at Destination
2025/03/22 06:21:55 DEBUG : file6.txt: Need to transfer - File not found at Destination
2025/03/22 06:21:55 DEBUG : file7.txt: Need to transfer - File not found at Destination
2025/03/22 06:21:55 DEBUG : file8.txt: Need to transfer - File not found at Destination
2025/03/22 06:21:55 DEBUG : file1.txt: md5 = d41d8cd98f00b204e9800998ecf8427e OK
2025/03/22 06:21:55 DEBUG : file1.txt.5028a97.partial: renamed to: file1.txt
2025/03/22 06:21:55 INFO  : file1.txt: Copied (new)
2025/03/22 06:21:55 DEBUG : Local file system at /tmp/062155cu/changes/path2: Waiting for checks to finish
2025/03/22 06:21:55 DEBUG : file2.txt: md5 = d41d8cd98f00b204e9800998ecf8427e OK
2025/03/22 06:21:55 DEBUG : file2.txt.5028a97.partial: renamed to: file2.txt
2025/03/22 06:21:55 INFO  : file2.txt: Copied (new)
2025/03/22 06:21:55 DEBUG : file3.txt: md5 = d41d8cd98f00b204e9800998ecf8427e OK
2025/03/22 06:21:55 DEBUG : file3.txt.5028a97.partial: renamed to: file3.txt
2025/03/22 06:21:55 INFO  : file3.txt: Copied (new)
2025/03/22 06:21:55 DEBUG : Local file system at /tmp/062155cu/changes/path2: Waiting for transfers to finish
2025/03/22 06:21:55 DEBUG : file5.txt: md5 = d41d8cd98f00b204e9800998ecf8427e OK
2025/03/22 06:21:55 DEBUG : file5.txt.5028a97.partial: renamed to: file5.txt
2025/03/22 06:21:55 INFO  : file5.txt: Copied (new)
2025/03/22 06:21:55 DEBUG : file6.txt: md5 = d41d8cd98f00b204e9800998ecf8427e OK
2025/03/22 06:21:55 DEBUG : file4.txt: md5 = d41d8cd98f00b204e9800998ecf8427e OK
2025/03/22 06:21:55 DEBUG : file7.txt: md5 = d41d8cd98f00b204e9800998ecf8427e OK
2025/03/22 06:21:55 DEBUG : file6.txt.5028a97.partial: renamed to: file6.txt
2025/03/22 06:21:55 INFO  : file6.txt: Copied (new)
2025/03/22 06:21:55 DEBUG : file7.txt.5028a97.partial: renamed to: file7.txt
2025/03/22 06:21:55 INFO  : file7.txt: Copied (new)
2025/03/22 06:21:55 DEBUG : file8.txt: md5 = d41d8cd98f00b204e9800998ecf8427e OK
2025/03/22 06:21:55 DEBUG : RCLONE_TEST: md5 = 294d25b294ff26a5243dba914ac3fbf7 OK
2025/03/22 06:21:55 DEBUG : file8.txt.5028a97.partial: renamed to: file8.txt
2025/03/22 06:21:55 INFO  : file8.txt: Copied (new)
2025/03/22 06:21:55 DEBUG : RCLONE_TEST.cf9a93ac.partial: renamed to: RCLONE_TEST
2025/03/22 06:21:55 DEBUG : file4.txt.5028a97.partial: renamed to: file4.txt
2025/03/22 06:21:55 INFO  : RCLONE_TEST: Copied (new)
2025/03/22 06:21:55 INFO  : file4.txt: Copied (new)
2025/03/22 06:21:55 NOTICE: checking path2 Local file system at /tmp/062155cu/changes/path2
2025/03/22 06:21:55 NOTICE: (01)  : test changes
2025/03/22 06:21:55 NOTICE: (02)  : test initial bisync
2025/03/22 06:21:55 NOTICE: (03)  : bisync resync
2025/03/22 06:21:55 INFO  : Setting --ignore-listing-checksum as neither --checksum nor --compare checksum are set.
2025/03/22 06:21:55 INFO  : Bisyncing with Comparison Settings: 
{
	"Modtime": true,
	"Size": true,
	"Checksum": false,
	"HashType1": 0,
	"HashType2": 0,
	"NoSlowHash": false,
	"SlowHashSyncOnly": false,
	"SlowHashDetected": true,
	"DownloadHash": false
}
2025/03/22 06:21:55 INFO  : Synching Path1 "TestFTPProftpd{jitBN}:rclone-test-lecevix6pomu/062155cu/changes/path1/" with Path2 "/tmp/062155cu/changes/path2/"
2025/03/22 06:21:55 INFO  : Copying Path2 files to Path1
2025/03/22 06:21:55 INFO  : - Path2    Resync is copying files to         - Path1
2025/03/22 06:21:55 INFO  : - Path1    Resync is copying files to         - Path2
2025/03/22 06:21:55 INFO  : Resync updating listings
2025/03/22 06:21:55 INFO  : Validating listings for Path1 "TestFTPProftpd{jitBN}:rclone-test-lecevix6pomu/062155cu/changes/path1/" vs Path2 "/tmp/062155cu/changes/path2/"
2025/03/22 06:21:55 INFO  : Bisync successful
2025/03/22 06:21:55 NOTICE: (04)  : test make modifications on both paths
2025/03/22 06:21:55 NOTICE: (05)  : test new on path2 - file10
2025/03/22 06:21:55 NOTICE: (06)  : touch-copy 2001-01-02 /tmp/062155cu/datadir/test_changes-quhizoq7/file10.txt /tmp/062155cu/changes/path2/
2025/03/22 06:21:55 INFO  : file10.txt: Copied (new)
2025/03/22 06:21:55 NOTICE: (07)  : test newer on path2 - file1
2025/03/22 06:21:55 NOTICE: (08)  : touch-copy 2001-01-02 /tmp/062155cu/datadir/test_changes-quhizoq7/file1.txt /tmp/062155cu/changes/path2/
2025/03/22 06:21:55 INFO  : file1.txt: Copied (replaced existing)
2025/03/22 06:21:55 NOTICE: (09)  : test new on path1 - file11
2025/03/22 06:21:55 NOTICE: (10)  : touch-copy 2001-01-02 /tmp/062155cu/datadir/test_changes-quhizoq7/file11.txt TestFTPProftpd,encoding='Asterisk,Ctl,Dot,Slash',host='172.17.0.3',pass='qBDOB7N4Nk3bjunblZOFYStheCGgNwjUA50eoaEMiOcYFA',user='rclone':rclone-test-lecevix6pomu/062155cu/changes/path1/
2025/03/22 06:21:55 INFO  : file11.txt: Copied (new)
2025/03/22 06:21:55 NOTICE: (11)  : test newer on path1 - file2
2025/03/22 06:21:55 NOTICE: (12)  : touch-copy 2001-01-02 /tmp/062155cu/datadir/test_changes-quhizoq7/file2.txt TestFTPProftpd,encoding='Asterisk,Ctl,Dot,Slash',host='172.17.0.3',pass='qBDOB7N4Nk3bjunblZOFYStheCGgNwjUA50eoaEMiOcYFA',user='rclone':rclone-test-lecevix6pomu/062155cu/changes/path1/
2025/03/22 06:21:56 INFO  : file2.txt: Copied (replaced existing)
2025/03/22 06:21:56 NOTICE: (13)  : test deleted on path2 - file3
2025/03/22 06:21:56 NOTICE: (14)  : delete-file /tmp/062155cu/changes/path2/file3.txt
2025/03/22 06:21:56 INFO  : file3.txt: Deleted
2025/03/22 06:21:56 NOTICE: (15)  : test deleted on path1 - file4
2025/03/22 06:21:56 NOTICE: (16)  : delete-file TestFTPProftpd,encoding='Asterisk,Ctl,Dot,Slash',host='172.17.0.3',pass='qBDOB7N4Nk3bjunblZOFYStheCGgNwjUA50eoaEMiOcYFA',user='rclone':rclone-test-lecevix6pomu/062155cu/changes/path1/file4.txt
2025/03/22 06:21:56 INFO  : file4.txt: Deleted
2025/03/22 06:21:56 NOTICE: (17)  : test deleted on both paths - file8
2025/03/22 06:21:56 NOTICE: (18)  : delete-file TestFTPProftpd,encoding='Asterisk,Ctl,Dot,Slash',host='172.17.0.3',pass='qBDOB7N4Nk3bjunblZOFYStheCGgNwjUA50eoaEMiOcYFA',user='rclone':rclone-test-lecevix6pomu/062155cu/changes/path1/file8.txt
2025/03/22 06:21:56 INFO  : file8.txt: Deleted
2025/03/22 06:21:56 NOTICE: (19)  : delete-file /tmp/062155cu/changes/path2/file8.txt
2025/03/22 06:21:56 INFO  : file8.txt: Deleted
2025/03/22 06:21:56 NOTICE: (20)  : test changed on both paths - file5 (file5R, file5L)
2025/03/22 06:21:56 NOTICE: (21)  : touch-glob 2001-01-02 /tmp/062155cu/datadir/test_changes-quhizoq7/ file5R.txt
2025/03/22 06:21:56 NOTICE: (22)  : copy-as /tmp/062155cu/datadir/test_changes-quhizoq7/file5R.txt /tmp/062155cu/changes/path2/ file5.txt
2025/03/22 06:21:56 INFO  : file5R.txt: Copied (replaced existing) to: file5.txt
2025/03/22 06:21:56 NOTICE: (23)  : touch-glob 2001-03-04 /tmp/062155cu/datadir/test_changes-quhizoq7/ file5L.txt
2025/03/22 06:21:56 NOTICE: (24)  : copy-as /tmp/062155cu/datadir/test_changes-quhizoq7/file5L.txt TestFTPProftpd,encoding='Asterisk,Ctl,Dot,Slash',host='172.17.0.3',pass='qBDOB7N4Nk3bjunblZOFYStheCGgNwjUA50eoaEMiOcYFA',user='rclone':rclone-test-lecevix6pomu/062155cu/changes/path1/ file5.txt
2025/03/22 06:21:56 INFO  : file5L.txt: Copied (replaced existing) to: file5.txt
2025/03/22 06:21:56 NOTICE: (25)  : test newer on path2 and deleted on path1 - file6
2025/03/22 06:21:56 NOTICE: (26)  : touch-copy 2001-01-02 /tmp/062155cu/datadir/test_changes-quhizoq7/file6.txt /tmp/062155cu/changes/path2/
2025/03/22 06:21:56 INFO  : file6.txt: Copied (replaced existing)
2025/03/22 06:21:56 NOTICE: (27)  : delete-file TestFTPProftpd,encoding='Asterisk,Ctl,Dot,Slash',host='172.17.0.3',pass='qBDOB7N4Nk3bjunblZOFYStheCGgNwjUA50eoaEMiOcYFA',user='rclone':rclone-test-lecevix6pomu/062155cu/changes/path1/file6.txt
2025/03/22 06:21:56 INFO  : file6.txt: Deleted
2025/03/22 06:21:56 NOTICE: (28)  : test newer on path1 and deleted on path2 - file7
2025/03/22 06:21:56 NOTICE: (29)  : touch-copy 2001-01-02 /tmp/062155cu/datadir/test_changes-quhizoq7/file7.txt TestFTPProftpd,encoding='Asterisk,Ctl,Dot,Slash',host='172.17.0.3',pass='qBDOB7N4Nk3bjunblZOFYStheCGgNwjUA50eoaEMiOcYFA',user='rclone':rclone-test-lecevix6pomu/062155cu/changes/path1/
2025/03/22 06:21:56 INFO  : file7.txt: Copied (replaced existing)
2025/03/22 06:21:56 NOTICE: (30)  : delete-file /tmp/062155cu/changes/path2/file7.txt
2025/03/22 06:21:56 INFO  : file7.txt: Deleted
2025/03/22 06:21:56 NOTICE: (31)  : test bisync run
2025/03/22 06:21:56 NOTICE: (32)  : bisync
2025/03/22 06:21:56 INFO  : Setting --ignore-listing-checksum as neither --checksum nor --compare checksum are set.
2025/03/22 06:21:56 INFO  : Bisyncing with Comparison Settings: 
{
	"Modtime": true,
	"Size": true,
	"Checksum": false,
	"HashType1": 0,
	"HashType2": 0,
	"NoSlowHash": false,
	"SlowHashSyncOnly": false,
	"SlowHashDetected": true,
	"DownloadHash": false
}
2025/03/22 06:21:56 INFO  : Synching Path1 "TestFTPProftpd{jitBN}:rclone-test-lecevix6pomu/062155cu/changes/path1/" with Path2 "/tmp/062155cu/changes/path2/"
2025/03/22 06:21:56 INFO  : Building Path1 and Path2 listings
2025/03/22 06:21:56 INFO  : Path1 checking for diffs
2025/03/22 06:21:56 INFO  : - Path1    File changed: size (larger), time (newer) - file2.txt
2025/03/22 06:21:56 INFO  : - Path1    File was deleted          - file4.txt
2025/03/22 06:21:56 INFO  : - Path1    File changed: size (larger), time (newer) - file5.txt
2025/03/22 06:21:56 INFO  : - Path1    File was deleted          - file6.txt
2025/03/22 06:21:56 INFO  : - Path1    File changed: size (larger), time (newer) - file7.txt
2025/03/22 06:21:56 INFO  : - Path1    File was deleted          - file8.txt
2025/03/22 06:21:56 INFO  : - Path1    File is new               - file11.txt
2025/03/22 06:21:56 INFO  : Path1:    7 changes:    1 new,    3 modified,    3 deleted
2025/03/22 06:21:56 INFO  : (Modified:    3 newer,    0 older,    3 larger,    0 smaller)
2025/03/22 06:21:56 INFO  : Path2 checking for diffs
2025/03/22 06:21:56 INFO  : - Path2    File changed: size (larger), time (newer) - file1.txt
2025/03/22 06:21:56 INFO  : - Path2    File was deleted          - file3.txt
2025/03/22 06:21:56 INFO  : - Path2    File changed: size (larger), time (newer) - file5.txt
2025/03/22 06:21:56 INFO  : - Path2    File changed: size (larger), time (newer) - file6.txt
2025/03/22 06:21:56 INFO  : - Path2    File was deleted          - file7.txt
2025/03/22 06:21:56 INFO  : - Path2    File was deleted          - file8.txt
2025/03/22 06:21:56 INFO  : - Path2    File is new               - file10.txt
2025/03/22 06:21:56 INFO  : Path2:    7 changes:    1 new,    3 modified,    3 deleted
2025/03/22 06:21:56 INFO  : (Modified:    3 newer,    0 older,    3 larger,    0 smaller)
2025/03/22 06:21:56 INFO  : Applying changes
2025/03/22 06:21:56 INFO  : Can't compare hashes, so using check --download for safety. (Use --size-only or --ignore-checksum to disable)
2025/03/22 06:21:56 INFO  : Checking potential conflicts...
2025/03/22 06:21:56 NOTICE: Local file system at /tmp/062155cu/changes/path2: 1 differences found
2025/03/22 06:21:56 NOTICE: Local file system at /tmp/062155cu/changes/path2: 1 errors while checking
2025/03/22 06:21:56 INFO  : Finished checking the potential conflicts. 1 differences found
2025/03/22 06:21:56 INFO  : - Path1    Queue copy to Path2       - /tmp/062155cu/changes/path2/file11.txt
2025/03/22 06:21:56 INFO  : - Path1    Queue copy to Path2       - /tmp/062155cu/changes/path2/file2.txt
2025/03/22 06:21:56 INFO  : - Path2    Queue delete              - /tmp/062155cu/changes/path2/file4.txt
2025/03/22 06:21:56 NOTICE: - WARNING  New or changed in both paths       - file5.txt
2025/03/22 06:21:56 NOTICE: - Path1    Renaming Path1 copy                - TestFTPProftpd{jitBN}:rclone-test-lecevix6pomu/062155cu/changes/path1/file5.txt.conflict1
2025/03/22 06:21:56 INFO  : file5.txt: Moved (server-side) to: file5.txt.conflict1
2025/03/22 06:21:56 NOTICE: - Path1    Queue copy to Path2       - /tmp/062155cu/changes/path2/file5.txt.conflict1
2025/03/22 06:21:56 NOTICE: - Path2    Renaming Path2 copy                - /tmp/062155cu/changes/path2/file5.txt.conflict2
2025/03/22 06:21:56 INFO  : file5.txt: Moved (server-side) to: file5.txt.conflict2
2025/03/22 06:21:56 NOTICE: - Path2    Queue copy to Path1       - TestFTPProftpd{jitBN}:rclone-test-lecevix6pomu/062155cu/changes/path1/file5.txt.conflict2
2025/03/22 06:21:56 INFO  : - Path2    Queue copy to Path1       - TestFTPProftpd{jitBN}:rclone-test-lecevix6pomu/062155cu/changes/path1/file6.txt
2025/03/22 06:21:56 INFO  : - Path1    Queue copy to Path2       - /tmp/062155cu/changes/path2/file7.txt
2025/03/22 06:21:56 INFO  : - Path2    Queue copy to Path1       - TestFTPProftpd{jitBN}:rclone-test-lecevix6pomu/062155cu/changes/path1/file1.txt
2025/03/22 06:21:56 INFO  : - Path2    Queue copy to Path1       - TestFTPProftpd{jitBN}:rclone-test-lecevix6pomu/062155cu/changes/path1/file10.txt
2025/03/22 06:21:56 INFO  : - Path1    Queue delete              - TestFTPProftpd{jitBN}:rclone-test-lecevix6pomu/062155cu/changes/path1/file3.txt
2025/03/22 06:21:56 INFO  : - Path2    Do queued copies to                - Path1
2025/03/22 06:21:56 INFO  : file5.txt.conflict2: Copied (new)
2025/03/22 06:21:56 INFO  : file1.txt: Copied (replaced existing)
2025/03/22 06:21:56 INFO  : file10.txt: Copied (new)
2025/03/22 06:21:56 INFO  : file6.txt: Copied (new)
2025/03/22 06:21:56 INFO  : file3.txt: Deleted
2025/03/22 06:21:56 INFO  : - Path1    Do queued copies to                - Path2
2025/03/22 06:21:56 INFO  : file11.txt: Copied (new)
2025/03/22 06:21:56 INFO  : file5.txt.conflict1: Copied (new)
2025/03/22 06:21:56 INFO  : file7.txt: Copied (new)
2025/03/22 06:21:56 INFO  : file2.txt: Copied (replaced existing)
2025/03/22 06:21:56 INFO  : file4.txt: Deleted
2025/03/22 06:21:56 INFO  : Updating listings
2025/03/22 06:21:56 INFO  : Validating listings for Path1 "TestFTPProftpd{jitBN}:rclone-test-lecevix6pomu/062155cu/changes/path1/" vs Path2 "/tmp/062155cu/changes/path2/"
2025/03/22 06:21:56 INFO  : Bisync successful
    bisync_test.go:560: TEST changes PASSED
=== RUN   TestBisyncRemoteLocal/check_access
2025/03/22 06:21:56 DEBUG : fs cache: switching user supplied name "TestFTPProftpd:rclone-test-lecevix6pomu/062155cu" for canonical name "TestFTPProftpd{jitBN}:rclone-test-lecevix6pomu/062155cu"
2025/03/22 06:21:56 INFO  : path1: Making directory
2025/03/22 06:21:56 DEBUG : Creating backend with remote "TestFTPProftpd:rclone-test-lecevix6pomu/062155cu/check_access/path1"
2025/03/22 06:21:56 DEBUG : Setting type="ftp" for "TestFTPProftpd" from environment variable RCLONE_CONFIG_TESTFTPPROFTPD_TYPE
2025/03/22 06:21:56 DEBUG : Setting host="172.17.0.3" for "TestFTPProftpd" from environment variable RCLONE_CONFIG_TESTFTPPROFTPD_HOST
2025/03/22 06:21:56 DEBUG : Setting user="rclone" for "TestFTPProftpd" from environment variable RCLONE_CONFIG_TESTFTPPROFTPD_USER
2025/03/22 06:21:56 DEBUG : Setting pass="qBDOB7N4Nk3bjunblZOFYStheCGgNwjUA50eoaEMiOcYFA" for "TestFTPProftpd" from environment variable RCLONE_CONFIG_TESTFTPPROFTPD_PASS
2025/03/22 06:21:56 DEBUG : Setting encoding="Asterisk,Ctl,Dot,Slash" for "TestFTPProftpd" from environment variable RCLONE_CONFIG_TESTFTPPROFTPD_ENCODING
2025/03/22 06:21:56 DEBUG : TestFTPProftpd: detected overridden config - adding "{jitBN}" suffix to name
2025/03/22 06:21:56 DEBUG : Setting host="172.17.0.3" for "TestFTPProftpd" from environment variable RCLONE_CONFIG_TESTFTPPROFTPD_HOST
2025/03/22 06:21:56 DEBUG : Setting user="rclone" for "TestFTPProftpd" from environment variable RCLONE_CONFIG_TESTFTPPROFTPD_USER
2025/03/22 06:21:56 DEBUG : Setting pass="qBDOB7N4Nk3bjunblZOFYStheCGgNwjUA50eoaEMiOcYFA" for "TestFTPProftpd" from environment variable RCLONE_CONFIG_TESTFTPPROFTPD_PASS
2025/03/22 06:21:56 DEBUG : Setting encoding="Asterisk,Ctl,Dot,Slash" for "TestFTPProftpd" from environment variable RCLONE_CONFIG_TESTFTPPROFTPD_ENCODING
2025/03/22 06:21:56 DEBUG : ftp://172.17.0.3:21/rclone-test-lecevix6pomu/062155cu/check_access/path1: Connecting to FTP server
2025/03/22 06:21:56 DEBUG : ftp://172.17.0.3:21/rclone-test-lecevix6pomu/062155cu/check_access/path1: dial("tcp","172.17.0.3:21")
2025/03/22 06:21:56 DEBUG : ftp://172.17.0.3:21/rclone-test-lecevix6pomu/062155cu/check_access/path1: > dial: conn=*fshttp.timeoutConn, err=<nil>
2025/03/22 06:21:56 DEBUG : fs cache: renaming cache item "TestFTPProftpd:rclone-test-lecevix6pomu/062155cu/check_access/path1" to be canonical "TestFTPProftpd{jitBN}:rclone-test-lecevix6pomu/062155cu/check_access/path1"
2025/03/22 06:21:56 DEBUG : Creating backend with remote "/tmp/062155cu/check_access/path2"
2025/03/22 06:21:56 DEBUG : Creating backend with remote "/home/rclone/go/src/github.com/rclone/rclone/cmd/bisync/testdata/test_check_access/initial"
2025/03/22 06:21:56 DEBUG : Creating backend with remote "/tmp/062155cu/initdir/test_check_access-datohab0"
2025/03/22 06:21:56 DEBUG : RCLONE_TEST: Need to transfer - File not found at Destination
2025/03/22 06:21:56 DEBUG : file1.txt: Need to transfer - File not found at Destination
2025/03/22 06:21:56 DEBUG : file2.txt: Need to transfer - File not found at Destination
2025/03/22 06:21:56 DEBUG : file3.txt: Need to transfer - File not found at Destination
2025/03/22 06:21:56 DEBUG : file4.txt: Need to transfer - File not found at Destination
2025/03/22 06:21:56 DEBUG : subdir: Making directory with metadata
2025/03/22 06:21:56 INFO  : subdir: Made directory with metadata (mtime=2021-11-02T05:00:07Z)
2025/03/22 06:21:56 DEBUG : Added delayed dir = "subdir", newDst=subdir
2025/03/22 06:21:56 DEBUG : subdir/RCLONE_TEST: Need to transfer - File not found at Destination
2025/03/22 06:21:56 DEBUG : subdir/file20.txt: Need to transfer - File not found at Destination
2025/03/22 06:21:56 DEBUG : Local file system at /tmp/062155cu/initdir/test_check_access-datohab0: Waiting for checks to finish
2025/03/22 06:21:56 DEBUG : Local file system at /tmp/062155cu/initdir/test_check_access-datohab0: Waiting for transfers to finish
2025/03/22 06:21:56 DEBUG : file1.txt: md5 = d41d8cd98f00b204e9800998ecf8427e OK
2025/03/22 06:21:56 DEBUG : RCLONE_TEST: md5 = 294d25b294ff26a5243dba914ac3fbf7 OK
2025/03/22 06:21:56 DEBUG : RCLONE_TEST.cf9a93ac.partial: renamed to: RCLONE_TEST
2025/03/22 06:21:56 INFO  : RCLONE_TEST: Copied (new)
2025/03/22 06:21:56 DEBUG : file2.txt: md5 = d41d8cd98f00b204e9800998ecf8427e OK
2025/03/22 06:21:56 DEBUG : file1.txt.5028a97.partial: renamed to: file1.txt
2025/03/22 06:21:56 INFO  : file1.txt: Copied (new)
2025/03/22 06:21:56 DEBUG : file2.txt.5028a97.partial: renamed to: file2.txt
2025/03/22 06:21:56 INFO  : file2.txt: Copied (new)
2025/03/22 06:21:56 DEBUG : file4.txt: md5 = d41d8cd98f00b204e9800998ecf8427e OK
2025/03/22 06:21:56 DEBUG : file4.txt.5028a97.partial: renamed to: file4.txt
2025/03/22 06:21:56 INFO  : file4.txt: Copied (new)
2025/03/22 06:21:56 DEBUG : subdir/file20.txt: md5 = d41d8cd98f00b204e9800998ecf8427e OK
2025/03/22 06:21:56 DEBUG : subdir/file20.txt.5028a97.partial: renamed to: subdir/file20.txt
2025/03/22 06:21:56 INFO  : subdir/file20.txt: Copied (new)
2025/03/22 06:21:56 DEBUG : subdir/RCLONE_TEST: md5 = 294d25b294ff26a5243dba914ac3fbf7 OK
2025/03/22 06:21:56 DEBUG : subdir/RCLONE_TEST.cf9a93ac.partial: renamed to: subdir/RCLONE_TEST
2025/03/22 06:21:56 INFO  : subdir/RCLONE_TEST: Copied (new)
2025/03/22 06:21:56 DEBUG : file3.txt: md5 = d41d8cd98f00b204e9800998ecf8427e OK
2025/03/22 06:21:56 DEBUG : file3.txt.5028a97.partial: renamed to: file3.txt
2025/03/22 06:21:56 INFO  : file3.txt: Copied (new)
2025/03/22 06:21:56 INFO  : subdir: Set directory modification time (using SetModTime)
2025/03/22 06:21:56 DEBUG : Creating backend with remote "/home/rclone/go/src/github.com/rclone/rclone/cmd/bisync/testdata/test_check_access/modfiles"
2025/03/22 06:21:56 DEBUG : Creating backend with remote "/tmp/062155cu/datadir/test_check_access-mazeraf2"
2025/03/22 06:21:56 DEBUG : hold.txt: Need to transfer - File not found at Destination
2025/03/22 06:21:56 DEBUG : Local file system at /tmp/062155cu/datadir/test_check_access-mazeraf2: Waiting for checks to finish
2025/03/22 06:21:56 DEBUG : Local file system at /tmp/062155cu/datadir/test_check_access-mazeraf2: Waiting for transfers to finish
2025/03/22 06:21:56 DEBUG : hold.txt: md5 = 628c2241b6ba4e313ef08bdfcf1cd964 OK
2025/03/22 06:21:56 DEBUG : hold.txt.627e309f.partial: renamed to: hold.txt
2025/03/22 06:21:56 INFO  : hold.txt: Copied (new)
2025/03/22 06:21:56 DEBUG : ftp://172.17.0.3:21/rclone-test-lecevix6pomu/062155cu/check_access/path1: dial("tcp","172.17.0.3:43467")
2025/03/22 06:21:56 DEBUG : ftp://172.17.0.3:21/rclone-test-lecevix6pomu/062155cu/check_access/path1: > dial: conn=*fshttp.timeoutConn, err=<nil>
2025/03/22 06:21:56 ERROR : : error listing: directory not found
2025/03/22 06:21:56 ERROR : : error listing: directory not found
2025/03/22 06:21:56 NOTICE: checking initFs Local file system at /tmp/062155cu/initdir/test_check_access-datohab0
2025/03/22 06:21:56 DEBUG : ftp://172.17.0.3:21/rclone-test-lecevix6pomu/062155cu/check_access/path1: dial("tcp","172.17.0.3:27299")
2025/03/22 06:21:56 DEBUG : ftp://172.17.0.3:21/rclone-test-lecevix6pomu/062155cu/check_access/path1: > dial: conn=*fshttp.timeoutConn, err=<nil>
2025/03/22 06:21:56 DEBUG : RCLONE_TEST: Need to transfer - File not found at Destination
2025/03/22 06:21:56 DEBUG : file1.txt: Need to transfer - File not found at Destination
2025/03/22 06:21:56 DEBUG : file2.txt: Need to transfer - File not found at Destination
2025/03/22 06:21:56 DEBUG : file3.txt: Need to transfer - File not found at Destination
2025/03/22 06:21:56 DEBUG : file4.txt: Need to transfer - File not found at Destination
2025/03/22 06:21:56 INFO  : subdir: Making directory
2025/03/22 06:21:56 DEBUG : ftp://172.17.0.3:21/rclone-test-lecevix6pomu/062155cu/check_access/path1: Connecting to FTP server
2025/03/22 06:21:56 DEBUG : ftp://172.17.0.3:21/rclone-test-lecevix6pomu/062155cu/check_access/path1: dial("tcp","172.17.0.3:21")
2025/03/22 06:21:56 DEBUG : ftp://172.17.0.3:21/rclone-test-lecevix6pomu/062155cu/check_access/path1: Connecting to FTP server
2025/03/22 06:21:56 DEBUG : ftp://172.17.0.3:21/rclone-test-lecevix6pomu/062155cu/check_access/path1: Connecting to FTP server
2025/03/22 06:21:56 DEBUG : ftp://172.17.0.3:21/rclone-test-lecevix6pomu/062155cu/check_access/path1: Connecting to FTP server
2025/03/22 06:21:56 DEBUG : ftp://172.17.0.3:21/rclone-test-lecevix6pomu/062155cu/check_access/path1: > dial: conn=*fshttp.timeoutConn, err=<nil>
2025/03/22 06:21:56 DEBUG : subdir/RCLONE_TEST: Need to transfer - File not found at Destination
2025/03/22 06:21:56 DEBUG : subdir/file20.txt: Need to transfer - File not found at Destination
2025/03/22 06:21:56 DEBUG : ftp://172.17.0.3:21/rclone-test-lecevix6pomu/062155cu/check_access/path1: Waiting for checks to finish
2025/03/22 06:21:56 DEBUG : ftp://172.17.0.3:21/rclone-test-lecevix6pomu/062155cu/check_access/path1: Waiting for transfers to finish
2025/03/22 06:21:56 DEBUG : ftp://172.17.0.3:21/rclone-test-lecevix6pomu/062155cu/check_access/path1: dial("tcp","172.17.0.3:65514")
2025/03/22 06:21:56 DEBUG : ftp://172.17.0.3:21/rclone-test-lecevix6pomu/062155cu/check_access/path1: > dial: conn=*fshttp.timeoutConn, err=<nil>
2025/03/22 06:21:56 DEBUG : ftp://172.17.0.3:21/rclone-test-lecevix6pomu/062155cu/check_access/path1: dial("tcp","172.17.0.3:21")
2025/03/22 06:21:56 DEBUG : ftp://172.17.0.3:21/rclone-test-lecevix6pomu/062155cu/check_access/path1: > dial: conn=*fshttp.timeoutConn, err=<nil>
2025/03/22 06:21:56 DEBUG : RCLONE_TEST.cf9a93ac.partial: renamed to: RCLONE_TEST
2025/03/22 06:21:56 INFO  : RCLONE_TEST: Copied (new)
2025/03/22 06:21:56 DEBUG : ftp://172.17.0.3:21/rclone-test-lecevix6pomu/062155cu/check_access/path1: dial("tcp","172.17.0.3:15290")
2025/03/22 06:21:56 DEBUG : ftp://172.17.0.3:21/rclone-test-lecevix6pomu/062155cu/check_access/path1: > dial: conn=*fshttp.timeoutConn, err=<nil>
2025/03/22 06:21:56 DEBUG : ftp://172.17.0.3:21/rclone-test-lecevix6pomu/062155cu/check_access/path1: dial("tcp","172.17.0.3:38796")
2025/03/22 06:21:56 DEBUG : ftp://172.17.0.3:21/rclone-test-lecevix6pomu/062155cu/check_access/path1: > dial: conn=*fshttp.timeoutConn, err=<nil>
2025/03/22 06:21:56 DEBUG : ftp://172.17.0.3:21/rclone-test-lecevix6pomu/062155cu/check_access/path1: dial("tcp","172.17.0.3:21")
2025/03/22 06:21:56 DEBUG : ftp://172.17.0.3:21/rclone-test-lecevix6pomu/062155cu/check_access/path1: > dial: conn=*fshttp.timeoutConn, err=<nil>
2025/03/22 06:21:56 DEBUG : file1.txt.5028a97.partial: renamed to: file1.txt
2025/03/22 06:21:56 INFO  : file1.txt: Copied (new)
2025/03/22 06:21:56 DEBUG : ftp://172.17.0.3:21/rclone-test-lecevix6pomu/062155cu/check_access/path1: dial("tcp","172.17.0.3:52072")
2025/03/22 06:21:56 DEBUG : ftp://172.17.0.3:21/rclone-test-lecevix6pomu/062155cu/check_access/path1: > dial: conn=*fshttp.timeoutConn, err=<nil>
2025/03/22 06:21:56 DEBUG : subdir/RCLONE_TEST.cf9a93ac.partial: renamed to: subdir/RCLONE_TEST
2025/03/22 06:21:56 INFO  : subdir/RCLONE_TEST: Copied (new)
2025/03/22 06:21:56 DEBUG : file4.txt.5028a97.partial: renamed to: file4.txt
2025/03/22 06:21:56 INFO  : file4.txt: Copied (new)
2025/03/22 06:21:56 DEBUG : ftp://172.17.0.3:21/rclone-test-lecevix6pomu/062155cu/check_access/path1: dial("tcp","172.17.0.3:21")
2025/03/22 06:21:56 DEBUG : ftp://172.17.0.3:21/rclone-test-lecevix6pomu/062155cu/check_access/path1: > dial: conn=*fshttp.timeoutConn, err=<nil>
2025/03/22 06:21:56 DEBUG : ftp://172.17.0.3:21/rclone-test-lecevix6pomu/062155cu/check_access/path1: dial("tcp","172.17.0.3:41031")
2025/03/22 06:21:56 DEBUG : ftp://172.17.0.3:21/rclone-test-lecevix6pomu/062155cu/check_access/path1: > dial: conn=*fshttp.timeoutConn, err=<nil>
2025/03/22 06:21:56 DEBUG : ftp://172.17.0.3:21/rclone-test-lecevix6pomu/062155cu/check_access/path1: dial("tcp","172.17.0.3:43924")
2025/03/22 06:21:56 DEBUG : ftp://172.17.0.3:21/rclone-test-lecevix6pomu/062155cu/check_access/path1: > dial: conn=*fshttp.timeoutConn, err=<nil>
2025/03/22 06:21:56 DEBUG : subdir/file20.txt.5028a97.partial: renamed to: subdir/file20.txt
2025/03/22 06:21:56 INFO  : subdir/file20.txt: Copied (new)
2025/03/22 06:21:56 DEBUG : file2.txt.5028a97.partial: renamed to: file2.txt
2025/03/22 06:21:56 INFO  : file2.txt: Copied (new)
2025/03/22 06:21:56 DEBUG : ftp://172.17.0.3:21/rclone-test-lecevix6pomu/062155cu/check_access/path1: dial("tcp","172.17.0.3:30399")
2025/03/22 06:21:56 DEBUG : ftp://172.17.0.3:21/rclone-test-lecevix6pomu/062155cu/check_access/path1: > dial: conn=*fshttp.timeoutConn, err=<nil>
2025/03/22 06:21:56 DEBUG : file3.txt.5028a97.partial: renamed to: file3.txt
2025/03/22 06:21:56 INFO  : file3.txt: Copied (new)
2025/03/22 06:21:56 NOTICE: checking Path1 ftp://172.17.0.3:21/rclone-test-lecevix6pomu/062155cu/check_access/path1
2025/03/22 06:21:56 DEBUG : ftp://172.17.0.3:21/rclone-test-lecevix6pomu/062155cu/check_access/path1: dial("tcp","172.17.0.3:44540")
2025/03/22 06:21:56 DEBUG : ftp://172.17.0.3:21/rclone-test-lecevix6pomu/062155cu/check_access/path1: > dial: conn=*fshttp.timeoutConn, err=<nil>
2025/03/22 06:21:56 DEBUG : ftp://172.17.0.3:21/rclone-test-lecevix6pomu/062155cu/check_access/path1: dial("tcp","172.17.0.3:8832")
2025/03/22 06:21:56 DEBUG : ftp://172.17.0.3:21/rclone-test-lecevix6pomu/062155cu/check_access/path1: > dial: conn=*fshttp.timeoutConn, err=<nil>
2025/03/22 06:21:56 DEBUG : RCLONE_TEST: Need to transfer - File not found at Destination
2025/03/22 06:21:56 DEBUG : file1.txt: Need to transfer - File not found at Destination
2025/03/22 06:21:56 DEBUG : file2.txt: Need to transfer - File not found at Destination
2025/03/22 06:21:56 DEBUG : file3.txt: Need to transfer - File not found at Destination
2025/03/22 06:21:56 DEBUG : file4.txt: Need to transfer - File not found at Destination
2025/03/22 06:21:56 DEBUG : subdir: Making directory with metadata
2025/03/22 06:21:56 INFO  : subdir: Made directory with metadata (mtime=2021-11-02T05:00:07Z)
2025/03/22 06:21:56 DEBUG : Added delayed dir = "subdir", newDst=subdir
2025/03/22 06:21:56 DEBUG : subdir/RCLONE_TEST: Need to transfer - File not found at Destination
2025/03/22 06:21:56 DEBUG : subdir/file20.txt: Need to transfer - File not found at Destination
2025/03/22 06:21:56 DEBUG : file1.txt: md5 = d41d8cd98f00b204e9800998ecf8427e OK
2025/03/22 06:21:56 DEBUG : file1.txt.5028a97.partial: renamed to: file1.txt
2025/03/22 06:21:56 INFO  : file1.txt: Copied (new)
2025/03/22 06:21:56 DEBUG : Local file system at /tmp/062155cu/check_access/path2: Waiting for checks to finish
2025/03/22 06:21:56 DEBUG : file3.txt: md5 = d41d8cd98f00b204e9800998ecf8427e OK
2025/03/22 06:21:56 DEBUG : Local file system at /tmp/062155cu/check_access/path2: Waiting for transfers to finish
2025/03/22 06:21:56 DEBUG : RCLONE_TEST: md5 = 294d25b294ff26a5243dba914ac3fbf7 OK
2025/03/22 06:21:56 DEBUG : file2.txt: md5 = d41d8cd98f00b204e9800998ecf8427e OK
2025/03/22 06:21:56 DEBUG : file3.txt.5028a97.partial: renamed to: file3.txt
2025/03/22 06:21:56 DEBUG : file4.txt: md5 = d41d8cd98f00b204e9800998ecf8427e OK
2025/03/22 06:21:56 INFO  : file3.txt: Copied (new)
2025/03/22 06:21:56 DEBUG : RCLONE_TEST.cf9a93ac.partial: renamed to: RCLONE_TEST
2025/03/22 06:21:56 INFO  : RCLONE_TEST: Copied (new)
2025/03/22 06:21:56 DEBUG : file2.txt.5028a97.partial: renamed to: file2.txt
2025/03/22 06:21:56 INFO  : file2.txt: Copied (new)
2025/03/22 06:21:56 DEBUG : file4.txt.5028a97.partial: renamed to: file4.txt
2025/03/22 06:21:56 INFO  : file4.txt: Copied (new)
2025/03/22 06:21:56 DEBUG : subdir/file20.txt: md5 = d41d8cd98f00b204e9800998ecf8427e OK
2025/03/22 06:21:56 DEBUG : subdir/file20.txt.5028a97.partial: renamed to: subdir/file20.txt
2025/03/22 06:21:56 INFO  : subdir/file20.txt: Copied (new)
2025/03/22 06:21:56 DEBUG : subdir/RCLONE_TEST: md5 = 294d25b294ff26a5243dba914ac3fbf7 OK
2025/03/22 06:21:56 DEBUG : subdir/RCLONE_TEST.cf9a93ac.partial: renamed to: subdir/RCLONE_TEST
2025/03/22 06:21:56 INFO  : subdir/RCLONE_TEST: Copied (new)
2025/03/22 06:21:56 INFO  : subdir: Set directory modification time (using SetModTime)
2025/03/22 06:21:56 NOTICE: checking path2 Local file system at /tmp/062155cu/check_access/path2
2025/03/22 06:21:56 NOTICE: (01)  : test check-access
2025/03/22 06:21:56 NOTICE: (02)  : test initial bisync
2025/03/22 06:21:56 NOTICE: (03)  : bisync resync
2025/03/22 06:21:56 INFO  : subdir: Set directory modification time (using SetModTime)
2025/03/22 06:21:56 INFO  : Setting --ignore-listing-checksum as neither --checksum nor --compare checksum are set.
2025/03/22 06:21:56 INFO  : Bisyncing with Comparison Settings: 
{
	"Modtime": true,
	"Size": true,
	"Checksum": false,
	"HashType1": 0,
	"HashType2": 0,
	"NoSlowHash": false,
	"SlowHashSyncOnly": false,
	"SlowHashDetected": true,
	"DownloadHash": false
}
2025/03/22 06:21:56 INFO  : Synching Path1 "TestFTPProftpd{jitBN}:rclone-test-lecevix6pomu/062155cu/check_access/path1/" with Path2 "/tmp/062155cu/check_access/path2/"
2025/03/22 06:21:56 INFO  : Copying Path2 files to Path1
2025/03/22 06:21:56 INFO  : - Path2    Resync is copying files to         - Path1
2025/03/22 06:21:56 INFO  : - Path1    Resync is copying files to         - Path2
2025/03/22 06:21:56 INFO  : subdir: Set directory modification time (using SetModTime)
2025/03/22 06:21:56 INFO  : Resync updating listings
2025/03/22 06:21:56 INFO  : Validating listings for Path1 "TestFTPProftpd{jitBN}:rclone-test-lecevix6pomu/062155cu/check_access/path1/" vs Path2 "/tmp/062155cu/check_access/path2/"
2025/03/22 06:21:56 INFO  : Bisync successful
2025/03/22 06:21:56 NOTICE: (04)  : test 1. see that check-access passes with the initial setup
2025/03/22 06:21:56 NOTICE: (05)  : bisync check-access
2025/03/22 06:21:56 INFO  : subdir: Set directory modification time (using SetModTime)
2025/03/22 06:21:56 INFO  : Setting --ignore-listing-checksum as neither --checksum nor --compare checksum are set.
2025/03/22 06:21:56 INFO  : Bisyncing with Comparison Settings: 
{
	"Modtime": true,
	"Size": true,
	"Checksum": false,
	"HashType1": 0,
	"HashType2": 0,
	"NoSlowHash": false,
	"SlowHashSyncOnly": false,
	"SlowHashDetected": true,
	"DownloadHash": false
}
2025/03/22 06:21:56 INFO  : Synching Path1 "TestFTPProftpd{jitBN}:rclone-test-lecevix6pomu/062155cu/check_access/path1/" with Path2 "/tmp/062155cu/check_access/path2/"
2025/03/22 06:21:56 INFO  : Building Path1 and Path2 listings
2025/03/22 06:21:56 INFO  : Path1 checking for diffs
2025/03/22 06:21:56 INFO  : Path2 checking for diffs
2025/03/22 06:21:56 INFO  : Checking access health
2025/03/22 06:21:56 INFO  : Found 2 matching "RCLONE_TEST" files on both paths
2025/03/22 06:21:56 INFO  : No changes found
2025/03/22 06:21:56 INFO  : Updating listings
2025/03/22 06:21:56 INFO  : Validating listings for Path1 "TestFTPProftpd{jitBN}:rclone-test-lecevix6pomu/062155cu/check_access/path1/" vs Path2 "/tmp/062155cu/check_access/path2/"
2025/03/22 06:21:56 INFO  : Bisync successful
2025/03/22 06:21:56 NOTICE: (06)  : test 2. delete the path2 subdir RCLONE_TEST and run sync. should fail critical.
2025/03/22 06:21:56 NOTICE: (07)  : delete-file /tmp/062155cu/check_access/path2/subdir/RCLONE_TEST
2025/03/22 06:21:56 INFO  : RCLONE_TEST: Deleted
2025/03/22 06:21:56 NOTICE: (08)  : bisync check-access
2025/03/22 06:21:56 INFO  : subdir: Set directory modification time (using SetModTime)
2025/03/22 06:21:56 INFO  : Setting --ignore-listing-checksum as neither --checksum nor --compare checksum are set.
2025/03/22 06:21:56 INFO  : Bisyncing with Comparison Settings: 
{
	"Modtime": true,
	"Size": true,
	"Checksum": false,
	"HashType1": 0,
	"HashType2": 0,
	"NoSlowHash": false,
	"SlowHashSyncOnly": false,
	"SlowHashDetected": true,
	"DownloadHash": false
}
2025/03/22 06:21:56 INFO  : Synching Path1 "TestFTPProftpd{jitBN}:rclone-test-lecevix6pomu/062155cu/check_access/path1/" with Path2 "/tmp/062155cu/check_access/path2/"
2025/03/22 06:21:56 INFO  : Building Path1 and Path2 listings
2025/03/22 06:21:56 INFO  : Path1 checking for diffs
2025/03/22 06:21:56 INFO  : Path2 checking for diffs
2025/03/22 06:21:56 INFO  : - Path2    File was deleted          - subdir/RCLONE_TEST
2025/03/22 06:21:56 INFO  : Path2:    1 changes:    0 new,    0 modified,    1 deleted
2025/03/22 06:21:56 INFO  : Checking access health
2025/03/22 06:21:56 ERROR : Access test failed: Path1 count 2, Path2 count 1 - RCLONE_TEST
2025/03/22 06:21:56 ERROR : -          Access test failed: Path1 file not found in Path2 - subdir/RCLONE_TEST
2025/03/22 06:21:56 ERROR : Bisync critical error: check file check failed
2025/03/22 06:21:56 ERROR : Bisync aborted. Must run --resync to recover.
2025/03/22 06:21:56 NOTICE: Bisync error: bisync aborted
2025/03/22 06:21:56 NOTICE: (09)  : copy-listings path2-missing
2025/03/22 06:21:56 NOTICE: (10)  : test 3. put the path2 subdir RCLONE_TEST back, resync.
2025/03/22 06:21:56 NOTICE: (11)  : copy-file TestFTPProftpd,encoding='Asterisk,Ctl,Dot,Slash',host='172.17.0.3',pass='qBDOB7N4Nk3bjunblZOFYStheCGgNwjUA50eoaEMiOcYFA',user='rclone':rclone-test-lecevix6pomu/062155cu/check_access/path1/subdir/RCLONE_TEST /tmp/062155cu/check_access/path2/
2025/03/22 06:21:56 NOTICE: (12)  : bisync resync
2025/03/22 06:21:56 INFO  : subdir: Set directory modification time (using SetModTime)
2025/03/22 06:21:56 INFO  : Setting --ignore-listing-checksum as neither --checksum nor --compare checksum are set.
2025/03/22 06:21:56 INFO  : Bisyncing with Comparison Settings: 
{
	"Modtime": true,
	"Size": true,
	"Checksum": false,
	"HashType1": 0,
	"HashType2": 0,
	"NoSlowHash": false,
	"SlowHashSyncOnly": false,
	"SlowHashDetected": true,
	"DownloadHash": false
}
2025/03/22 06:21:56 INFO  : Synching Path1 "TestFTPProftpd{jitBN}:rclone-test-lecevix6pomu/062155cu/check_access/path1/" with Path2 "/tmp/062155cu/check_access/path2/"
2025/03/22 06:21:56 INFO  : Copying Path2 files to Path1
2025/03/22 06:21:56 INFO  : - Path2    Resync is copying files to         - Path1
2025/03/22 06:21:56 INFO  : - Path1    Resync is copying files to         - Path2
2025/03/22 06:21:56 INFO  : subdir: Set directory modification time (using SetModTime)
2025/03/22 06:21:56 INFO  : subdir/RCLONE_TEST: Copied (new)
2025/03/22 06:21:56 INFO  : subdir: Set directory modification time (using SetModTime)
2025/03/22 06:21:56 INFO  : Resync updating listings
2025/03/22 06:21:56 INFO  : Validating listings for Path1 "TestFTPProftpd{jitBN}:rclone-test-lecevix6pomu/062155cu/check_access/path1/" vs Path2 "/tmp/062155cu/check_access/path2/"
2025/03/22 06:21:56 INFO  : Bisync successful
2025/03/22 06:21:56 NOTICE: (13)  : test 4. run sync with check-access. should pass.
2025/03/22 06:21:56 NOTICE: (14)  : bisync check-access
2025/03/22 06:21:56 INFO  : subdir: Set directory modification time (using SetModTime)
2025/03/22 06:21:56 INFO  : Setting --ignore-listing-checksum as neither --checksum nor --compare checksum are set.
2025/03/22 06:21:56 INFO  : Bisyncing with Comparison Settings: 
{
	"Modtime": true,
	"Size": true,
	"Checksum": false,
	"HashType1": 0,
	"HashType2": 0,
	"NoSlowHash": false,
	"SlowHashSyncOnly": false,
	"SlowHashDetected": true,
	"DownloadHash": false
}
2025/03/22 06:21:56 INFO  : Synching Path1 "TestFTPProftpd{jitBN}:rclone-test-lecevix6pomu/062155cu/check_access/path1/" with Path2 "/tmp/062155cu/check_access/path2/"
2025/03/22 06:21:56 INFO  : Building Path1 and Path2 listings
2025/03/22 06:21:56 INFO  : Path1 checking for diffs
2025/03/22 06:21:56 INFO  : Path2 checking for diffs
2025/03/22 06:21:56 INFO  : Checking access health
2025/03/22 06:21:56 INFO  : Found 2 matching "RCLONE_TEST" files on both paths
2025/03/22 06:21:56 INFO  : No changes found
2025/03/22 06:21:56 INFO  : Updating listings
2025/03/22 06:21:56 INFO  : Validating listings for Path1 "TestFTPProftpd{jitBN}:rclone-test-lecevix6pomu/062155cu/check_access/path1/" vs Path2 "/tmp/062155cu/check_access/path2/"
2025/03/22 06:21:56 INFO  : Bisync successful
2025/03/22 06:21:56 NOTICE: (15)  : test 5. delete path1 top level RCLONE_TEST, run sync. should fail critical.
2025/03/22 06:21:56 NOTICE: (16)  : delete-file TestFTPProftpd,encoding='Asterisk,Ctl,Dot,Slash',host='172.17.0.3',pass='qBDOB7N4Nk3bjunblZOFYStheCGgNwjUA50eoaEMiOcYFA',user='rclone':rclone-test-lecevix6pomu/062155cu/check_access/path1/RCLONE_TEST
2025/03/22 06:21:56 INFO  : RCLONE_TEST: Deleted
2025/03/22 06:21:56 NOTICE: (17)  : bisync check-access
2025/03/22 06:21:56 INFO  : subdir: Set directory modification time (using SetModTime)
2025/03/22 06:21:56 INFO  : Setting --ignore-listing-checksum as neither --checksum nor --compare checksum are set.
2025/03/22 06:21:56 INFO  : Bisyncing with Comparison Settings: 
{
	"Modtime": true,
	"Size": true,
	"Checksum": false,
	"HashType1": 0,
	"HashType2": 0,
	"NoSlowHash": false,
	"SlowHashSyncOnly": false,
	"SlowHashDetected": true,
	"DownloadHash": false
}
2025/03/22 06:21:56 INFO  : Synching Path1 "TestFTPProftpd{jitBN}:rclone-test-lecevix6pomu/062155cu/check_access/path1/" with Path2 "/tmp/062155cu/check_access/path2/"
2025/03/22 06:21:56 INFO  : Building Path1 and Path2 listings
2025/03/22 06:21:56 INFO  : Path1 checking for diffs
2025/03/22 06:21:56 INFO  : - Path1    File was deleted          - RCLONE_TEST
2025/03/22 06:21:56 INFO  : Path1:    1 changes:    0 new,    0 modified,    1 deleted
2025/03/22 06:21:56 INFO  : Path2 checking for diffs
2025/03/22 06:21:56 INFO  : Checking access health
2025/03/22 06:21:56 ERROR : Access test failed: Path1 count 1, Path2 count 2 - RCLONE_TEST
2025/03/22 06:21:56 ERROR : -          Access test failed: Path2 file not found in Path1 - RCLONE_TEST
2025/03/22 06:21:56 ERROR : Bisync critical error: check file check failed
2025/03/22 06:21:56 ERROR : Bisync aborted. Must run --resync to recover.
2025/03/22 06:21:56 NOTICE: Bisync error: bisync aborted
2025/03/22 06:21:56 NOTICE: (18)  : copy-listings path1-missing
2025/03/22 06:21:56 NOTICE: (19)  : test 6. run again. should fail critical due to missing listings.
2025/03/22 06:21:56 NOTICE: (20)  : bisync check-access
2025/03/22 06:21:56 INFO  : subdir: Set directory modification time (using SetModTime)
2025/03/22 06:21:56 INFO  : Setting --ignore-listing-checksum as neither --checksum nor --compare checksum are set.
2025/03/22 06:21:56 INFO  : Bisyncing with Comparison Settings: 
{
	"Modtime": true,
	"Size": true,
	"Checksum": false,
	"HashType1": 0,
	"HashType2": 0,
	"NoSlowHash": false,
	"SlowHashSyncOnly": false,
	"SlowHashDetected": true,
	"DownloadHash": false
}
2025/03/22 06:21:56 INFO  : Synching Path1 "TestFTPProftpd{jitBN}:rclone-test-lecevix6pomu/062155cu/check_access/path1/" with Path2 "/tmp/062155cu/check_access/path2/"
2025/03/22 06:21:56 ERROR : Bisync critical error: cannot find prior Path1 or Path2 listings, likely due to critical error on prior run 
Tip: here are the filenames we were looking for. Do they exist? 
Path1: /tmp/062155cu/workdir/TestFTPProftpd_rclone-test-lecevix6pomu_062155cu_check_access_path1..tmp_062155cu_check_access_path2.path1.lst
Path2: /tmp/062155cu/workdir/TestFTPProftpd_rclone-test-lecevix6pomu_062155cu_check_access_path1..tmp_062155cu_check_access_path2.path2.lst
Try running this command to inspect the work dir: 
rclone lsl "/tmp/062155cu/workdir"
2025/03/22 06:21:56 ERROR : Bisync aborted. Must run --resync to recover.
2025/03/22 06:21:56 NOTICE: Bisync error: bisync aborted
2025/03/22 06:21:56 NOTICE: (21)  : move-listings missing-listings
2025/03/22 06:21:56 NOTICE: (22)  : test 7. run resync, which will copy the path2 top level back to path1.
2025/03/22 06:21:56 NOTICE: (23)  : bisync resync
2025/03/22 06:21:56 INFO  : subdir: Set directory modification time (using SetModTime)
2025/03/22 06:21:56 INFO  : Setting --ignore-listing-checksum as neither --checksum nor --compare checksum are set.
2025/03/22 06:21:56 INFO  : Bisyncing with Comparison Settings: 
{
	"Modtime": true,
	"Size": true,
	"Checksum": false,
	"HashType1": 0,
	"HashType2": 0,
	"NoSlowHash": false,
	"SlowHashSyncOnly": false,
	"SlowHashDetected": true,
	"DownloadHash": false
}
2025/03/22 06:21:56 INFO  : Synching Path1 "TestFTPProftpd{jitBN}:rclone-test-lecevix6pomu/062155cu/check_access/path1/" with Path2 "/tmp/062155cu/check_access/path2/"
2025/03/22 06:21:56 INFO  : Copying Path2 files to Path1
2025/03/22 06:21:56 INFO  : - Path2    Resync is copying files to         - Path1
2025/03/22 06:21:56 INFO  : RCLONE_TEST: Copied (new)
2025/03/22 06:21:56 INFO  : - Path1    Resync is copying files to         - Path2
2025/03/22 06:21:56 INFO  : subdir: Set directory modification time (using SetModTime)
2025/03/22 06:21:56 INFO  : Resync updating listings
2025/03/22 06:21:56 INFO  : Validating listings for Path1 "TestFTPProftpd{jitBN}:rclone-test-lecevix6pomu/062155cu/check_access/path1/" vs Path2 "/tmp/062155cu/check_access/path2/"
2025/03/22 06:21:56 INFO  : Bisync successful
2025/03/22 06:21:56 NOTICE: (24)  : test 8. run sync with --check-access. should pass.
2025/03/22 06:21:56 NOTICE: (25)  : bisync check-access
2025/03/22 06:21:56 INFO  : subdir: Set directory modification time (using SetModTime)
2025/03/22 06:21:56 INFO  : Setting --ignore-listing-checksum as neither --checksum nor --compare checksum are set.
2025/03/22 06:21:56 INFO  : Bisyncing with Comparison Settings: 
{
	"Modtime": true,
	"Size": true,
	"Checksum": false,
	"HashType1": 0,
	"HashType2": 0,
	"NoSlowHash": false,
	"SlowHashSyncOnly": false,
	"SlowHashDetected": true,
	"DownloadHash": false
}
2025/03/22 06:21:56 INFO  : Synching Path1 "TestFTPProftpd{jitBN}:rclone-test-lecevix6pomu/062155cu/check_access/path1/" with Path2 "/tmp/062155cu/check_access/path2/"
2025/03/22 06:21:56 INFO  : Building Path1 and Path2 listings
2025/03/22 06:21:56 INFO  : Path1 checking for diffs
2025/03/22 06:21:56 INFO  : Path2 checking for diffs
2025/03/22 06:21:56 INFO  : Checking access health
2025/03/22 06:21:56 INFO  : Found 2 matching "RCLONE_TEST" files on both paths
2025/03/22 06:21:56 INFO  : No changes found
2025/03/22 06:21:56 INFO  : Updating listings
2025/03/22 06:21:56 INFO  : Validating listings for Path1 "TestFTPProftpd{jitBN}:rclone-test-lecevix6pomu/062155cu/check_access/path1/" vs Path2 "/tmp/062155cu/check_access/path2/"
2025/03/22 06:21:56 INFO  : Bisync successful
    bisync_test.go:560: TEST check_access PASSED
2025/03/22 06:21:56 DEBUG : ftp://172.17.0.3:21/rclone-test-lecevix6pomu: dial("tcp","172.17.0.3:53480")
2025/03/22 06:21:56 DEBUG : ftp://172.17.0.3:21/rclone-test-lecevix6pomu: > dial: conn=*fshttp.timeoutConn, err=<nil>
2025/03/22 06:21:56 DEBUG : ftp://172.17.0.3:21/rclone-test-lecevix6pomu: dial("tcp","172.17.0.3:38914")
2025/03/22 06:21:56 DEBUG : ftp://172.17.0.3:21/rclone-test-lecevix6pomu: > dial: conn=*fshttp.timeoutConn, err=<nil>
2025/03/22 06:21:56 DEBUG : ftp://172.17.0.3:21/rclone-test-lecevix6pomu: Connecting to FTP server
2025/03/22 06:21:56 DEBUG : ftp://172.17.0.3:21/rclone-test-lecevix6pomu: dial("tcp","172.17.0.3:21")
2025/03/22 06:21:56 DEBUG : ftp://172.17.0.3:21/rclone-test-lecevix6pomu: Connecting to FTP server
2025/03/22 06:21:56 DEBUG : ftp://172.17.0.3:21/rclone-test-lecevix6pomu: dial("tcp","172.17.0.3:6187")
2025/03/22 06:21:56 DEBUG : ftp://172.17.0.3:21/rclone-test-lecevix6pomu: > dial: conn=*fshttp.timeoutConn, err=<nil>
2025/03/22 06:21:56 DEBUG : ftp://172.17.0.3:21/rclone-test-lecevix6pomu: > dial: conn=*fshttp.timeoutConn, err=<nil>
2025/03/22 06:21:56 DEBUG : ftp://172.17.0.3:21/rclone-test-lecevix6pomu: dial("tcp","172.17.0.3:19471")
2025/03/22 06:21:56 DEBUG : ftp://172.17.0.3:21/rclone-test-lecevix6pomu: > dial: conn=*fshttp.timeoutConn, err=<nil>
2025/03/22 06:21:56 DEBUG : ftp://172.17.0.3:21/rclone-test-lecevix6pomu: dial("tcp","172.17.0.3:21")
2025/03/22 06:21:56 DEBUG : ftp://172.17.0.3:21/rclone-test-lecevix6pomu: > dial: conn=*fshttp.timeoutConn, err=<nil>
2025/03/22 06:21:56 DEBUG : ftp://172.17.0.3:21/rclone-test-lecevix6pomu: dial("tcp","172.17.0.3:34150")
2025/03/22 06:21:56 DEBUG : ftp://172.17.0.3:21/rclone-test-lecevix6pomu: > dial: conn=*fshttp.timeoutConn, err=<nil>
2025/03/22 06:21:56 DEBUG : ftp://172.17.0.3:21/rclone-test-lecevix6pomu: Purge dir "062155cu/path1"
2025/03/22 06:21:56 DEBUG : ftp://172.17.0.3:21/rclone-test-lecevix6pomu: Purge dir "062155cu/check_access"
2025/03/22 06:21:56 DEBUG : ftp://172.17.0.3:21/rclone-test-lecevix6pomu: Purge dir "062155cu/changes"
2025/03/22 06:21:56 DEBUG : ftp://172.17.0.3:21/rclone-test-lecevix6pomu: Purge dir "062155cu"
2025/03/22 06:21:56 DEBUG : ftp://172.17.0.3:21/rclone-test-lecevix6pomu: Purge dir ""
--- PASS: TestBisyncRemoteLocal (0.69s)
    --- PASS: TestBisyncRemoteLocal/changes (0.33s)
    --- PASS: TestBisyncRemoteLocal/check_access (0.33s)
PASS
2025/03/22 06:21:56 DEBUG : ftp://172.17.0.3:21/rclone-test-hapumuq9biro: dial("tcp","172.17.0.3:63672")
2025/03/22 06:21:56 DEBUG : ftp://172.17.0.3:21/rclone-test-hapumuq9biro: > dial: conn=*fshttp.timeoutConn, err=<nil>
2025/03/22 06:21:56 ERROR : : error listing: directory not found
2025/03/22 06:21:56 DEBUG : ftp://172.17.0.3:21/rclone-test-hapumuq9biro: Purge dir ""
2025/03/22 06:21:56 NOTICE: purge failed to rmdir "": directory not found
2025/03/22 06:21:56 NOTICE: purge failed: directory not found
2025/03/22 06:21:56 DEBUG : ftp://172.17.0.3:21/rclone-test-lecevix6pomu/062155cu: closing 1 unused connections
2025/03/22 06:21:56 DEBUG : ftp://172.17.0.3:21/rclone-test-lecevix6pomu/062155cu/check_access/path1: closing 1 unused connections
2025/03/22 06:21:56 DEBUG : ftp://172.17.0.3:21/rclone-test-lecevix6pomu/062155cu/check_access/path1: closing 5 unused connections
2025/03/22 06:21:56 DEBUG : ftp://172.17.0.3:21/rclone-test-lecevix6pomu/062155cu/changes/path1: closing 1 unused connections
2025/03/22 06:21:56 DEBUG : ftp://172.17.0.3:21/rclone-test-lecevix6pomu/062155cu/changes/path1: closing 4 unused connections
"./bisync.test -test.v -test.timeout 1h0m0s -remote TestFTPProftpd: -verbose -test.run '^TestBisyncRemoteLocal$/^(changes|check_access)$'" - Finished OK in 914.779827ms (try 2/5)