"./operations.test -test.v -test.timeout 1h0m0s -remote 'TestGoogleCloudStorage,directory_markers:' -verbose -test.run '^(TestCat|TestCopyFileCompareDest|TestCopyFileCopyDest|TestCopyFileMaxTransfer|TestCopyInplace|TestCopyLongFileName|TestCount|TestDeduplicateFirst|TestDeduplicateInteractive|TestDeduplicateLargest|TestDeduplicateNewest|TestDeduplicateNewestByHash|TestDeduplicateOldest|TestDeduplicateRename|TestDeduplicateSizeOnly|TestDeduplicateSkip|TestDeduplicateSmallest|TestDelete|TestHashSums|TestListDirSorted|TestLs|TestLsLong|TestLsWithFilesFrom|TestLsd|TestMaxDelete|TestMaxDeleteSize|TestMaxDeleteSizeLargeFile|TestMergeDirs|TestMkdir|TestReadFile|TestRmdirsNoLeaveRoot|TestStatJSON)$|^TestListJSON$/^(Default|DirsOnly|Metadata|Recurse)$'" - Starting (try 5/5)
2025/03/21 03:48:35 DEBUG : Creating backend with remote "TestGoogleCloudStorage,directory_markers:rclone-test-vijovix6fusi"
2025/03/21 03:48:35 DEBUG : Using config file from "/home/rclone/.rclone.conf"
2025/03/21 03:48:35 DEBUG : TestGoogleCloudStorage: detected overridden config - adding "{juk_h}" suffix to name
2025/03/21 03:48:35 DEBUG : Creating backend with remote "/tmp/rclone3327980596"
=== RUN   TestCopyFileCompareDest
    run.go:180: Remote "GCS bucket rclone-test-vijovix6fusi", Local "Local file system at /tmp/rclone3327980596", Modify Window "1ns"
2025/03/21 03:48:35 DEBUG : Creating backend with remote "TestGoogleCloudStorage,directory_markers:rclone-test-vijovix6fusi/dst"
2025/03/21 03:48:35 DEBUG : TestGoogleCloudStorage: detected overridden config - adding "{juk_h}" suffix to name
2025/03/21 03:48:36 DEBUG : Creating backend with remote "TestGoogleCloudStorage,directory_markers:rclone-test-vijovix6fusi/CompareDest"
2025/03/21 03:48:36 DEBUG : TestGoogleCloudStorage: detected overridden config - adding "{juk_h}" suffix to name
2025/03/21 03:48:36 DEBUG : fs cache: renaming cache item "TestGoogleCloudStorage,directory_markers:rclone-test-vijovix6fusi/CompareDest" to be canonical "TestGoogleCloudStorage{juk_h}:rclone-test-vijovix6fusi/CompareDest"
2025/03/21 03:48:36 DEBUG : one: Need to transfer - File not found at Destination
2025/03/21 03:48:38 DEBUG : /: Creating directory marker
2025/03/21 03:48:39 DEBUG : one: md5 = f97c5d29941bfb1b2fdab0874906ab82 OK
2025/03/21 03:48:39 INFO  : one: Copied (new)
2025/03/21 03:48:39 DEBUG : fs cache: switching user supplied name "TestGoogleCloudStorage,directory_markers:rclone-test-vijovix6fusi/CompareDest" for canonical name "TestGoogleCloudStorage{juk_h}:rclone-test-vijovix6fusi/CompareDest"
2025/03/21 03:48:39 DEBUG : one: Sizes differ (src 5 vs dst 3)
2025/03/21 03:48:40 DEBUG : one: md5 = 07912d142f5d63ee918b34796b5a2432 OK
2025/03/21 03:48:40 INFO  : one: Copied (replaced existing)
2025/03/21 03:48:41 DEBUG : dst/: Creating directory marker
2025/03/21 03:48:41 DEBUG : CompareDest/: Creating directory marker
2025/03/21 03:48:42 DEBUG : fs cache: switching user supplied name "TestGoogleCloudStorage,directory_markers:rclone-test-vijovix6fusi/CompareDest" for canonical name "TestGoogleCloudStorage{juk_h}:rclone-test-vijovix6fusi/CompareDest"
2025/03/21 03:48:42 DEBUG : one: Sizes differ (src 5 vs dst 3)
2025/03/21 03:48:42 DEBUG : one: Size and modification time the same (differ by 0s, within tolerance 1ns)
2025/03/21 03:48:42 DEBUG : one: Destination found in --compare-dest, skipping
2025/03/21 03:48:43 DEBUG : fs cache: switching user supplied name "TestGoogleCloudStorage,directory_markers:rclone-test-vijovix6fusi/CompareDest" for canonical name "TestGoogleCloudStorage{juk_h}:rclone-test-vijovix6fusi/CompareDest"
2025/03/21 03:48:43 DEBUG : two: Need to transfer - File not found at Destination
2025/03/21 03:48:43 DEBUG : two: Size and modification time the same (differ by 0s, within tolerance 1ns)
2025/03/21 03:48:43 DEBUG : two: Destination found in --compare-dest, skipping
2025/03/21 03:48:44 DEBUG : fs cache: switching user supplied name "TestGoogleCloudStorage,directory_markers:rclone-test-vijovix6fusi/CompareDest" for canonical name "TestGoogleCloudStorage{juk_h}:rclone-test-vijovix6fusi/CompareDest"
2025/03/21 03:48:44 DEBUG : two: Need to transfer - File not found at Destination
2025/03/21 03:48:44 DEBUG : two: Size and modification time the same (differ by 0s, within tolerance 1ns)
2025/03/21 03:48:44 DEBUG : two: Destination found in --compare-dest, skipping
2025/03/21 03:48:45 DEBUG : fs cache: switching user supplied name "TestGoogleCloudStorage,directory_markers:rclone-test-vijovix6fusi/CompareDest" for canonical name "TestGoogleCloudStorage{juk_h}:rclone-test-vijovix6fusi/CompareDest"
2025/03/21 03:48:45 DEBUG : two: Need to transfer - File not found at Destination
2025/03/21 03:48:45 DEBUG : two: Sizes differ (src 5 vs dst 3)
2025/03/21 03:48:45 DEBUG : two: md5 = 2379e4ce8c3380e996ab0509f17069ad OK
2025/03/21 03:48:45 INFO  : two: Copied (new)
2025/03/21 03:48:46 DEBUG : dst/: Removing directory marker
2025/03/21 03:48:46 DEBUG : dst/: Removing directory marker
    run.go:125: removing dir "dst" failed - try 1/3: removing directory marker failed: googleapi: Error 404: No such object: rclone-test-vijovix6fusi/dst/, notFound
2025/03/21 03:48:47 DEBUG : dst/: Removing directory marker
    run.go:125: removing dir "dst" failed - try 2/3: removing directory marker failed: googleapi: Error 404: No such object: rclone-test-vijovix6fusi/dst/, notFound
2025/03/21 03:48:48 DEBUG : dst/: Removing directory marker
    run.go:125: removing dir "dst" failed - try 3/3: removing directory marker failed: googleapi: Error 404: No such object: rclone-test-vijovix6fusi/dst/, notFound
    run.go:128: removing dir "dst" failed: removing directory marker failed: googleapi: Error 404: No such object: rclone-test-vijovix6fusi/dst/, notFound
2025/03/21 03:48:50 DEBUG : CompareDest/: Removing directory marker
    fstest.go:292: Sleeping for 1s for list eventual consistency: 1/3
    fstest.go:292: Sleeping for 2s for list eventual consistency: 2/3
    fstest.go:292: Sleeping for 4s for list eventual consistency: 3/3
    fstest.go:321: 
        	Error Trace:	/home/rclone/go/src/github.com/rclone/rclone/fstest/fstest.go:321
        	            				/home/rclone/go/src/github.com/rclone/rclone/fstest/fstest.go:332
        	            				/home/rclone/go/src/github.com/rclone/rclone/fstest/run.go:173
        	            				/home/rclone/go/src/github.com/rclone/rclone/fstest/run.go:388
        	            				/home/rclone/go/pkg/mod/golang.org/toolchain@v0.0.1-go1.23.0.linux-amd64/src/testing/testing.go:1176
        	            				/home/rclone/go/pkg/mod/golang.org/toolchain@v0.0.1-go1.23.0.linux-amd64/src/testing/testing.go:1354
        	            				/home/rclone/go/pkg/mod/golang.org/toolchain@v0.0.1-go1.23.0.linux-amd64/src/testing/testing.go:1684
        	Error:      	Not equal: 
        	            	expected: []string{}
        	            	actual  : []string{"dst"}
        	            	
        	            	Diff:
        	            	--- Expected
        	            	+++ Actual
        	            	@@ -1,2 +1,3 @@
        	            	-([]string) {
        	            	+([]string) (len=1) {
        	            	+ (string) (len=3) "dst"
        	            	 }
        	Test:       	TestCopyFileCompareDest
        	Messages:   	directories
--- FAIL: TestCopyFileCompareDest (22.12s)
=== RUN   TestCopyFileCopyDest
    run.go:180: Remote "GCS bucket rclone-test-vijovix6fusi", Local "Local file system at /tmp/rclone3327980596", Modify Window "1ns"
2025/03/21 03:48:57 DEBUG : Creating backend with remote "TestGoogleCloudStorage,directory_markers:rclone-test-vijovix6fusi/dst"
2025/03/21 03:48:57 DEBUG : TestGoogleCloudStorage: detected overridden config - adding "{juk_h}" suffix to name
2025/03/21 03:48:58 DEBUG : Creating backend with remote "TestGoogleCloudStorage,directory_markers:rclone-test-vijovix6fusi/CopyDest"
2025/03/21 03:48:58 DEBUG : TestGoogleCloudStorage: detected overridden config - adding "{juk_h}" suffix to name
2025/03/21 03:48:58 DEBUG : fs cache: renaming cache item "TestGoogleCloudStorage,directory_markers:rclone-test-vijovix6fusi/CopyDest" to be canonical "TestGoogleCloudStorage{juk_h}:rclone-test-vijovix6fusi/CopyDest"
2025/03/21 03:48:58 DEBUG : one: Need to transfer - File not found at Destination
2025/03/21 03:48:59 DEBUG : one: md5 = f97c5d29941bfb1b2fdab0874906ab82 OK
2025/03/21 03:48:59 INFO  : one: Copied (new)
2025/03/21 03:49:00 DEBUG : fs cache: switching user supplied name "TestGoogleCloudStorage,directory_markers:rclone-test-vijovix6fusi/CopyDest" for canonical name "TestGoogleCloudStorage{juk_h}:rclone-test-vijovix6fusi/CopyDest"
2025/03/21 03:49:00 DEBUG : one: Sizes differ (src 5 vs dst 3)
2025/03/21 03:49:01 DEBUG : one: md5 = 07912d142f5d63ee918b34796b5a2432 OK
2025/03/21 03:49:01 INFO  : one: Copied (replaced existing)
2025/03/21 03:49:01 DEBUG : dst/: Creating directory marker
2025/03/21 03:49:02 DEBUG : CopyDest/: Creating directory marker
2025/03/21 03:49:02 DEBUG : Creating backend with remote "TestGoogleCloudStorage,directory_markers:rclone-test-vijovix6fusi/BackupDir"
2025/03/21 03:49:02 DEBUG : TestGoogleCloudStorage: detected overridden config - adding "{juk_h}" suffix to name
2025/03/21 03:49:03 DEBUG : fs cache: renaming cache item "TestGoogleCloudStorage,directory_markers:rclone-test-vijovix6fusi/BackupDir" to be canonical "TestGoogleCloudStorage{juk_h}:rclone-test-vijovix6fusi/BackupDir"
2025/03/21 03:49:03 DEBUG : fs cache: switching user supplied name "TestGoogleCloudStorage,directory_markers:rclone-test-vijovix6fusi/CopyDest" for canonical name "TestGoogleCloudStorage{juk_h}:rclone-test-vijovix6fusi/CopyDest"
2025/03/21 03:49:03 DEBUG : one: Sizes differ (src 5 vs dst 3)
2025/03/21 03:49:03 DEBUG : one: Size and modification time the same (differ by 0s, within tolerance 1ns)
2025/03/21 03:49:03 DEBUG : one: Sizes differ (src 5 vs dst 3)
2025/03/21 03:49:04 DEBUG : /: Creating directory marker
2025/03/21 03:49:04 DEBUG : one: md5 = f97c5d29941bfb1b2fdab0874906ab82 OK
2025/03/21 03:49:04 INFO  : one: Copied (server-side copy)
2025/03/21 03:49:04 INFO  : one: Deleted
2025/03/21 03:49:05 DEBUG : one: md5 = 07912d142f5d63ee918b34796b5a2432 OK
2025/03/21 03:49:05 INFO  : one: Copied (server-side copy)
2025/03/21 03:49:05 DEBUG : one: Destination found in --copy-dest, using server-side copy
2025/03/21 03:49:05 DEBUG : fs cache: switching user supplied name "TestGoogleCloudStorage,directory_markers:rclone-test-vijovix6fusi/CopyDest" for canonical name "TestGoogleCloudStorage{juk_h}:rclone-test-vijovix6fusi/CopyDest"
2025/03/21 03:49:05 DEBUG : two: Need to transfer - File not found at Destination
2025/03/21 03:49:05 DEBUG : two: Size and modification time the same (differ by 0s, within tolerance 1ns)
2025/03/21 03:49:06 DEBUG : two: md5 = b8a9f715dbb64fd5c56e7783c6820a61 OK
2025/03/21 03:49:06 INFO  : two: Copied (server-side copy)
2025/03/21 03:49:06 DEBUG : two: Destination found in --copy-dest, using server-side copy
2025/03/21 03:49:06 DEBUG : fs cache: switching user supplied name "TestGoogleCloudStorage,directory_markers:rclone-test-vijovix6fusi/CopyDest" for canonical name "TestGoogleCloudStorage{juk_h}:rclone-test-vijovix6fusi/CopyDest"
2025/03/21 03:49:06 DEBUG : two: Size and modification time the same (differ by 0s, within tolerance 1ns)
2025/03/21 03:49:06 DEBUG : two: Unchanged skipping
2025/03/21 03:49:07 DEBUG : fs cache: switching user supplied name "TestGoogleCloudStorage,directory_markers:rclone-test-vijovix6fusi/CopyDest" for canonical name "TestGoogleCloudStorage{juk_h}:rclone-test-vijovix6fusi/CopyDest"
2025/03/21 03:49:07 DEBUG : three: Need to transfer - File not found at Destination
2025/03/21 03:49:07 DEBUG : three: Sizes differ (src 7 vs dst 5)
2025/03/21 03:49:07 DEBUG : three: Destination not found in --copy-dest
2025/03/21 03:49:07 DEBUG : three: md5 = 1bccb9dccb3e9f6a3f9d2a8bdb54b7f5 OK
2025/03/21 03:49:07 INFO  : three: Copied (new)
2025/03/21 03:49:09 DEBUG : dst/: Removing directory marker
2025/03/21 03:49:09 DEBUG : dst/: Removing directory marker
    run.go:125: removing dir "dst" failed - try 1/3: removing directory marker failed: googleapi: Error 404: No such object: rclone-test-vijovix6fusi/dst/, notFound
2025/03/21 03:49:10 DEBUG : dst/: Removing directory marker
    run.go:125: removing dir "dst" failed - try 2/3: removing directory marker failed: googleapi: Error 404: No such object: rclone-test-vijovix6fusi/dst/, notFound
2025/03/21 03:49:11 DEBUG : dst/: Removing directory marker
    run.go:125: removing dir "dst" failed - try 3/3: removing directory marker failed: googleapi: Error 404: No such object: rclone-test-vijovix6fusi/dst/, notFound
    run.go:128: removing dir "dst" failed: removing directory marker failed: googleapi: Error 404: No such object: rclone-test-vijovix6fusi/dst/, notFound
2025/03/21 03:49:12 DEBUG : CopyDest/: Removing directory marker
2025/03/21 03:49:12 DEBUG : BackupDir/: Removing directory marker
    run.go:125: removing dir "BackupDir" failed - try 1/3: removing directory marker failed: googleapi: Error 404: No such object: rclone-test-vijovix6fusi/BackupDir/, notFound
2025/03/21 03:49:13 DEBUG : BackupDir/: Removing directory marker
    run.go:125: removing dir "BackupDir" failed - try 2/3: removing directory marker failed: googleapi: Error 404: No such object: rclone-test-vijovix6fusi/BackupDir/, notFound
2025/03/21 03:49:14 DEBUG : BackupDir/: Removing directory marker
    run.go:125: removing dir "BackupDir" failed - try 3/3: removing directory marker failed: googleapi: Error 404: No such object: rclone-test-vijovix6fusi/BackupDir/, notFound
    run.go:128: removing dir "BackupDir" failed: removing directory marker failed: googleapi: Error 404: No such object: rclone-test-vijovix6fusi/BackupDir/, notFound
    fstest.go:292: Sleeping for 1s for list eventual consistency: 1/3
    fstest.go:292: Sleeping for 2s for list eventual consistency: 2/3
    fstest.go:292: Sleeping for 4s for list eventual consistency: 3/3
    fstest.go:321: 
        	Error Trace:	/home/rclone/go/src/github.com/rclone/rclone/fstest/fstest.go:321
        	            				/home/rclone/go/src/github.com/rclone/rclone/fstest/fstest.go:332
        	            				/home/rclone/go/src/github.com/rclone/rclone/fstest/run.go:173
        	            				/home/rclone/go/src/github.com/rclone/rclone/fstest/run.go:388
        	            				/home/rclone/go/pkg/mod/golang.org/toolchain@v0.0.1-go1.23.0.linux-amd64/src/testing/testing.go:1176
        	            				/home/rclone/go/pkg/mod/golang.org/toolchain@v0.0.1-go1.23.0.linux-amd64/src/testing/testing.go:1354
        	            				/home/rclone/go/pkg/mod/golang.org/toolchain@v0.0.1-go1.23.0.linux-amd64/src/testing/testing.go:1684
        	Error:      	Not equal: 
        	            	expected: []string{}
        	            	actual  : []string{"BackupDir", "dst"}
        	            	
        	            	Diff:
        	            	--- Expected
        	            	+++ Actual
        	            	@@ -1,2 +1,4 @@
        	            	-([]string) {
        	            	+([]string) (len=2) {
        	            	+ (string) (len=9) "BackupDir",
        	            	+ (string) (len=3) "dst"
        	            	 }
        	Test:       	TestCopyFileCopyDest
        	Messages:   	directories
--- FAIL: TestCopyFileCopyDest (25.40s)
=== RUN   TestCopyInplace
    run.go:180: Remote "GCS bucket rclone-test-vijovix6fusi", Local "Local file system at /tmp/rclone3327980596", Modify Window "1ns"
    copy_test.go:370: Partial uploads not supported
2025/03/21 03:49:23 DEBUG : dst/: Removing directory marker
    run.go:125: removing dir "dst" failed - try 1/3: removing directory marker failed: googleapi: Error 404: No such object: rclone-test-vijovix6fusi/dst/, notFound
2025/03/21 03:49:24 DEBUG : dst/: Removing directory marker
    run.go:125: removing dir "dst" failed - try 2/3: removing directory marker failed: googleapi: Error 404: No such object: rclone-test-vijovix6fusi/dst/, notFound
2025/03/21 03:49:25 DEBUG : dst/: Removing directory marker
    run.go:125: removing dir "dst" failed - try 3/3: removing directory marker failed: googleapi: Error 404: No such object: rclone-test-vijovix6fusi/dst/, notFound
    run.go:128: removing dir "dst" failed: removing directory marker failed: googleapi: Error 404: No such object: rclone-test-vijovix6fusi/dst/, notFound
2025/03/21 03:49:26 DEBUG : BackupDir/: Removing directory marker
    run.go:125: removing dir "BackupDir" failed - try 1/3: removing directory marker failed: googleapi: Error 404: No such object: rclone-test-vijovix6fusi/BackupDir/, notFound
2025/03/21 03:49:27 DEBUG : BackupDir/: Removing directory marker
    run.go:125: removing dir "BackupDir" failed - try 2/3: removing directory marker failed: googleapi: Error 404: No such object: rclone-test-vijovix6fusi/BackupDir/, notFound
2025/03/21 03:49:28 DEBUG : BackupDir/: Removing directory marker
    run.go:125: removing dir "BackupDir" failed - try 3/3: removing directory marker failed: googleapi: Error 404: No such object: rclone-test-vijovix6fusi/BackupDir/, notFound
    run.go:128: removing dir "BackupDir" failed: removing directory marker failed: googleapi: Error 404: No such object: rclone-test-vijovix6fusi/BackupDir/, notFound
    fstest.go:292: Sleeping for 1s for list eventual consistency: 1/3
    fstest.go:292: Sleeping for 2s for list eventual consistency: 2/3
    fstest.go:292: Sleeping for 4s for list eventual consistency: 3/3
    fstest.go:321: 
        	Error Trace:	/home/rclone/go/src/github.com/rclone/rclone/fstest/fstest.go:321
        	            				/home/rclone/go/src/github.com/rclone/rclone/fstest/fstest.go:332
        	            				/home/rclone/go/src/github.com/rclone/rclone/fstest/run.go:173
        	            				/home/rclone/go/src/github.com/rclone/rclone/fstest/run.go:388
        	            				/home/rclone/go/pkg/mod/golang.org/toolchain@v0.0.1-go1.23.0.linux-amd64/src/testing/testing.go:1176
        	            				/home/rclone/go/pkg/mod/golang.org/toolchain@v0.0.1-go1.23.0.linux-amd64/src/testing/testing.go:1354
        	            				/home/rclone/go/pkg/mod/golang.org/toolchain@v0.0.1-go1.23.0.linux-amd64/src/testing/testing.go:1684
        	            				/home/rclone/go/pkg/mod/golang.org/toolchain@v0.0.1-go1.23.0.linux-amd64/src/runtime/panic.go:629
        	            				/home/rclone/go/pkg/mod/golang.org/toolchain@v0.0.1-go1.23.0.linux-amd64/src/testing/testing.go:1121
        	            				/home/rclone/go/pkg/mod/golang.org/toolchain@v0.0.1-go1.23.0.linux-amd64/src/testing/testing.go:1097
        	            				/home/rclone/go/src/github.com/rclone/rclone/fs/operations/copy_test.go:370
        	Error:      	Not equal: 
        	            	expected: []string{}
        	            	actual  : []string{"BackupDir", "dst"}
        	            	
        	            	Diff:
        	            	--- Expected
        	            	+++ Actual
        	            	@@ -1,2 +1,4 @@
        	            	-([]string) {
        	            	+([]string) (len=2) {
        	            	+ (string) (len=9) "BackupDir",
        	            	+ (string) (len=3) "dst"
        	            	 }
        	Test:       	TestCopyInplace
        	Messages:   	directories
--- FAIL: TestCopyInplace (13.68s)
=== RUN   TestCopyLongFileName
    run.go:180: Remote "GCS bucket rclone-test-vijovix6fusi", Local "Local file system at /tmp/rclone3327980596", Modify Window "1ns"
    copy_test.go:403: Partial uploads not supported
2025/03/21 03:49:36 DEBUG : dst/: Removing directory marker
    run.go:125: removing dir "dst" failed - try 1/3: removing directory marker failed: googleapi: Error 404: No such object: rclone-test-vijovix6fusi/dst/, notFound
2025/03/21 03:49:37 DEBUG : dst/: Removing directory marker
    run.go:125: removing dir "dst" failed - try 2/3: removing directory marker failed: googleapi: Error 404: No such object: rclone-test-vijovix6fusi/dst/, notFound
2025/03/21 03:49:38 DEBUG : dst/: Removing directory marker
    run.go:125: removing dir "dst" failed - try 3/3: removing directory marker failed: googleapi: Error 404: No such object: rclone-test-vijovix6fusi/dst/, notFound
    run.go:128: removing dir "dst" failed: removing directory marker failed: googleapi: Error 404: No such object: rclone-test-vijovix6fusi/dst/, notFound
2025/03/21 03:49:39 DEBUG : BackupDir/: Removing directory marker
    run.go:125: removing dir "BackupDir" failed - try 1/3: removing directory marker failed: googleapi: Error 404: No such object: rclone-test-vijovix6fusi/BackupDir/, notFound
2025/03/21 03:49:41 DEBUG : BackupDir/: Removing directory marker
    run.go:125: removing dir "BackupDir" failed - try 2/3: removing directory marker failed: googleapi: Error 404: No such object: rclone-test-vijovix6fusi/BackupDir/, notFound
2025/03/21 03:49:42 DEBUG : BackupDir/: Removing directory marker
    run.go:125: removing dir "BackupDir" failed - try 3/3: removing directory marker failed: googleapi: Error 404: No such object: rclone-test-vijovix6fusi/BackupDir/, notFound
    run.go:128: removing dir "BackupDir" failed: removing directory marker failed: googleapi: Error 404: No such object: rclone-test-vijovix6fusi/BackupDir/, notFound
    fstest.go:292: Sleeping for 1s for list eventual consistency: 1/3
    fstest.go:292: Sleeping for 2s for list eventual consistency: 2/3
    fstest.go:292: Sleeping for 4s for list eventual consistency: 3/3
    fstest.go:321: 
        	Error Trace:	/home/rclone/go/src/github.com/rclone/rclone/fstest/fstest.go:321
        	            				/home/rclone/go/src/github.com/rclone/rclone/fstest/fstest.go:332
        	            				/home/rclone/go/src/github.com/rclone/rclone/fstest/run.go:173
        	            				/home/rclone/go/src/github.com/rclone/rclone/fstest/run.go:388
        	            				/home/rclone/go/pkg/mod/golang.org/toolchain@v0.0.1-go1.23.0.linux-amd64/src/testing/testing.go:1176
        	            				/home/rclone/go/pkg/mod/golang.org/toolchain@v0.0.1-go1.23.0.linux-amd64/src/testing/testing.go:1354
        	            				/home/rclone/go/pkg/mod/golang.org/toolchain@v0.0.1-go1.23.0.linux-amd64/src/testing/testing.go:1684
        	            				/home/rclone/go/pkg/mod/golang.org/toolchain@v0.0.1-go1.23.0.linux-amd64/src/runtime/panic.go:629
        	            				/home/rclone/go/pkg/mod/golang.org/toolchain@v0.0.1-go1.23.0.linux-amd64/src/testing/testing.go:1121
        	            				/home/rclone/go/pkg/mod/golang.org/toolchain@v0.0.1-go1.23.0.linux-amd64/src/testing/testing.go:1097
        	            				/home/rclone/go/src/github.com/rclone/rclone/fs/operations/copy_test.go:403
        	Error:      	Not equal: 
        	            	expected: []string{}
        	            	actual  : []string{"BackupDir", "dst"}
        	            	
        	            	Diff:
        	            	--- Expected
        	            	+++ Actual
        	            	@@ -1,2 +1,4 @@
        	            	-([]string) {
        	            	+([]string) (len=2) {
        	            	+ (string) (len=9) "BackupDir",
        	            	+ (string) (len=3) "dst"
        	            	 }
        	Test:       	TestCopyLongFileName
        	Messages:   	directories
--- FAIL: TestCopyLongFileName (13.60s)
=== RUN   TestCopyFileMaxTransfer
    run.go:180: Remote "GCS bucket rclone-test-vijovix6fusi", Local "Local file system at /tmp/rclone3327980596", Modify Window "1ns"
2025/03/21 03:49:50 DEBUG : TestCopyFileMaxTransfer/file1: Need to transfer - File not found at Destination
2025/03/21 03:49:50 DEBUG : TestCopyFileMaxTransfer/: Creating directory marker
2025/03/21 03:49:51 DEBUG : TestCopyFileMaxTransfer/file1: md5 = 0ef726ce9b1a7692357ff70dd321d595 OK
2025/03/21 03:49:51 INFO  : TestCopyFileMaxTransfer/file1: Copied (new)
2025/03/21 03:49:51 DEBUG : TestCopyFileMaxTransfer/file2: Need to transfer - File not found at Destination
2025/03/21 03:49:51 ERROR : TestCopyFileMaxTransfer/file2: Failed to copy: max transfer limit reached as set by --max-transfer
2025/03/21 03:49:52 DEBUG : TestCopyFileMaxTransfer/file3: Need to transfer - File not found at Destination
2025/03/21 03:49:52 DEBUG : TestCopyFileMaxTransfer/file4: Need to transfer - File not found at Destination
2025/03/21 03:49:52 DEBUG : TestCopyFileMaxTransfer/file4: md5 = 77a5150797e41dcb4bf77f31b62d8827 OK
2025/03/21 03:49:52 INFO  : TestCopyFileMaxTransfer/file4: Copied (new)
2025/03/21 03:49:53 DEBUG : dst/: Removing directory marker
    run.go:125: removing dir "dst" failed - try 1/3: removing directory marker failed: googleapi: Error 404: No such object: rclone-test-vijovix6fusi/dst/, notFound
2025/03/21 03:49:54 DEBUG : dst/: Removing directory marker
    run.go:125: removing dir "dst" failed - try 2/3: removing directory marker failed: googleapi: Error 404: No such object: rclone-test-vijovix6fusi/dst/, notFound
2025/03/21 03:49:55 DEBUG : dst/: Removing directory marker
    run.go:125: removing dir "dst" failed - try 3/3: removing directory marker failed: googleapi: Error 404: No such object: rclone-test-vijovix6fusi/dst/, notFound
    run.go:128: removing dir "dst" failed: removing directory marker failed: googleapi: Error 404: No such object: rclone-test-vijovix6fusi/dst/, notFound
2025/03/21 03:49:56 DEBUG : TestCopyFileMaxTransfer/: Removing directory marker
2025/03/21 03:49:56 DEBUG : BackupDir/: Removing directory marker
    run.go:125: removing dir "BackupDir" failed - try 1/3: removing directory marker failed: googleapi: Error 404: No such object: rclone-test-vijovix6fusi/BackupDir/, notFound
2025/03/21 03:49:57 DEBUG : BackupDir/: Removing directory marker
    run.go:125: removing dir "BackupDir" failed - try 2/3: removing directory marker failed: googleapi: Error 404: No such object: rclone-test-vijovix6fusi/BackupDir/, notFound
2025/03/21 03:49:58 DEBUG : BackupDir/: Removing directory marker
    run.go:125: removing dir "BackupDir" failed - try 3/3: removing directory marker failed: googleapi: Error 404: No such object: rclone-test-vijovix6fusi/BackupDir/, notFound
    run.go:128: removing dir "BackupDir" failed: removing directory marker failed: googleapi: Error 404: No such object: rclone-test-vijovix6fusi/BackupDir/, notFound
    fstest.go:292: Sleeping for 1s for list eventual consistency: 1/3
    fstest.go:292: Sleeping for 2s for list eventual consistency: 2/3
    fstest.go:292: Sleeping for 4s for list eventual consistency: 3/3
    fstest.go:321: 
        	Error Trace:	/home/rclone/go/src/github.com/rclone/rclone/fstest/fstest.go:321
        	            				/home/rclone/go/src/github.com/rclone/rclone/fstest/fstest.go:332
        	            				/home/rclone/go/src/github.com/rclone/rclone/fstest/run.go:173
        	            				/home/rclone/go/src/github.com/rclone/rclone/fstest/run.go:388
        	            				/home/rclone/go/pkg/mod/golang.org/toolchain@v0.0.1-go1.23.0.linux-amd64/src/testing/testing.go:1176
        	            				/home/rclone/go/pkg/mod/golang.org/toolchain@v0.0.1-go1.23.0.linux-amd64/src/testing/testing.go:1354
        	            				/home/rclone/go/pkg/mod/golang.org/toolchain@v0.0.1-go1.23.0.linux-amd64/src/testing/testing.go:1684
        	Error:      	Not equal: 
        	            	expected: []string{}
        	            	actual  : []string{"BackupDir", "dst"}
        	            	
        	            	Diff:
        	            	--- Expected
        	            	+++ Actual
        	            	@@ -1,2 +1,4 @@
        	            	-([]string) {
        	            	+([]string) (len=2) {
        	            	+ (string) (len=9) "BackupDir",
        	            	+ (string) (len=3) "dst"
        	            	 }
        	Test:       	TestCopyFileMaxTransfer
        	Messages:   	directories
--- FAIL: TestCopyFileMaxTransfer (16.88s)
=== RUN   TestDeduplicateInteractive
    run.go:180: Remote "GCS bucket rclone-test-vijovix6fusi", Local "Local file system at /tmp/rclone3327980596", Modify Window "1ns"
    dedupe_test.go:24: Can't test deduplicate - no duplicate files possible
2025/03/21 03:50:07 DEBUG : dst/: Removing directory marker
    run.go:125: removing dir "dst" failed - try 1/3: removing directory marker failed: googleapi: Error 404: No such object: rclone-test-vijovix6fusi/dst/, notFound
2025/03/21 03:50:08 DEBUG : dst/: Removing directory marker
    run.go:125: removing dir "dst" failed - try 2/3: removing directory marker failed: googleapi: Error 404: No such object: rclone-test-vijovix6fusi/dst/, notFound
2025/03/21 03:50:09 DEBUG : dst/: Removing directory marker
    run.go:125: removing dir "dst" failed - try 3/3: removing directory marker failed: googleapi: Error 404: No such object: rclone-test-vijovix6fusi/dst/, notFound
    run.go:128: removing dir "dst" failed: removing directory marker failed: googleapi: Error 404: No such object: rclone-test-vijovix6fusi/dst/, notFound
2025/03/21 03:50:10 DEBUG : BackupDir/: Removing directory marker
    run.go:125: removing dir "BackupDir" failed - try 1/3: removing directory marker failed: googleapi: Error 404: No such object: rclone-test-vijovix6fusi/BackupDir/, notFound
2025/03/21 03:50:11 DEBUG : BackupDir/: Removing directory marker
    run.go:125: removing dir "BackupDir" failed - try 2/3: removing directory marker failed: googleapi: Error 404: No such object: rclone-test-vijovix6fusi/BackupDir/, notFound
2025/03/21 03:50:12 DEBUG : BackupDir/: Removing directory marker
    run.go:125: removing dir "BackupDir" failed - try 3/3: removing directory marker failed: googleapi: Error 404: No such object: rclone-test-vijovix6fusi/BackupDir/, notFound
    run.go:128: removing dir "BackupDir" failed: removing directory marker failed: googleapi: Error 404: No such object: rclone-test-vijovix6fusi/BackupDir/, notFound
    fstest.go:292: Sleeping for 1s for list eventual consistency: 1/3
    fstest.go:292: Sleeping for 2s for list eventual consistency: 2/3
    fstest.go:292: Sleeping for 4s for list eventual consistency: 3/3
    fstest.go:321: 
        	Error Trace:	/home/rclone/go/src/github.com/rclone/rclone/fstest/fstest.go:321
        	            				/home/rclone/go/src/github.com/rclone/rclone/fstest/fstest.go:332
        	            				/home/rclone/go/src/github.com/rclone/rclone/fstest/run.go:173
        	            				/home/rclone/go/src/github.com/rclone/rclone/fstest/run.go:388
        	            				/home/rclone/go/pkg/mod/golang.org/toolchain@v0.0.1-go1.23.0.linux-amd64/src/testing/testing.go:1176
        	            				/home/rclone/go/pkg/mod/golang.org/toolchain@v0.0.1-go1.23.0.linux-amd64/src/testing/testing.go:1354
        	            				/home/rclone/go/pkg/mod/golang.org/toolchain@v0.0.1-go1.23.0.linux-amd64/src/testing/testing.go:1684
        	            				/home/rclone/go/pkg/mod/golang.org/toolchain@v0.0.1-go1.23.0.linux-amd64/src/runtime/panic.go:629
        	            				/home/rclone/go/pkg/mod/golang.org/toolchain@v0.0.1-go1.23.0.linux-amd64/src/testing/testing.go:1121
        	            				/home/rclone/go/pkg/mod/golang.org/toolchain@v0.0.1-go1.23.0.linux-amd64/src/testing/testing.go:1097
        	            				/home/rclone/go/src/github.com/rclone/rclone/fs/operations/dedupe_test.go:24
        	            				/home/rclone/go/src/github.com/rclone/rclone/fs/operations/dedupe_test.go:48
        	Error:      	Not equal: 
        	            	expected: []string{}
        	            	actual  : []string{"BackupDir", "dst"}
        	            	
        	            	Diff:
        	            	--- Expected
        	            	+++ Actual
        	            	@@ -1,2 +1,4 @@
        	            	-([]string) {
        	            	+([]string) (len=2) {
        	            	+ (string) (len=9) "BackupDir",
        	            	+ (string) (len=3) "dst"
        	            	 }
        	Test:       	TestDeduplicateInteractive
        	Messages:   	directories
--- FAIL: TestDeduplicateInteractive (13.70s)
=== RUN   TestDeduplicateSkip
    run.go:180: Remote "GCS bucket rclone-test-vijovix6fusi", Local "Local file system at /tmp/rclone3327980596", Modify Window "1ns"
    dedupe_test.go:24: Can't test deduplicate - no duplicate files possible
2025/03/21 03:50:20 DEBUG : dst/: Removing directory marker
    run.go:125: removing dir "dst" failed - try 1/3: removing directory marker failed: googleapi: Error 404: No such object: rclone-test-vijovix6fusi/dst/, notFound
2025/03/21 03:50:22 DEBUG : dst/: Removing directory marker
    run.go:125: removing dir "dst" failed - try 2/3: removing directory marker failed: googleapi: Error 404: No such object: rclone-test-vijovix6fusi/dst/, notFound
2025/03/21 03:50:23 DEBUG : dst/: Removing directory marker
    run.go:125: removing dir "dst" failed - try 3/3: removing directory marker failed: googleapi: Error 404: No such object: rclone-test-vijovix6fusi/dst/, notFound
    run.go:128: removing dir "dst" failed: removing directory marker failed: googleapi: Error 404: No such object: rclone-test-vijovix6fusi/dst/, notFound
2025/03/21 03:50:24 DEBUG : BackupDir/: Removing directory marker
    run.go:125: removing dir "BackupDir" failed - try 1/3: removing directory marker failed: googleapi: Error 404: No such object: rclone-test-vijovix6fusi/BackupDir/, notFound
2025/03/21 03:50:25 DEBUG : BackupDir/: Removing directory marker
    run.go:125: removing dir "BackupDir" failed - try 2/3: removing directory marker failed: googleapi: Error 404: No such object: rclone-test-vijovix6fusi/BackupDir/, notFound
2025/03/21 03:50:26 DEBUG : BackupDir/: Removing directory marker
    run.go:125: removing dir "BackupDir" failed - try 3/3: removing directory marker failed: googleapi: Error 404: No such object: rclone-test-vijovix6fusi/BackupDir/, notFound
    run.go:128: removing dir "BackupDir" failed: removing directory marker failed: googleapi: Error 404: No such object: rclone-test-vijovix6fusi/BackupDir/, notFound
    fstest.go:292: Sleeping for 1s for list eventual consistency: 1/3
    fstest.go:292: Sleeping for 2s for list eventual consistency: 2/3
    fstest.go:292: Sleeping for 4s for list eventual consistency: 3/3
    fstest.go:321: 
        	Error Trace:	/home/rclone/go/src/github.com/rclone/rclone/fstest/fstest.go:321
        	            				/home/rclone/go/src/github.com/rclone/rclone/fstest/fstest.go:332
        	            				/home/rclone/go/src/github.com/rclone/rclone/fstest/run.go:173
        	            				/home/rclone/go/src/github.com/rclone/rclone/fstest/run.go:388
        	            				/home/rclone/go/pkg/mod/golang.org/toolchain@v0.0.1-go1.23.0.linux-amd64/src/testing/testing.go:1176
        	            				/home/rclone/go/pkg/mod/golang.org/toolchain@v0.0.1-go1.23.0.linux-amd64/src/testing/testing.go:1354
        	            				/home/rclone/go/pkg/mod/golang.org/toolchain@v0.0.1-go1.23.0.linux-amd64/src/testing/testing.go:1684
        	            				/home/rclone/go/pkg/mod/golang.org/toolchain@v0.0.1-go1.23.0.linux-amd64/src/runtime/panic.go:629
        	            				/home/rclone/go/pkg/mod/golang.org/toolchain@v0.0.1-go1.23.0.linux-amd64/src/testing/testing.go:1121
        	            				/home/rclone/go/pkg/mod/golang.org/toolchain@v0.0.1-go1.23.0.linux-amd64/src/testing/testing.go:1097
        	            				/home/rclone/go/src/github.com/rclone/rclone/fs/operations/dedupe_test.go:24
        	            				/home/rclone/go/src/github.com/rclone/rclone/fs/operations/dedupe_test.go:64
        	Error:      	Not equal: 
        	            	expected: []string{}
        	            	actual  : []string{"BackupDir", "dst"}
        	            	
        	            	Diff:
        	            	--- Expected
        	            	+++ Actual
        	            	@@ -1,2 +1,4 @@
        	            	-([]string) {
        	            	+([]string) (len=2) {
        	            	+ (string) (len=9) "BackupDir",
        	            	+ (string) (len=3) "dst"
        	            	 }
        	Test:       	TestDeduplicateSkip
        	Messages:   	directories
--- FAIL: TestDeduplicateSkip (13.70s)
=== RUN   TestDeduplicateSizeOnly
    run.go:180: Remote "GCS bucket rclone-test-vijovix6fusi", Local "Local file system at /tmp/rclone3327980596", Modify Window "1ns"
    dedupe_test.go:24: Can't test deduplicate - no duplicate files possible
2025/03/21 03:50:34 DEBUG : dst/: Removing directory marker
    run.go:125: removing dir "dst" failed - try 1/3: removing directory marker failed: googleapi: Error 404: No such object: rclone-test-vijovix6fusi/dst/, notFound
2025/03/21 03:50:35 DEBUG : dst/: Removing directory marker
    run.go:125: removing dir "dst" failed - try 2/3: removing directory marker failed: googleapi: Error 404: No such object: rclone-test-vijovix6fusi/dst/, notFound
2025/03/21 03:50:36 DEBUG : dst/: Removing directory marker
    run.go:125: removing dir "dst" failed - try 3/3: removing directory marker failed: googleapi: Error 404: No such object: rclone-test-vijovix6fusi/dst/, notFound
    run.go:128: removing dir "dst" failed: removing directory marker failed: googleapi: Error 404: No such object: rclone-test-vijovix6fusi/dst/, notFound
2025/03/21 03:50:37 DEBUG : BackupDir/: Removing directory marker
    run.go:125: removing dir "BackupDir" failed - try 1/3: removing directory marker failed: googleapi: Error 404: No such object: rclone-test-vijovix6fusi/BackupDir/, notFound
2025/03/21 03:50:38 DEBUG : BackupDir/: Removing directory marker
    run.go:125: removing dir "BackupDir" failed - try 2/3: removing directory marker failed: googleapi: Error 404: No such object: rclone-test-vijovix6fusi/BackupDir/, notFound
2025/03/21 03:50:39 DEBUG : BackupDir/: Removing directory marker
    run.go:125: removing dir "BackupDir" failed - try 3/3: removing directory marker failed: googleapi: Error 404: No such object: rclone-test-vijovix6fusi/BackupDir/, notFound
    run.go:128: removing dir "BackupDir" failed: removing directory marker failed: googleapi: Error 404: No such object: rclone-test-vijovix6fusi/BackupDir/, notFound
    fstest.go:292: Sleeping for 1s for list eventual consistency: 1/3
    fstest.go:292: Sleeping for 2s for list eventual consistency: 2/3
    fstest.go:292: Sleeping for 4s for list eventual consistency: 3/3
    fstest.go:321: 
        	Error Trace:	/home/rclone/go/src/github.com/rclone/rclone/fstest/fstest.go:321
        	            				/home/rclone/go/src/github.com/rclone/rclone/fstest/fstest.go:332
        	            				/home/rclone/go/src/github.com/rclone/rclone/fstest/run.go:173
        	            				/home/rclone/go/src/github.com/rclone/rclone/fstest/run.go:388
        	            				/home/rclone/go/pkg/mod/golang.org/toolchain@v0.0.1-go1.23.0.linux-amd64/src/testing/testing.go:1176
        	            				/home/rclone/go/pkg/mod/golang.org/toolchain@v0.0.1-go1.23.0.linux-amd64/src/testing/testing.go:1354
        	            				/home/rclone/go/pkg/mod/golang.org/toolchain@v0.0.1-go1.23.0.linux-amd64/src/testing/testing.go:1684
        	            				/home/rclone/go/pkg/mod/golang.org/toolchain@v0.0.1-go1.23.0.linux-amd64/src/runtime/panic.go:629
        	            				/home/rclone/go/pkg/mod/golang.org/toolchain@v0.0.1-go1.23.0.linux-amd64/src/testing/testing.go:1121
        	            				/home/rclone/go/pkg/mod/golang.org/toolchain@v0.0.1-go1.23.0.linux-amd64/src/testing/testing.go:1097
        	            				/home/rclone/go/src/github.com/rclone/rclone/fs/operations/dedupe_test.go:24
        	            				/home/rclone/go/src/github.com/rclone/rclone/fs/operations/dedupe_test.go:85
        	Error:      	Not equal: 
        	            	expected: []string{}
        	            	actual  : []string{"BackupDir", "dst"}
        	            	
        	            	Diff:
        	            	--- Expected
        	            	+++ Actual
        	            	@@ -1,2 +1,4 @@
        	            	-([]string) {
        	            	+([]string) (len=2) {
        	            	+ (string) (len=9) "BackupDir",
        	            	+ (string) (len=3) "dst"
        	            	 }
        	Test:       	TestDeduplicateSizeOnly
        	Messages:   	directories
--- FAIL: TestDeduplicateSizeOnly (13.57s)
=== RUN   TestDeduplicateFirst
    run.go:180: Remote "GCS bucket rclone-test-vijovix6fusi", Local "Local file system at /tmp/rclone3327980596", Modify Window "1ns"
    dedupe_test.go:24: Can't test deduplicate - no duplicate files possible
2025/03/21 03:50:48 DEBUG : dst/: Removing directory marker
    run.go:125: removing dir "dst" failed - try 1/3: removing directory marker failed: googleapi: Error 404: No such object: rclone-test-vijovix6fusi/dst/, notFound
2025/03/21 03:50:49 DEBUG : dst/: Removing directory marker
    run.go:125: removing dir "dst" failed - try 2/3: removing directory marker failed: googleapi: Error 404: No such object: rclone-test-vijovix6fusi/dst/, notFound
2025/03/21 03:50:50 DEBUG : dst/: Removing directory marker
    run.go:125: removing dir "dst" failed - try 3/3: removing directory marker failed: googleapi: Error 404: No such object: rclone-test-vijovix6fusi/dst/, notFound
    run.go:128: removing dir "dst" failed: removing directory marker failed: googleapi: Error 404: No such object: rclone-test-vijovix6fusi/dst/, notFound
2025/03/21 03:50:51 DEBUG : BackupDir/: Removing directory marker
    run.go:125: removing dir "BackupDir" failed - try 1/3: removing directory marker failed: googleapi: Error 404: No such object: rclone-test-vijovix6fusi/BackupDir/, notFound
2025/03/21 03:50:52 DEBUG : BackupDir/: Removing directory marker
    run.go:125: removing dir "BackupDir" failed - try 2/3: removing directory marker failed: googleapi: Error 404: No such object: rclone-test-vijovix6fusi/BackupDir/, notFound
2025/03/21 03:50:53 DEBUG : BackupDir/: Removing directory marker
    run.go:125: removing dir "BackupDir" failed - try 3/3: removing directory marker failed: googleapi: Error 404: No such object: rclone-test-vijovix6fusi/BackupDir/, notFound
    run.go:128: removing dir "BackupDir" failed: removing directory marker failed: googleapi: Error 404: No such object: rclone-test-vijovix6fusi/BackupDir/, notFound
    fstest.go:292: Sleeping for 1s for list eventual consistency: 1/3
    fstest.go:292: Sleeping for 2s for list eventual consistency: 2/3
    fstest.go:292: Sleeping for 4s for list eventual consistency: 3/3
    fstest.go:321: 
        	Error Trace:	/home/rclone/go/src/github.com/rclone/rclone/fstest/fstest.go:321
        	            				/home/rclone/go/src/github.com/rclone/rclone/fstest/fstest.go:332
        	            				/home/rclone/go/src/github.com/rclone/rclone/fstest/run.go:173
        	            				/home/rclone/go/src/github.com/rclone/rclone/fstest/run.go:388
        	            				/home/rclone/go/pkg/mod/golang.org/toolchain@v0.0.1-go1.23.0.linux-amd64/src/testing/testing.go:1176
        	            				/home/rclone/go/pkg/mod/golang.org/toolchain@v0.0.1-go1.23.0.linux-amd64/src/testing/testing.go:1354
        	            				/home/rclone/go/pkg/mod/golang.org/toolchain@v0.0.1-go1.23.0.linux-amd64/src/testing/testing.go:1684
        	            				/home/rclone/go/pkg/mod/golang.org/toolchain@v0.0.1-go1.23.0.linux-amd64/src/runtime/panic.go:629
        	            				/home/rclone/go/pkg/mod/golang.org/toolchain@v0.0.1-go1.23.0.linux-amd64/src/testing/testing.go:1121
        	            				/home/rclone/go/pkg/mod/golang.org/toolchain@v0.0.1-go1.23.0.linux-amd64/src/testing/testing.go:1097
        	            				/home/rclone/go/src/github.com/rclone/rclone/fs/operations/dedupe_test.go:24
        	            				/home/rclone/go/src/github.com/rclone/rclone/fs/operations/dedupe_test.go:107
        	Error:      	Not equal: 
        	            	expected: []string{}
        	            	actual  : []string{"BackupDir", "dst"}
        	            	
        	            	Diff:
        	            	--- Expected
        	            	+++ Actual
        	            	@@ -1,2 +1,4 @@
        	            	-([]string) {
        	            	+([]string) (len=2) {
        	            	+ (string) (len=9) "BackupDir",
        	            	+ (string) (len=3) "dst"
        	            	 }
        	Test:       	TestDeduplicateFirst
        	Messages:   	directories
--- FAIL: TestDeduplicateFirst (13.55s)
=== RUN   TestDeduplicateNewest
    run.go:180: Remote "GCS bucket rclone-test-vijovix6fusi", Local "Local file system at /tmp/rclone3327980596", Modify Window "1ns"
    dedupe_test.go:24: Can't test deduplicate - no duplicate files possible
2025/03/21 03:51:01 DEBUG : dst/: Removing directory marker
    run.go:125: removing dir "dst" failed - try 1/3: removing directory marker failed: googleapi: Error 404: No such object: rclone-test-vijovix6fusi/dst/, notFound
2025/03/21 03:51:02 DEBUG : dst/: Removing directory marker
    run.go:125: removing dir "dst" failed - try 2/3: removing directory marker failed: googleapi: Error 404: No such object: rclone-test-vijovix6fusi/dst/, notFound
2025/03/21 03:51:03 DEBUG : dst/: Removing directory marker
    run.go:125: removing dir "dst" failed - try 3/3: removing directory marker failed: googleapi: Error 404: No such object: rclone-test-vijovix6fusi/dst/, notFound
    run.go:128: removing dir "dst" failed: removing directory marker failed: googleapi: Error 404: No such object: rclone-test-vijovix6fusi/dst/, notFound
2025/03/21 03:51:04 DEBUG : BackupDir/: Removing directory marker
    run.go:125: removing dir "BackupDir" failed - try 1/3: removing directory marker failed: googleapi: Error 404: No such object: rclone-test-vijovix6fusi/BackupDir/, notFound
2025/03/21 03:51:05 DEBUG : BackupDir/: Removing directory marker
    run.go:125: removing dir "BackupDir" failed - try 2/3: removing directory marker failed: googleapi: Error 404: No such object: rclone-test-vijovix6fusi/BackupDir/, notFound
2025/03/21 03:51:07 DEBUG : BackupDir/: Removing directory marker
    run.go:125: removing dir "BackupDir" failed - try 3/3: removing directory marker failed: googleapi: Error 404: No such object: rclone-test-vijovix6fusi/BackupDir/, notFound
    run.go:128: removing dir "BackupDir" failed: removing directory marker failed: googleapi: Error 404: No such object: rclone-test-vijovix6fusi/BackupDir/, notFound
    fstest.go:292: Sleeping for 1s for list eventual consistency: 1/3
    fstest.go:292: Sleeping for 2s for list eventual consistency: 2/3
    fstest.go:292: Sleeping for 4s for list eventual consistency: 3/3
    fstest.go:321: 
        	Error Trace:	/home/rclone/go/src/github.com/rclone/rclone/fstest/fstest.go:321
        	            				/home/rclone/go/src/github.com/rclone/rclone/fstest/fstest.go:332
        	            				/home/rclone/go/src/github.com/rclone/rclone/fstest/run.go:173
        	            				/home/rclone/go/src/github.com/rclone/rclone/fstest/run.go:388
        	            				/home/rclone/go/pkg/mod/golang.org/toolchain@v0.0.1-go1.23.0.linux-amd64/src/testing/testing.go:1176
        	            				/home/rclone/go/pkg/mod/golang.org/toolchain@v0.0.1-go1.23.0.linux-amd64/src/testing/testing.go:1354
        	            				/home/rclone/go/pkg/mod/golang.org/toolchain@v0.0.1-go1.23.0.linux-amd64/src/testing/testing.go:1684
        	            				/home/rclone/go/pkg/mod/golang.org/toolchain@v0.0.1-go1.23.0.linux-amd64/src/runtime/panic.go:629
        	            				/home/rclone/go/pkg/mod/golang.org/toolchain@v0.0.1-go1.23.0.linux-amd64/src/testing/testing.go:1121
        	            				/home/rclone/go/pkg/mod/golang.org/toolchain@v0.0.1-go1.23.0.linux-amd64/src/testing/testing.go:1097
        	            				/home/rclone/go/src/github.com/rclone/rclone/fs/operations/dedupe_test.go:24
        	            				/home/rclone/go/src/github.com/rclone/rclone/fs/operations/dedupe_test.go:135
        	Error:      	Not equal: 
        	            	expected: []string{}
        	            	actual  : []string{"BackupDir", "dst"}
        	            	
        	            	Diff:
        	            	--- Expected
        	            	+++ Actual
        	            	@@ -1,2 +1,4 @@
        	            	-([]string) {
        	            	+([]string) (len=2) {
        	            	+ (string) (len=9) "BackupDir",
        	            	+ (string) (len=3) "dst"
        	            	 }
        	Test:       	TestDeduplicateNewest
        	Messages:   	directories
--- FAIL: TestDeduplicateNewest (13.56s)
=== RUN   TestDeduplicateNewestByHash
    run.go:180: Remote "GCS bucket rclone-test-vijovix6fusi", Local "Local file system at /tmp/rclone3327980596", Modify Window "1ns"
2025/03/21 03:51:15 DEBUG : also/: Creating directory marker
2025/03/21 03:51:16 INFO  : GCS bucket rclone-test-vijovix6fusi: Looking for duplicate md5 hashes using newest mode.
2025/03/21 03:51:16 NOTICE: 35f5ed20034d9120d7220d3541774cf4: Found 3 files with duplicate md5 hashes
2025/03/21 03:51:16 INFO  : one: Deleted
2025/03/21 03:51:16 INFO  : also/one: Deleted
2025/03/21 03:51:16 NOTICE: 35f5ed20034d9120d7220d3541774cf4: Deleted 2 extra copies
2025/03/21 03:51:16 DEBUG : dst/: Removing directory marker
    run.go:125: removing dir "dst" failed - try 1/3: removing directory marker failed: googleapi: Error 404: No such object: rclone-test-vijovix6fusi/dst/, notFound
2025/03/21 03:51:17 DEBUG : dst/: Removing directory marker
    run.go:125: removing dir "dst" failed - try 2/3: removing directory marker failed: googleapi: Error 404: No such object: rclone-test-vijovix6fusi/dst/, notFound
2025/03/21 03:51:18 DEBUG : dst/: Removing directory marker
    run.go:125: removing dir "dst" failed - try 3/3: removing directory marker failed: googleapi: Error 404: No such object: rclone-test-vijovix6fusi/dst/, notFound
    run.go:128: removing dir "dst" failed: removing directory marker failed: googleapi: Error 404: No such object: rclone-test-vijovix6fusi/dst/, notFound
2025/03/21 03:51:19 DEBUG : also/: Removing directory marker
2025/03/21 03:51:19 DEBUG : BackupDir/: Removing directory marker
    run.go:125: removing dir "BackupDir" failed - try 1/3: removing directory marker failed: googleapi: Error 404: No such object: rclone-test-vijovix6fusi/BackupDir/, notFound
2025/03/21 03:51:20 DEBUG : BackupDir/: Removing directory marker
    run.go:125: removing dir "BackupDir" failed - try 2/3: removing directory marker failed: googleapi: Error 404: No such object: rclone-test-vijovix6fusi/BackupDir/, notFound
2025/03/21 03:51:22 DEBUG : BackupDir/: Removing directory marker
    run.go:125: removing dir "BackupDir" failed - try 3/3: removing directory marker failed: googleapi: Error 404: No such object: rclone-test-vijovix6fusi/BackupDir/, notFound
    run.go:128: removing dir "BackupDir" failed: removing directory marker failed: googleapi: Error 404: No such object: rclone-test-vijovix6fusi/BackupDir/, notFound
    fstest.go:292: Sleeping for 1s for list eventual consistency: 1/3
    fstest.go:292: Sleeping for 2s for list eventual consistency: 2/3
    fstest.go:292: Sleeping for 4s for list eventual consistency: 3/3
    fstest.go:321: 
        	Error Trace:	/home/rclone/go/src/github.com/rclone/rclone/fstest/fstest.go:321
        	            				/home/rclone/go/src/github.com/rclone/rclone/fstest/fstest.go:332
        	            				/home/rclone/go/src/github.com/rclone/rclone/fstest/run.go:173
        	            				/home/rclone/go/src/github.com/rclone/rclone/fstest/run.go:388
        	            				/home/rclone/go/pkg/mod/golang.org/toolchain@v0.0.1-go1.23.0.linux-amd64/src/testing/testing.go:1176
        	            				/home/rclone/go/pkg/mod/golang.org/toolchain@v0.0.1-go1.23.0.linux-amd64/src/testing/testing.go:1354
        	            				/home/rclone/go/pkg/mod/golang.org/toolchain@v0.0.1-go1.23.0.linux-amd64/src/testing/testing.go:1684
        	Error:      	Not equal: 
        	            	expected: []string{}
        	            	actual  : []string{"BackupDir", "dst"}
        	            	
        	            	Diff:
        	            	--- Expected
        	            	+++ Actual
        	            	@@ -1,2 +1,4 @@
        	            	-([]string) {
        	            	+([]string) (len=2) {
        	            	+ (string) (len=9) "BackupDir",
        	            	+ (string) (len=3) "dst"
        	            	 }
        	Test:       	TestDeduplicateNewestByHash
        	Messages:   	directories
--- FAIL: TestDeduplicateNewestByHash (14.98s)
=== RUN   TestDeduplicateOldest
    run.go:180: Remote "GCS bucket rclone-test-vijovix6fusi", Local "Local file system at /tmp/rclone3327980596", Modify Window "1ns"
    dedupe_test.go:24: Can't test deduplicate - no duplicate files possible
2025/03/21 03:51:30 DEBUG : dst/: Removing directory marker
    run.go:125: removing dir "dst" failed - try 1/3: removing directory marker failed: googleapi: Error 404: No such object: rclone-test-vijovix6fusi/dst/, notFound
2025/03/21 03:51:31 DEBUG : dst/: Removing directory marker
    run.go:125: removing dir "dst" failed - try 2/3: removing directory marker failed: googleapi: Error 404: No such object: rclone-test-vijovix6fusi/dst/, notFound
2025/03/21 03:51:32 DEBUG : dst/: Removing directory marker
    run.go:125: removing dir "dst" failed - try 3/3: removing directory marker failed: googleapi: Error 404: No such object: rclone-test-vijovix6fusi/dst/, notFound
    run.go:128: removing dir "dst" failed: removing directory marker failed: googleapi: Error 404: No such object: rclone-test-vijovix6fusi/dst/, notFound
2025/03/21 03:51:33 DEBUG : BackupDir/: Removing directory marker
    run.go:125: removing dir "BackupDir" failed - try 1/3: removing directory marker failed: googleapi: Error 404: No such object: rclone-test-vijovix6fusi/BackupDir/, notFound
2025/03/21 03:51:34 DEBUG : BackupDir/: Removing directory marker
    run.go:125: removing dir "BackupDir" failed - try 2/3: removing directory marker failed: googleapi: Error 404: No such object: rclone-test-vijovix6fusi/BackupDir/, notFound
2025/03/21 03:51:35 DEBUG : BackupDir/: Removing directory marker
    run.go:125: removing dir "BackupDir" failed - try 3/3: removing directory marker failed: googleapi: Error 404: No such object: rclone-test-vijovix6fusi/BackupDir/, notFound
    run.go:128: removing dir "BackupDir" failed: removing directory marker failed: googleapi: Error 404: No such object: rclone-test-vijovix6fusi/BackupDir/, notFound
    fstest.go:292: Sleeping for 1s for list eventual consistency: 1/3
    fstest.go:292: Sleeping for 2s for list eventual consistency: 2/3
    fstest.go:292: Sleeping for 4s for list eventual consistency: 3/3
    fstest.go:321: 
        	Error Trace:	/home/rclone/go/src/github.com/rclone/rclone/fstest/fstest.go:321
        	            				/home/rclone/go/src/github.com/rclone/rclone/fstest/fstest.go:332
        	            				/home/rclone/go/src/github.com/rclone/rclone/fstest/run.go:173
        	            				/home/rclone/go/src/github.com/rclone/rclone/fstest/run.go:388
        	            				/home/rclone/go/pkg/mod/golang.org/toolchain@v0.0.1-go1.23.0.linux-amd64/src/testing/testing.go:1176
        	            				/home/rclone/go/pkg/mod/golang.org/toolchain@v0.0.1-go1.23.0.linux-amd64/src/testing/testing.go:1354
        	            				/home/rclone/go/pkg/mod/golang.org/toolchain@v0.0.1-go1.23.0.linux-amd64/src/testing/testing.go:1684
        	            				/home/rclone/go/pkg/mod/golang.org/toolchain@v0.0.1-go1.23.0.linux-amd64/src/runtime/panic.go:629
        	            				/home/rclone/go/pkg/mod/golang.org/toolchain@v0.0.1-go1.23.0.linux-amd64/src/testing/testing.go:1121
        	            				/home/rclone/go/pkg/mod/golang.org/toolchain@v0.0.1-go1.23.0.linux-amd64/src/testing/testing.go:1097
        	            				/home/rclone/go/src/github.com/rclone/rclone/fs/operations/dedupe_test.go:24
        	            				/home/rclone/go/src/github.com/rclone/rclone/fs/operations/dedupe_test.go:169
        	Error:      	Not equal: 
        	            	expected: []string{}
        	            	actual  : []string{"BackupDir", "dst"}
        	            	
        	            	Diff:
        	            	--- Expected
        	            	+++ Actual
        	            	@@ -1,2 +1,4 @@
        	            	-([]string) {
        	            	+([]string) (len=2) {
        	            	+ (string) (len=9) "BackupDir",
        	            	+ (string) (len=3) "dst"
        	            	 }
        	Test:       	TestDeduplicateOldest
        	Messages:   	directories
--- FAIL: TestDeduplicateOldest (13.55s)
=== RUN   TestDeduplicateLargest
    run.go:180: Remote "GCS bucket rclone-test-vijovix6fusi", Local "Local file system at /tmp/rclone3327980596", Modify Window "1ns"
    dedupe_test.go:24: Can't test deduplicate - no duplicate files possible
2025/03/21 03:51:43 DEBUG : dst/: Removing directory marker
    run.go:125: removing dir "dst" failed - try 1/3: removing directory marker failed: googleapi: Error 404: No such object: rclone-test-vijovix6fusi/dst/, notFound
2025/03/21 03:51:44 DEBUG : dst/: Removing directory marker
    run.go:125: removing dir "dst" failed - try 2/3: removing directory marker failed: googleapi: Error 404: No such object: rclone-test-vijovix6fusi/dst/, notFound
2025/03/21 03:51:45 DEBUG : dst/: Removing directory marker
    run.go:125: removing dir "dst" failed - try 3/3: removing directory marker failed: googleapi: Error 404: No such object: rclone-test-vijovix6fusi/dst/, notFound
    run.go:128: removing dir "dst" failed: removing directory marker failed: googleapi: Error 404: No such object: rclone-test-vijovix6fusi/dst/, notFound
2025/03/21 03:51:47 DEBUG : BackupDir/: Removing directory marker
    run.go:125: removing dir "BackupDir" failed - try 1/3: removing directory marker failed: googleapi: Error 404: No such object: rclone-test-vijovix6fusi/BackupDir/, notFound
2025/03/21 03:51:48 DEBUG : BackupDir/: Removing directory marker
    run.go:125: removing dir "BackupDir" failed - try 2/3: removing directory marker failed: googleapi: Error 404: No such object: rclone-test-vijovix6fusi/BackupDir/, notFound
2025/03/21 03:51:49 DEBUG : BackupDir/: Removing directory marker
    run.go:125: removing dir "BackupDir" failed - try 3/3: removing directory marker failed: googleapi: Error 404: No such object: rclone-test-vijovix6fusi/BackupDir/, notFound
    run.go:128: removing dir "BackupDir" failed: removing directory marker failed: googleapi: Error 404: No such object: rclone-test-vijovix6fusi/BackupDir/, notFound
    fstest.go:292: Sleeping for 1s for list eventual consistency: 1/3
    fstest.go:292: Sleeping for 2s for list eventual consistency: 2/3
    fstest.go:292: Sleeping for 4s for list eventual consistency: 3/3
    fstest.go:321: 
        	Error Trace:	/home/rclone/go/src/github.com/rclone/rclone/fstest/fstest.go:321
        	            				/home/rclone/go/src/github.com/rclone/rclone/fstest/fstest.go:332
        	            				/home/rclone/go/src/github.com/rclone/rclone/fstest/run.go:173
        	            				/home/rclone/go/src/github.com/rclone/rclone/fstest/run.go:388
        	            				/home/rclone/go/pkg/mod/golang.org/toolchain@v0.0.1-go1.23.0.linux-amd64/src/testing/testing.go:1176
        	            				/home/rclone/go/pkg/mod/golang.org/toolchain@v0.0.1-go1.23.0.linux-amd64/src/testing/testing.go:1354
        	            				/home/rclone/go/pkg/mod/golang.org/toolchain@v0.0.1-go1.23.0.linux-amd64/src/testing/testing.go:1684
        	            				/home/rclone/go/pkg/mod/golang.org/toolchain@v0.0.1-go1.23.0.linux-amd64/src/runtime/panic.go:629
        	            				/home/rclone/go/pkg/mod/golang.org/toolchain@v0.0.1-go1.23.0.linux-amd64/src/testing/testing.go:1121
        	            				/home/rclone/go/pkg/mod/golang.org/toolchain@v0.0.1-go1.23.0.linux-amd64/src/testing/testing.go:1097
        	            				/home/rclone/go/src/github.com/rclone/rclone/fs/operations/dedupe_test.go:24
        	            				/home/rclone/go/src/github.com/rclone/rclone/fs/operations/dedupe_test.go:184
        	Error:      	Not equal: 
        	            	expected: []string{}
        	            	actual  : []string{"BackupDir", "dst"}
        	            	
        	            	Diff:
        	            	--- Expected
        	            	+++ Actual
        	            	@@ -1,2 +1,4 @@
        	            	-([]string) {
        	            	+([]string) (len=2) {
        	            	+ (string) (len=9) "BackupDir",
        	            	+ (string) (len=3) "dst"
        	            	 }
        	Test:       	TestDeduplicateLargest
        	Messages:   	directories
--- FAIL: TestDeduplicateLargest (13.56s)
=== RUN   TestDeduplicateSmallest
    run.go:180: Remote "GCS bucket rclone-test-vijovix6fusi", Local "Local file system at /tmp/rclone3327980596", Modify Window "1ns"
    dedupe_test.go:24: Can't test deduplicate - no duplicate files possible
2025/03/21 03:51:57 DEBUG : dst/: Removing directory marker
    run.go:125: removing dir "dst" failed - try 1/3: removing directory marker failed: googleapi: Error 404: No such object: rclone-test-vijovix6fusi/dst/, notFound
2025/03/21 03:51:58 DEBUG : dst/: Removing directory marker
    run.go:125: removing dir "dst" failed - try 2/3: removing directory marker failed: googleapi: Error 404: No such object: rclone-test-vijovix6fusi/dst/, notFound
2025/03/21 03:51:59 DEBUG : dst/: Removing directory marker
    run.go:125: removing dir "dst" failed - try 3/3: removing directory marker failed: googleapi: Error 404: No such object: rclone-test-vijovix6fusi/dst/, notFound
    run.go:128: removing dir "dst" failed: removing directory marker failed: googleapi: Error 404: No such object: rclone-test-vijovix6fusi/dst/, notFound
2025/03/21 03:52:00 DEBUG : BackupDir/: Removing directory marker
    run.go:125: removing dir "BackupDir" failed - try 1/3: removing directory marker failed: googleapi: Error 404: No such object: rclone-test-vijovix6fusi/BackupDir/, notFound
2025/03/21 03:52:01 DEBUG : BackupDir/: Removing directory marker
    run.go:125: removing dir "BackupDir" failed - try 2/3: removing directory marker failed: googleapi: Error 404: No such object: rclone-test-vijovix6fusi/BackupDir/, notFound
2025/03/21 03:52:02 DEBUG : BackupDir/: Removing directory marker
    run.go:125: removing dir "BackupDir" failed - try 3/3: removing directory marker failed: googleapi: Error 404: No such object: rclone-test-vijovix6fusi/BackupDir/, notFound
    run.go:128: removing dir "BackupDir" failed: removing directory marker failed: googleapi: Error 404: No such object: rclone-test-vijovix6fusi/BackupDir/, notFound
    fstest.go:292: Sleeping for 1s for list eventual consistency: 1/3
    fstest.go:292: Sleeping for 2s for list eventual consistency: 2/3
    fstest.go:292: Sleeping for 4s for list eventual consistency: 3/3
    fstest.go:321: 
        	Error Trace:	/home/rclone/go/src/github.com/rclone/rclone/fstest/fstest.go:321
        	            				/home/rclone/go/src/github.com/rclone/rclone/fstest/fstest.go:332
        	            				/home/rclone/go/src/github.com/rclone/rclone/fstest/run.go:173
        	            				/home/rclone/go/src/github.com/rclone/rclone/fstest/run.go:388
        	            				/home/rclone/go/pkg/mod/golang.org/toolchain@v0.0.1-go1.23.0.linux-amd64/src/testing/testing.go:1176
        	            				/home/rclone/go/pkg/mod/golang.org/toolchain@v0.0.1-go1.23.0.linux-amd64/src/testing/testing.go:1354
        	            				/home/rclone/go/pkg/mod/golang.org/toolchain@v0.0.1-go1.23.0.linux-amd64/src/testing/testing.go:1684
        	            				/home/rclone/go/pkg/mod/golang.org/toolchain@v0.0.1-go1.23.0.linux-amd64/src/runtime/panic.go:629
        	            				/home/rclone/go/pkg/mod/golang.org/toolchain@v0.0.1-go1.23.0.linux-amd64/src/testing/testing.go:1121
        	            				/home/rclone/go/pkg/mod/golang.org/toolchain@v0.0.1-go1.23.0.linux-amd64/src/testing/testing.go:1097
        	            				/home/rclone/go/src/github.com/rclone/rclone/fs/operations/dedupe_test.go:24
        	            				/home/rclone/go/src/github.com/rclone/rclone/fs/operations/dedupe_test.go:199
        	Error:      	Not equal: 
        	            	expected: []string{}
        	            	actual  : []string{"BackupDir", "dst"}
        	            	
        	            	Diff:
        	            	--- Expected
        	            	+++ Actual
        	            	@@ -1,2 +1,4 @@
        	            	-([]string) {
        	            	+([]string) (len=2) {
        	            	+ (string) (len=9) "BackupDir",
        	            	+ (string) (len=3) "dst"
        	            	 }
        	Test:       	TestDeduplicateSmallest
        	Messages:   	directories
--- FAIL: TestDeduplicateSmallest (13.55s)
=== RUN   TestDeduplicateRename
    run.go:180: Remote "GCS bucket rclone-test-vijovix6fusi", Local "Local file system at /tmp/rclone3327980596", Modify Window "1ns"
    dedupe_test.go:24: Can't test deduplicate - no duplicate files possible
2025/03/21 03:52:10 DEBUG : dst/: Removing directory marker
    run.go:125: removing dir "dst" failed - try 1/3: removing directory marker failed: googleapi: Error 404: No such object: rclone-test-vijovix6fusi/dst/, notFound
2025/03/21 03:52:12 DEBUG : dst/: Removing directory marker
    run.go:125: removing dir "dst" failed - try 2/3: removing directory marker failed: googleapi: Error 404: No such object: rclone-test-vijovix6fusi/dst/, notFound
2025/03/21 03:52:13 DEBUG : dst/: Removing directory marker
    run.go:125: removing dir "dst" failed - try 3/3: removing directory marker failed: googleapi: Error 404: No such object: rclone-test-vijovix6fusi/dst/, notFound
    run.go:128: removing dir "dst" failed: removing directory marker failed: googleapi: Error 404: No such object: rclone-test-vijovix6fusi/dst/, notFound
2025/03/21 03:52:14 DEBUG : BackupDir/: Removing directory marker
    run.go:125: removing dir "BackupDir" failed - try 1/3: removing directory marker failed: googleapi: Error 404: No such object: rclone-test-vijovix6fusi/BackupDir/, notFound
2025/03/21 03:52:15 DEBUG : BackupDir/: Removing directory marker
    run.go:125: removing dir "BackupDir" failed - try 2/3: removing directory marker failed: googleapi: Error 404: No such object: rclone-test-vijovix6fusi/BackupDir/, notFound
2025/03/21 03:52:16 DEBUG : BackupDir/: Removing directory marker
    run.go:125: removing dir "BackupDir" failed - try 3/3: removing directory marker failed: googleapi: Error 404: No such object: rclone-test-vijovix6fusi/BackupDir/, notFound
    run.go:128: removing dir "BackupDir" failed: removing directory marker failed: googleapi: Error 404: No such object: rclone-test-vijovix6fusi/BackupDir/, notFound
    fstest.go:292: Sleeping for 1s for list eventual consistency: 1/3
    fstest.go:292: Sleeping for 2s for list eventual consistency: 2/3
    fstest.go:292: Sleeping for 4s for list eventual consistency: 3/3
    fstest.go:321: 
        	Error Trace:	/home/rclone/go/src/github.com/rclone/rclone/fstest/fstest.go:321
        	            				/home/rclone/go/src/github.com/rclone/rclone/fstest/fstest.go:332
        	            				/home/rclone/go/src/github.com/rclone/rclone/fstest/run.go:173
        	            				/home/rclone/go/src/github.com/rclone/rclone/fstest/run.go:388
        	            				/home/rclone/go/pkg/mod/golang.org/toolchain@v0.0.1-go1.23.0.linux-amd64/src/testing/testing.go:1176
        	            				/home/rclone/go/pkg/mod/golang.org/toolchain@v0.0.1-go1.23.0.linux-amd64/src/testing/testing.go:1354
        	            				/home/rclone/go/pkg/mod/golang.org/toolchain@v0.0.1-go1.23.0.linux-amd64/src/testing/testing.go:1684
        	            				/home/rclone/go/pkg/mod/golang.org/toolchain@v0.0.1-go1.23.0.linux-amd64/src/runtime/panic.go:629
        	            				/home/rclone/go/pkg/mod/golang.org/toolchain@v0.0.1-go1.23.0.linux-amd64/src/testing/testing.go:1121
        	            				/home/rclone/go/pkg/mod/golang.org/toolchain@v0.0.1-go1.23.0.linux-amd64/src/testing/testing.go:1097
        	            				/home/rclone/go/src/github.com/rclone/rclone/fs/operations/dedupe_test.go:24
        	            				/home/rclone/go/src/github.com/rclone/rclone/fs/operations/dedupe_test.go:214
        	Error:      	Not equal: 
        	            	expected: []string{}
        	            	actual  : []string{"BackupDir", "dst"}
        	            	
        	            	Diff:
        	            	--- Expected
        	            	+++ Actual
        	            	@@ -1,2 +1,4 @@
        	            	-([]string) {
        	            	+([]string) (len=2) {
        	            	+ (string) (len=9) "BackupDir",
        	            	+ (string) (len=3) "dst"
        	            	 }
        	Test:       	TestDeduplicateRename
        	Messages:   	directories
--- FAIL: TestDeduplicateRename (13.55s)
=== RUN   TestMergeDirs
    run.go:180: Remote "GCS bucket rclone-test-vijovix6fusi", Local "Local file system at /tmp/rclone3327980596", Modify Window "1ns"
    dedupe_test.go:256: Can't merge directories
2025/03/21 03:52:24 DEBUG : dst/: Removing directory marker
    run.go:125: removing dir "dst" failed - try 1/3: removing directory marker failed: googleapi: Error 404: No such object: rclone-test-vijovix6fusi/dst/, notFound
2025/03/21 03:52:25 DEBUG : dst/: Removing directory marker
    run.go:125: removing dir "dst" failed - try 2/3: removing directory marker failed: googleapi: Error 404: No such object: rclone-test-vijovix6fusi/dst/, notFound
2025/03/21 03:52:26 DEBUG : dst/: Removing directory marker
    run.go:125: removing dir "dst" failed - try 3/3: removing directory marker failed: googleapi: Error 404: No such object: rclone-test-vijovix6fusi/dst/, notFound
    run.go:128: removing dir "dst" failed: removing directory marker failed: googleapi: Error 404: No such object: rclone-test-vijovix6fusi/dst/, notFound
2025/03/21 03:52:27 DEBUG : BackupDir/: Removing directory marker
    run.go:125: removing dir "BackupDir" failed - try 1/3: removing directory marker failed: googleapi: Error 404: No such object: rclone-test-vijovix6fusi/BackupDir/, notFound
2025/03/21 03:52:28 DEBUG : BackupDir/: Removing directory marker
    run.go:125: removing dir "BackupDir" failed - try 2/3: removing directory marker failed: googleapi: Error 404: No such object: rclone-test-vijovix6fusi/BackupDir/, notFound
2025/03/21 03:52:29 DEBUG : BackupDir/: Removing directory marker
    run.go:125: removing dir "BackupDir" failed - try 3/3: removing directory marker failed: googleapi: Error 404: No such object: rclone-test-vijovix6fusi/BackupDir/, notFound
    run.go:128: removing dir "BackupDir" failed: removing directory marker failed: googleapi: Error 404: No such object: rclone-test-vijovix6fusi/BackupDir/, notFound
    fstest.go:292: Sleeping for 1s for list eventual consistency: 1/3
    fstest.go:292: Sleeping for 2s for list eventual consistency: 2/3
    fstest.go:292: Sleeping for 4s for list eventual consistency: 3/3
    fstest.go:321: 
        	Error Trace:	/home/rclone/go/src/github.com/rclone/rclone/fstest/fstest.go:321
        	            				/home/rclone/go/src/github.com/rclone/rclone/fstest/fstest.go:332
        	            				/home/rclone/go/src/github.com/rclone/rclone/fstest/run.go:173
        	            				/home/rclone/go/src/github.com/rclone/rclone/fstest/run.go:388
        	            				/home/rclone/go/pkg/mod/golang.org/toolchain@v0.0.1-go1.23.0.linux-amd64/src/testing/testing.go:1176
        	            				/home/rclone/go/pkg/mod/golang.org/toolchain@v0.0.1-go1.23.0.linux-amd64/src/testing/testing.go:1354
        	            				/home/rclone/go/pkg/mod/golang.org/toolchain@v0.0.1-go1.23.0.linux-amd64/src/testing/testing.go:1684
        	            				/home/rclone/go/pkg/mod/golang.org/toolchain@v0.0.1-go1.23.0.linux-amd64/src/runtime/panic.go:629
        	            				/home/rclone/go/pkg/mod/golang.org/toolchain@v0.0.1-go1.23.0.linux-amd64/src/testing/testing.go:1121
        	            				/home/rclone/go/pkg/mod/golang.org/toolchain@v0.0.1-go1.23.0.linux-amd64/src/testing/testing.go:1097
        	            				/home/rclone/go/src/github.com/rclone/rclone/fs/operations/dedupe_test.go:256
        	Error:      	Not equal: 
        	            	expected: []string{}
        	            	actual  : []string{"BackupDir", "dst"}
        	            	
        	            	Diff:
        	            	--- Expected
        	            	+++ Actual
        	            	@@ -1,2 +1,4 @@
        	            	-([]string) {
        	            	+([]string) (len=2) {
        	            	+ (string) (len=9) "BackupDir",
        	            	+ (string) (len=3) "dst"
        	            	 }
        	Test:       	TestMergeDirs
        	Messages:   	directories
--- FAIL: TestMergeDirs (13.57s)
=== RUN   TestListDirSorted
    run.go:180: Remote "GCS bucket rclone-test-vijovix6fusi", Local "Local file system at /tmp/rclone3327980596", Modify Window "1ns"
2025/03/21 03:52:38 DEBUG : sub dir/: Creating directory marker
2025/03/21 03:52:39 DEBUG : sub dir/ignore dir/: Creating directory marker
2025/03/21 03:52:39 DEBUG : sub dir/sub sub dir/: Creating directory marker
    listdirsorted_test.go:57: 
        	Error Trace:	/home/rclone/go/src/github.com/rclone/rclone/fs/operations/listdirsorted_test.go:57
        	Error:      	"[BackupDir a.txt dst sub dir zend.txt]" should have 3 item(s), but has 5
        	Test:       	TestListDirSorted
2025/03/21 03:52:40 DEBUG : sub dir/sub sub dir/: Removing directory marker
2025/03/21 03:52:40 DEBUG : sub dir/ignore dir/: Removing directory marker
2025/03/21 03:52:41 DEBUG : sub dir/: Removing directory marker
2025/03/21 03:52:41 DEBUG : dst/: Removing directory marker
    run.go:125: removing dir "dst" failed - try 1/3: removing directory marker failed: googleapi: Error 404: No such object: rclone-test-vijovix6fusi/dst/, notFound
2025/03/21 03:52:42 DEBUG : dst/: Removing directory marker
    run.go:125: removing dir "dst" failed - try 2/3: removing directory marker failed: googleapi: Error 404: No such object: rclone-test-vijovix6fusi/dst/, notFound
2025/03/21 03:52:43 DEBUG : dst/: Removing directory marker
    run.go:125: removing dir "dst" failed - try 3/3: removing directory marker failed: googleapi: Error 404: No such object: rclone-test-vijovix6fusi/dst/, notFound
    run.go:128: removing dir "dst" failed: removing directory marker failed: googleapi: Error 404: No such object: rclone-test-vijovix6fusi/dst/, notFound
2025/03/21 03:52:44 DEBUG : BackupDir/: Removing directory marker
    run.go:125: removing dir "BackupDir" failed - try 1/3: removing directory marker failed: googleapi: Error 404: No such object: rclone-test-vijovix6fusi/BackupDir/, notFound
2025/03/21 03:52:45 DEBUG : BackupDir/: Removing directory marker
    run.go:125: removing dir "BackupDir" failed - try 2/3: removing directory marker failed: googleapi: Error 404: No such object: rclone-test-vijovix6fusi/BackupDir/, notFound
2025/03/21 03:52:46 DEBUG : BackupDir/: Removing directory marker
    run.go:125: removing dir "BackupDir" failed - try 3/3: removing directory marker failed: googleapi: Error 404: No such object: rclone-test-vijovix6fusi/BackupDir/, notFound
    run.go:128: removing dir "BackupDir" failed: removing directory marker failed: googleapi: Error 404: No such object: rclone-test-vijovix6fusi/BackupDir/, notFound
    fstest.go:292: Sleeping for 1s for list eventual consistency: 1/3
    fstest.go:292: Sleeping for 2s for list eventual consistency: 2/3
    fstest.go:292: Sleeping for 4s for list eventual consistency: 3/3
    fstest.go:321: 
        	Error Trace:	/home/rclone/go/src/github.com/rclone/rclone/fstest/fstest.go:321
        	            				/home/rclone/go/src/github.com/rclone/rclone/fstest/fstest.go:332
        	            				/home/rclone/go/src/github.com/rclone/rclone/fstest/run.go:173
        	            				/home/rclone/go/src/github.com/rclone/rclone/fstest/run.go:388
        	            				/home/rclone/go/pkg/mod/golang.org/toolchain@v0.0.1-go1.23.0.linux-amd64/src/testing/testing.go:1176
        	            				/home/rclone/go/pkg/mod/golang.org/toolchain@v0.0.1-go1.23.0.linux-amd64/src/testing/testing.go:1354
        	            				/home/rclone/go/pkg/mod/golang.org/toolchain@v0.0.1-go1.23.0.linux-amd64/src/testing/testing.go:1684
        	            				/home/rclone/go/pkg/mod/golang.org/toolchain@v0.0.1-go1.23.0.linux-amd64/src/runtime/panic.go:629
        	            				/home/rclone/go/pkg/mod/golang.org/toolchain@v0.0.1-go1.23.0.linux-amd64/src/testing/testing.go:1006
        	            				/home/rclone/go/src/github.com/rclone/rclone/fs/operations/listdirsorted_test.go:57
        	Error:      	Not equal: 
        	            	expected: []string{}
        	            	actual  : []string{"BackupDir", "dst"}
        	            	
        	            	Diff:
        	            	--- Expected
        	            	+++ Actual
        	            	@@ -1,2 +1,4 @@
        	            	-([]string) {
        	            	+([]string) (len=2) {
        	            	+ (string) (len=9) "BackupDir",
        	            	+ (string) (len=3) "dst"
        	            	 }
        	Test:       	TestListDirSorted
        	Messages:   	directories
--- FAIL: TestListDirSorted (16.57s)
=== RUN   TestListJSON
    run.go:180: Remote "GCS bucket rclone-test-vijovix6fusi", Local "Local file system at /tmp/rclone3327980596", Modify Window "1ns"
2025/03/21 03:52:55 DEBUG : sub/: Creating directory marker
=== RUN   TestListJSON/Default
    lsjson_test.go:202: 
        	Error Trace:	/home/rclone/go/src/github.com/rclone/rclone/fs/operations/lsjson_test.go:202
        	Error:      	Not equal: 
        	            	expected: 2
        	            	actual  : 4
        	Test:       	TestListJSON/Default
        	Messages:   	Wrong number of results
=== RUN   TestListJSON/DirsOnly
    lsjson_test.go:202: 
        	Error Trace:	/home/rclone/go/src/github.com/rclone/rclone/fs/operations/lsjson_test.go:202
        	Error:      	Not equal: 
        	            	expected: 1
        	            	actual  : 3
        	Test:       	TestListJSON/DirsOnly
        	Messages:   	Wrong number of results
=== RUN   TestListJSON/Recurse
    lsjson_test.go:202: 
        	Error Trace:	/home/rclone/go/src/github.com/rclone/rclone/fs/operations/lsjson_test.go:202
        	Error:      	Not equal: 
        	            	expected: 3
        	            	actual  : 5
        	Test:       	TestListJSON/Recurse
        	Messages:   	Wrong number of results
=== RUN   TestListJSON/Metadata
    lsjson_test.go:202: 
        	Error Trace:	/home/rclone/go/src/github.com/rclone/rclone/fs/operations/lsjson_test.go:202
        	Error:      	Not equal: 
        	            	expected: 2
        	            	actual  : 4
        	Test:       	TestListJSON/Metadata
        	Messages:   	Wrong number of results
2025/03/21 03:52:55 DEBUG : sub/: Removing directory marker
2025/03/21 03:52:55 DEBUG : dst/: Removing directory marker
=== NAME  TestListJSON
    run.go:125: removing dir "dst" failed - try 1/3: removing directory marker failed: googleapi: Error 404: No such object: rclone-test-vijovix6fusi/dst/, notFound
2025/03/21 03:52:56 DEBUG : dst/: Removing directory marker
    run.go:125: removing dir "dst" failed - try 2/3: removing directory marker failed: googleapi: Error 404: No such object: rclone-test-vijovix6fusi/dst/, notFound
2025/03/21 03:52:57 DEBUG : dst/: Removing directory marker
    run.go:125: removing dir "dst" failed - try 3/3: removing directory marker failed: googleapi: Error 404: No such object: rclone-test-vijovix6fusi/dst/, notFound
    run.go:128: removing dir "dst" failed: removing directory marker failed: googleapi: Error 404: No such object: rclone-test-vijovix6fusi/dst/, notFound
2025/03/21 03:52:58 DEBUG : BackupDir/: Removing directory marker
    run.go:125: removing dir "BackupDir" failed - try 1/3: removing directory marker failed: googleapi: Error 404: No such object: rclone-test-vijovix6fusi/BackupDir/, notFound
2025/03/21 03:52:59 DEBUG : BackupDir/: Removing directory marker
    run.go:125: removing dir "BackupDir" failed - try 2/3: removing directory marker failed: googleapi: Error 404: No such object: rclone-test-vijovix6fusi/BackupDir/, notFound
2025/03/21 03:53:01 DEBUG : BackupDir/: Removing directory marker
    run.go:125: removing dir "BackupDir" failed - try 3/3: removing directory marker failed: googleapi: Error 404: No such object: rclone-test-vijovix6fusi/BackupDir/, notFound
    run.go:128: removing dir "BackupDir" failed: removing directory marker failed: googleapi: Error 404: No such object: rclone-test-vijovix6fusi/BackupDir/, notFound
    fstest.go:292: Sleeping for 1s for list eventual consistency: 1/3
    fstest.go:292: Sleeping for 2s for list eventual consistency: 2/3
    fstest.go:292: Sleeping for 4s for list eventual consistency: 3/3
    fstest.go:321: 
        	Error Trace:	/home/rclone/go/src/github.com/rclone/rclone/fstest/fstest.go:321
        	            				/home/rclone/go/src/github.com/rclone/rclone/fstest/fstest.go:332
        	            				/home/rclone/go/src/github.com/rclone/rclone/fstest/run.go:173
        	            				/home/rclone/go/src/github.com/rclone/rclone/fstest/run.go:388
        	            				/home/rclone/go/pkg/mod/golang.org/toolchain@v0.0.1-go1.23.0.linux-amd64/src/testing/testing.go:1176
        	            				/home/rclone/go/pkg/mod/golang.org/toolchain@v0.0.1-go1.23.0.linux-amd64/src/testing/testing.go:1354
        	            				/home/rclone/go/pkg/mod/golang.org/toolchain@v0.0.1-go1.23.0.linux-amd64/src/testing/testing.go:1684
        	Error:      	Not equal: 
        	            	expected: []string{}
        	            	actual  : []string{"BackupDir", "dst"}
        	            	
        	            	Diff:
        	            	--- Expected
        	            	+++ Actual
        	            	@@ -1,2 +1,4 @@
        	            	-([]string) {
        	            	+([]string) (len=2) {
        	            	+ (string) (len=9) "BackupDir",
        	            	+ (string) (len=3) "dst"
        	            	 }
        	Test:       	TestListJSON
        	Messages:   	directories
--- FAIL: TestListJSON (14.69s)
    --- FAIL: TestListJSON/Default (0.06s)
    --- FAIL: TestListJSON/DirsOnly (0.06s)
    --- FAIL: TestListJSON/Recurse (0.06s)
    --- FAIL: TestListJSON/Metadata (0.06s)
=== RUN   TestStatJSON
    run.go:180: Remote "GCS bucket rclone-test-vijovix6fusi", Local "Local file system at /tmp/rclone3327980596", Modify Window "1ns"
2025/03/21 03:53:09 DEBUG : sub/: Creating directory marker
=== RUN   TestStatJSON/Root
=== RUN   TestStatJSON/RootFilesOnly
=== RUN   TestStatJSON/RootDirsOnly
=== RUN   TestStatJSON/Dir
=== RUN   TestStatJSON/DirWithTrailingSlash
=== RUN   TestStatJSON/File
=== RUN   TestStatJSON/NotFound
=== RUN   TestStatJSON/DirFilesOnly
=== RUN   TestStatJSON/FileFilesOnly
=== RUN   TestStatJSON/NotFoundFilesOnly
=== RUN   TestStatJSON/DirDirsOnly
=== RUN   TestStatJSON/FileDirsOnly
=== RUN   TestStatJSON/NotFoundDirsOnly
=== RUN   TestStatJSON/RootNotFound
2025/03/21 03:53:11 DEBUG : Creating backend with remote "TestGoogleCloudStorage,directory_markers:rclone-test-vijovix6fusi/notfound"
2025/03/21 03:53:11 DEBUG : TestGoogleCloudStorage: detected overridden config - adding "{juk_h}" suffix to name
2025/03/21 03:53:12 DEBUG : sub/: Removing directory marker
2025/03/21 03:53:12 DEBUG : dst/: Removing directory marker
=== NAME  TestStatJSON
    run.go:125: removing dir "dst" failed - try 1/3: removing directory marker failed: googleapi: Error 404: No such object: rclone-test-vijovix6fusi/dst/, notFound
2025/03/21 03:53:14 DEBUG : dst/: Removing directory marker
    run.go:125: removing dir "dst" failed - try 2/3: removing directory marker failed: googleapi: Error 404: No such object: rclone-test-vijovix6fusi/dst/, notFound
2025/03/21 03:53:15 DEBUG : dst/: Removing directory marker
    run.go:125: removing dir "dst" failed - try 3/3: removing directory marker failed: googleapi: Error 404: No such object: rclone-test-vijovix6fusi/dst/, notFound
    run.go:128: removing dir "dst" failed: removing directory marker failed: googleapi: Error 404: No such object: rclone-test-vijovix6fusi/dst/, notFound
2025/03/21 03:53:16 DEBUG : BackupDir/: Removing directory marker
    run.go:125: removing dir "BackupDir" failed - try 1/3: removing directory marker failed: googleapi: Error 404: No such object: rclone-test-vijovix6fusi/BackupDir/, notFound
2025/03/21 03:53:17 DEBUG : BackupDir/: Removing directory marker
    run.go:125: removing dir "BackupDir" failed - try 2/3: removing directory marker failed: googleapi: Error 404: No such object: rclone-test-vijovix6fusi/BackupDir/, notFound
2025/03/21 03:53:18 DEBUG : BackupDir/: Removing directory marker
    run.go:125: removing dir "BackupDir" failed - try 3/3: removing directory marker failed: googleapi: Error 404: No such object: rclone-test-vijovix6fusi/BackupDir/, notFound
    run.go:128: removing dir "BackupDir" failed: removing directory marker failed: googleapi: Error 404: No such object: rclone-test-vijovix6fusi/BackupDir/, notFound
    fstest.go:292: Sleeping for 1s for list eventual consistency: 1/3
    fstest.go:292: Sleeping for 2s for list eventual consistency: 2/3
    fstest.go:292: Sleeping for 4s for list eventual consistency: 3/3
    fstest.go:321: 
        	Error Trace:	/home/rclone/go/src/github.com/rclone/rclone/fstest/fstest.go:321
        	            				/home/rclone/go/src/github.com/rclone/rclone/fstest/fstest.go:332
        	            				/home/rclone/go/src/github.com/rclone/rclone/fstest/run.go:173
        	            				/home/rclone/go/src/github.com/rclone/rclone/fstest/run.go:388
        	            				/home/rclone/go/pkg/mod/golang.org/toolchain@v0.0.1-go1.23.0.linux-amd64/src/testing/testing.go:1176
        	            				/home/rclone/go/pkg/mod/golang.org/toolchain@v0.0.1-go1.23.0.linux-amd64/src/testing/testing.go:1354
        	            				/home/rclone/go/pkg/mod/golang.org/toolchain@v0.0.1-go1.23.0.linux-amd64/src/testing/testing.go:1684
        	Error:      	Not equal: 
        	            	expected: []string{}
        	            	actual  : []string{"BackupDir", "dst"}
        	            	
        	            	Diff:
        	            	--- Expected
        	            	+++ Actual
        	            	@@ -1,2 +1,4 @@
        	            	-([]string) {
        	            	+([]string) (len=2) {
        	            	+ (string) (len=9) "BackupDir",
        	            	+ (string) (len=3) "dst"
        	            	 }
        	Test:       	TestStatJSON
        	Messages:   	directories
--- FAIL: TestStatJSON (17.20s)
    --- PASS: TestStatJSON/Root (0.06s)
    --- PASS: TestStatJSON/RootFilesOnly (0.00s)
    --- PASS: TestStatJSON/RootDirsOnly (0.06s)
    --- PASS: TestStatJSON/Dir (0.39s)
    --- PASS: TestStatJSON/DirWithTrailingSlash (0.06s)
    --- PASS: TestStatJSON/File (0.06s)
    --- PASS: TestStatJSON/NotFound (0.36s)
    --- PASS: TestStatJSON/DirFilesOnly (0.24s)
    --- PASS: TestStatJSON/FileFilesOnly (0.05s)
    --- PASS: TestStatJSON/NotFoundFilesOnly (0.25s)
    --- PASS: TestStatJSON/DirDirsOnly (0.06s)
    --- PASS: TestStatJSON/FileDirsOnly (0.06s)
    --- PASS: TestStatJSON/NotFoundDirsOnly (0.06s)
    --- PASS: TestStatJSON/RootNotFound (1.03s)
=== RUN   TestMkdir
    run.go:180: Remote "GCS bucket rclone-test-vijovix6fusi", Local "Local file system at /tmp/rclone3327980596", Modify Window "1ns"
2025/03/21 03:53:26 INFO  : GCS bucket rclone-test-vijovix6fusi: Making directory
2025/03/21 03:53:26 INFO  : GCS bucket rclone-test-vijovix6fusi: Making directory
2025/03/21 03:53:26 DEBUG : dst/: Removing directory marker
    run.go:125: removing dir "dst" failed - try 1/3: removing directory marker failed: googleapi: Error 404: No such object: rclone-test-vijovix6fusi/dst/, notFound
2025/03/21 03:53:27 DEBUG : dst/: Removing directory marker
    run.go:125: removing dir "dst" failed - try 2/3: removing directory marker failed: googleapi: Error 404: No such object: rclone-test-vijovix6fusi/dst/, notFound
2025/03/21 03:53:28 DEBUG : dst/: Removing directory marker
    run.go:125: removing dir "dst" failed - try 3/3: removing directory marker failed: googleapi: Error 404: No such object: rclone-test-vijovix6fusi/dst/, notFound
    run.go:128: removing dir "dst" failed: removing directory marker failed: googleapi: Error 404: No such object: rclone-test-vijovix6fusi/dst/, notFound
2025/03/21 03:53:29 DEBUG : BackupDir/: Removing directory marker
    run.go:125: removing dir "BackupDir" failed - try 1/3: removing directory marker failed: googleapi: Error 404: No such object: rclone-test-vijovix6fusi/BackupDir/, notFound
2025/03/21 03:53:30 DEBUG : BackupDir/: Removing directory marker
    run.go:125: removing dir "BackupDir" failed - try 2/3: removing directory marker failed: googleapi: Error 404: No such object: rclone-test-vijovix6fusi/BackupDir/, notFound
2025/03/21 03:53:31 DEBUG : BackupDir/: Removing directory marker
    run.go:125: removing dir "BackupDir" failed - try 3/3: removing directory marker failed: googleapi: Error 404: No such object: rclone-test-vijovix6fusi/BackupDir/, notFound
    run.go:128: removing dir "BackupDir" failed: removing directory marker failed: googleapi: Error 404: No such object: rclone-test-vijovix6fusi/BackupDir/, notFound
    fstest.go:292: Sleeping for 1s for list eventual consistency: 1/3
    fstest.go:292: Sleeping for 2s for list eventual consistency: 2/3
    fstest.go:292: Sleeping for 4s for list eventual consistency: 3/3
    fstest.go:321: 
        	Error Trace:	/home/rclone/go/src/github.com/rclone/rclone/fstest/fstest.go:321
        	            				/home/rclone/go/src/github.com/rclone/rclone/fstest/fstest.go:332
        	            				/home/rclone/go/src/github.com/rclone/rclone/fstest/run.go:173
        	            				/home/rclone/go/src/github.com/rclone/rclone/fstest/run.go:388
        	            				/home/rclone/go/pkg/mod/golang.org/toolchain@v0.0.1-go1.23.0.linux-amd64/src/testing/testing.go:1176
        	            				/home/rclone/go/pkg/mod/golang.org/toolchain@v0.0.1-go1.23.0.linux-amd64/src/testing/testing.go:1354
        	            				/home/rclone/go/pkg/mod/golang.org/toolchain@v0.0.1-go1.23.0.linux-amd64/src/testing/testing.go:1684
        	Error:      	Not equal: 
        	            	expected: []string{}
        	            	actual  : []string{"BackupDir", "dst"}
        	            	
        	            	Diff:
        	            	--- Expected
        	            	+++ Actual
        	            	@@ -1,2 +1,4 @@
        	            	-([]string) {
        	            	+([]string) (len=2) {
        	            	+ (string) (len=9) "BackupDir",
        	            	+ (string) (len=3) "dst"
        	            	 }
        	Test:       	TestMkdir
        	Messages:   	directories
--- FAIL: TestMkdir (13.63s)
=== RUN   TestLsd
    run.go:180: Remote "GCS bucket rclone-test-vijovix6fusi", Local "Local file system at /tmp/rclone3327980596", Modify Window "1ns"
2025/03/21 03:53:40 DEBUG : sub dir/: Creating directory marker
2025/03/21 03:53:40 DEBUG : sub dir/: Removing directory marker
2025/03/21 03:53:40 DEBUG : dst/: Removing directory marker
    run.go:125: removing dir "dst" failed - try 1/3: removing directory marker failed: googleapi: Error 404: No such object: rclone-test-vijovix6fusi/dst/, notFound
2025/03/21 03:53:42 DEBUG : dst/: Removing directory marker
    run.go:125: removing dir "dst" failed - try 2/3: removing directory marker failed: googleapi: Error 404: No such object: rclone-test-vijovix6fusi/dst/, notFound
2025/03/21 03:53:43 DEBUG : dst/: Removing directory marker
    run.go:125: removing dir "dst" failed - try 3/3: removing directory marker failed: googleapi: Error 404: No such object: rclone-test-vijovix6fusi/dst/, notFound
    run.go:128: removing dir "dst" failed: removing directory marker failed: googleapi: Error 404: No such object: rclone-test-vijovix6fusi/dst/, notFound
2025/03/21 03:53:44 DEBUG : BackupDir/: Removing directory marker
    run.go:125: removing dir "BackupDir" failed - try 1/3: removing directory marker failed: googleapi: Error 404: No such object: rclone-test-vijovix6fusi/BackupDir/, notFound
2025/03/21 03:53:45 DEBUG : BackupDir/: Removing directory marker
    run.go:125: removing dir "BackupDir" failed - try 2/3: removing directory marker failed: googleapi: Error 404: No such object: rclone-test-vijovix6fusi/BackupDir/, notFound
2025/03/21 03:53:46 DEBUG : BackupDir/: Removing directory marker
    run.go:125: removing dir "BackupDir" failed - try 3/3: removing directory marker failed: googleapi: Error 404: No such object: rclone-test-vijovix6fusi/BackupDir/, notFound
    run.go:128: removing dir "BackupDir" failed: removing directory marker failed: googleapi: Error 404: No such object: rclone-test-vijovix6fusi/BackupDir/, notFound
    fstest.go:292: Sleeping for 1s for list eventual consistency: 1/3
    fstest.go:292: Sleeping for 2s for list eventual consistency: 2/3
    fstest.go:292: Sleeping for 4s for list eventual consistency: 3/3
    fstest.go:321: 
        	Error Trace:	/home/rclone/go/src/github.com/rclone/rclone/fstest/fstest.go:321
        	            				/home/rclone/go/src/github.com/rclone/rclone/fstest/fstest.go:332
        	            				/home/rclone/go/src/github.com/rclone/rclone/fstest/run.go:173
        	            				/home/rclone/go/src/github.com/rclone/rclone/fstest/run.go:388
        	            				/home/rclone/go/pkg/mod/golang.org/toolchain@v0.0.1-go1.23.0.linux-amd64/src/testing/testing.go:1176
        	            				/home/rclone/go/pkg/mod/golang.org/toolchain@v0.0.1-go1.23.0.linux-amd64/src/testing/testing.go:1354
        	            				/home/rclone/go/pkg/mod/golang.org/toolchain@v0.0.1-go1.23.0.linux-amd64/src/testing/testing.go:1684
        	Error:      	Not equal: 
        	            	expected: []string{}
        	            	actual  : []string{"BackupDir", "dst"}
        	            	
        	            	Diff:
        	            	--- Expected
        	            	+++ Actual
        	            	@@ -1,2 +1,4 @@
        	            	-([]string) {
        	            	+([]string) (len=2) {
        	            	+ (string) (len=9) "BackupDir",
        	            	+ (string) (len=3) "dst"
        	            	 }
        	Test:       	TestLsd
        	Messages:   	directories
--- FAIL: TestLsd (14.37s)
=== RUN   TestLs
    run.go:180: Remote "GCS bucket rclone-test-vijovix6fusi", Local "Local file system at /tmp/rclone3327980596", Modify Window "1ns"
2025/03/21 03:53:55 DEBUG : dst/: Removing directory marker
    run.go:125: removing dir "dst" failed - try 1/3: removing directory marker failed: googleapi: Error 404: No such object: rclone-test-vijovix6fusi/dst/, notFound
2025/03/21 03:53:56 DEBUG : dst/: Removing directory marker
    run.go:125: removing dir "dst" failed - try 2/3: removing directory marker failed: googleapi: Error 404: No such object: rclone-test-vijovix6fusi/dst/, notFound
2025/03/21 03:53:57 DEBUG : dst/: Removing directory marker
    run.go:125: removing dir "dst" failed - try 3/3: removing directory marker failed: googleapi: Error 404: No such object: rclone-test-vijovix6fusi/dst/, notFound
    run.go:128: removing dir "dst" failed: removing directory marker failed: googleapi: Error 404: No such object: rclone-test-vijovix6fusi/dst/, notFound
2025/03/21 03:53:58 DEBUG : BackupDir/: Removing directory marker
    run.go:125: removing dir "BackupDir" failed - try 1/3: removing directory marker failed: googleapi: Error 404: No such object: rclone-test-vijovix6fusi/BackupDir/, notFound
2025/03/21 03:53:59 DEBUG : BackupDir/: Removing directory marker
    run.go:125: removing dir "BackupDir" failed - try 2/3: removing directory marker failed: googleapi: Error 404: No such object: rclone-test-vijovix6fusi/BackupDir/, notFound
2025/03/21 03:54:00 DEBUG : BackupDir/: Removing directory marker
    run.go:125: removing dir "BackupDir" failed - try 3/3: removing directory marker failed: googleapi: Error 404: No such object: rclone-test-vijovix6fusi/BackupDir/, notFound
    run.go:128: removing dir "BackupDir" failed: removing directory marker failed: googleapi: Error 404: No such object: rclone-test-vijovix6fusi/BackupDir/, notFound
    fstest.go:292: Sleeping for 1s for list eventual consistency: 1/3
    fstest.go:292: Sleeping for 2s for list eventual consistency: 2/3
    fstest.go:292: Sleeping for 4s for list eventual consistency: 3/3
    fstest.go:321: 
        	Error Trace:	/home/rclone/go/src/github.com/rclone/rclone/fstest/fstest.go:321
        	            				/home/rclone/go/src/github.com/rclone/rclone/fstest/fstest.go:332
        	            				/home/rclone/go/src/github.com/rclone/rclone/fstest/run.go:173
        	            				/home/rclone/go/src/github.com/rclone/rclone/fstest/run.go:388
        	            				/home/rclone/go/pkg/mod/golang.org/toolchain@v0.0.1-go1.23.0.linux-amd64/src/testing/testing.go:1176
        	            				/home/rclone/go/pkg/mod/golang.org/toolchain@v0.0.1-go1.23.0.linux-amd64/src/testing/testing.go:1354
        	            				/home/rclone/go/pkg/mod/golang.org/toolchain@v0.0.1-go1.23.0.linux-amd64/src/testing/testing.go:1684
        	Error:      	Not equal: 
        	            	expected: []string{}
        	            	actual  : []string{"BackupDir", "dst"}
        	            	
        	            	Diff:
        	            	--- Expected
        	            	+++ Actual
        	            	@@ -1,2 +1,4 @@
        	            	-([]string) {
        	            	+([]string) (len=2) {
        	            	+ (string) (len=9) "BackupDir",
        	            	+ (string) (len=3) "dst"
        	            	 }
        	Test:       	TestLs
        	Messages:   	directories
--- FAIL: TestLs (14.05s)
=== RUN   TestLsWithFilesFrom
    run.go:180: Remote "GCS bucket rclone-test-vijovix6fusi", Local "Local file system at /tmp/rclone3327980596", Modify Window "1ns"
2025/03/21 03:54:08 DEBUG : BackupDir: Excluded
2025/03/21 03:54:08 DEBUG : dst: Excluded
2025/03/21 03:54:08 DEBUG : empty space: Excluded (FilesFrom Filter)
2025/03/21 03:54:08 DEBUG : empty space: Excluded
2025/03/21 03:54:09 DEBUG : dst/: Removing directory marker
    run.go:125: removing dir "dst" failed - try 1/3: removing directory marker failed: googleapi: Error 404: No such object: rclone-test-vijovix6fusi/dst/, notFound
2025/03/21 03:54:10 DEBUG : dst/: Removing directory marker
    run.go:125: removing dir "dst" failed - try 2/3: removing directory marker failed: googleapi: Error 404: No such object: rclone-test-vijovix6fusi/dst/, notFound
2025/03/21 03:54:11 DEBUG : dst/: Removing directory marker
    run.go:125: removing dir "dst" failed - try 3/3: removing directory marker failed: googleapi: Error 404: No such object: rclone-test-vijovix6fusi/dst/, notFound
    run.go:128: removing dir "dst" failed: removing directory marker failed: googleapi: Error 404: No such object: rclone-test-vijovix6fusi/dst/, notFound
2025/03/21 03:54:12 DEBUG : BackupDir/: Removing directory marker
    run.go:125: removing dir "BackupDir" failed - try 1/3: removing directory marker failed: googleapi: Error 404: No such object: rclone-test-vijovix6fusi/BackupDir/, notFound
2025/03/21 03:54:13 DEBUG : BackupDir/: Removing directory marker
    run.go:125: removing dir "BackupDir" failed - try 2/3: removing directory marker failed: googleapi: Error 404: No such object: rclone-test-vijovix6fusi/BackupDir/, notFound
2025/03/21 03:54:14 DEBUG : BackupDir/: Removing directory marker
    run.go:125: removing dir "BackupDir" failed - try 3/3: removing directory marker failed: googleapi: Error 404: No such object: rclone-test-vijovix6fusi/BackupDir/, notFound
    run.go:128: removing dir "BackupDir" failed: removing directory marker failed: googleapi: Error 404: No such object: rclone-test-vijovix6fusi/BackupDir/, notFound
    fstest.go:292: Sleeping for 1s for list eventual consistency: 1/3
    fstest.go:292: Sleeping for 2s for list eventual consistency: 2/3
    fstest.go:292: Sleeping for 4s for list eventual consistency: 3/3
    fstest.go:321: 
        	Error Trace:	/home/rclone/go/src/github.com/rclone/rclone/fstest/fstest.go:321
        	            				/home/rclone/go/src/github.com/rclone/rclone/fstest/fstest.go:332
        	            				/home/rclone/go/src/github.com/rclone/rclone/fstest/run.go:173
        	            				/home/rclone/go/src/github.com/rclone/rclone/fstest/run.go:388
        	            				/home/rclone/go/pkg/mod/golang.org/toolchain@v0.0.1-go1.23.0.linux-amd64/src/testing/testing.go:1176
        	            				/home/rclone/go/pkg/mod/golang.org/toolchain@v0.0.1-go1.23.0.linux-amd64/src/testing/testing.go:1354
        	            				/home/rclone/go/pkg/mod/golang.org/toolchain@v0.0.1-go1.23.0.linux-amd64/src/testing/testing.go:1684
        	Error:      	Not equal: 
        	            	expected: []string{}
        	            	actual  : []string{"BackupDir", "dst"}
        	            	
        	            	Diff:
        	            	--- Expected
        	            	+++ Actual
        	            	@@ -1,2 +1,4 @@
        	            	-([]string) {
        	            	+([]string) (len=2) {
        	            	+ (string) (len=9) "BackupDir",
        	            	+ (string) (len=3) "dst"
        	            	 }
        	Test:       	TestLsWithFilesFrom
        	Messages:   	directories
--- FAIL: TestLsWithFilesFrom (14.39s)
=== RUN   TestLsLong
    run.go:180: Remote "GCS bucket rclone-test-vijovix6fusi", Local "Local file system at /tmp/rclone3327980596", Modify Window "1ns"
2025/03/21 03:54:23 DEBUG : dst/: Removing directory marker
    run.go:125: removing dir "dst" failed - try 1/3: removing directory marker failed: googleapi: Error 404: No such object: rclone-test-vijovix6fusi/dst/, notFound
2025/03/21 03:54:24 DEBUG : dst/: Removing directory marker
    run.go:125: removing dir "dst" failed - try 2/3: removing directory marker failed: googleapi: Error 404: No such object: rclone-test-vijovix6fusi/dst/, notFound
2025/03/21 03:54:25 DEBUG : dst/: Removing directory marker
    run.go:125: removing dir "dst" failed - try 3/3: removing directory marker failed: googleapi: Error 404: No such object: rclone-test-vijovix6fusi/dst/, notFound
    run.go:128: removing dir "dst" failed: removing directory marker failed: googleapi: Error 404: No such object: rclone-test-vijovix6fusi/dst/, notFound
2025/03/21 03:54:26 DEBUG : BackupDir/: Removing directory marker
    run.go:125: removing dir "BackupDir" failed - try 1/3: removing directory marker failed: googleapi: Error 404: No such object: rclone-test-vijovix6fusi/BackupDir/, notFound
2025/03/21 03:54:27 DEBUG : BackupDir/: Removing directory marker
    run.go:125: removing dir "BackupDir" failed - try 2/3: removing directory marker failed: googleapi: Error 404: No such object: rclone-test-vijovix6fusi/BackupDir/, notFound
2025/03/21 03:54:28 DEBUG : BackupDir/: Removing directory marker
    run.go:125: removing dir "BackupDir" failed - try 3/3: removing directory marker failed: googleapi: Error 404: No such object: rclone-test-vijovix6fusi/BackupDir/, notFound
    run.go:128: removing dir "BackupDir" failed: removing directory marker failed: googleapi: Error 404: No such object: rclone-test-vijovix6fusi/BackupDir/, notFound
    fstest.go:292: Sleeping for 1s for list eventual consistency: 1/3
    fstest.go:292: Sleeping for 2s for list eventual consistency: 2/3
    fstest.go:292: Sleeping for 4s for list eventual consistency: 3/3
    fstest.go:321: 
        	Error Trace:	/home/rclone/go/src/github.com/rclone/rclone/fstest/fstest.go:321
        	            				/home/rclone/go/src/github.com/rclone/rclone/fstest/fstest.go:332
        	            				/home/rclone/go/src/github.com/rclone/rclone/fstest/run.go:173
        	            				/home/rclone/go/src/github.com/rclone/rclone/fstest/run.go:388
        	            				/home/rclone/go/pkg/mod/golang.org/toolchain@v0.0.1-go1.23.0.linux-amd64/src/testing/testing.go:1176
        	            				/home/rclone/go/pkg/mod/golang.org/toolchain@v0.0.1-go1.23.0.linux-amd64/src/testing/testing.go:1354
        	            				/home/rclone/go/pkg/mod/golang.org/toolchain@v0.0.1-go1.23.0.linux-amd64/src/testing/testing.go:1684
        	Error:      	Not equal: 
        	            	expected: []string{}
        	            	actual  : []string{"BackupDir", "dst"}
        	            	
        	            	Diff:
        	            	--- Expected
        	            	+++ Actual
        	            	@@ -1,2 +1,4 @@
        	            	-([]string) {
        	            	+([]string) (len=2) {
        	            	+ (string) (len=9) "BackupDir",
        	            	+ (string) (len=3) "dst"
        	            	 }
        	Test:       	TestLsLong
        	Messages:   	directories
--- FAIL: TestLsLong (14.04s)
=== RUN   TestHashSums
    run.go:180: Remote "GCS bucket rclone-test-vijovix6fusi", Local "Local file system at /tmp/rclone3327980596", Modify Window "1ns"
=== RUN   TestHashSums/Md5
=== RUN   TestHashSums/Md5Download
2025/03/21 03:54:37 DEBUG : dst/: Removing directory marker
=== NAME  TestHashSums
    run.go:125: removing dir "dst" failed - try 1/3: removing directory marker failed: googleapi: Error 404: No such object: rclone-test-vijovix6fusi/dst/, notFound
2025/03/21 03:54:38 DEBUG : dst/: Removing directory marker
    run.go:125: removing dir "dst" failed - try 2/3: removing directory marker failed: googleapi: Error 404: No such object: rclone-test-vijovix6fusi/dst/, notFound
2025/03/21 03:54:39 DEBUG : dst/: Removing directory marker
    run.go:125: removing dir "dst" failed - try 3/3: removing directory marker failed: googleapi: Error 404: No such object: rclone-test-vijovix6fusi/dst/, notFound
    run.go:128: removing dir "dst" failed: removing directory marker failed: googleapi: Error 404: No such object: rclone-test-vijovix6fusi/dst/, notFound
2025/03/21 03:54:40 DEBUG : BackupDir/: Removing directory marker
    run.go:125: removing dir "BackupDir" failed - try 1/3: removing directory marker failed: googleapi: Error 404: No such object: rclone-test-vijovix6fusi/BackupDir/, notFound
2025/03/21 03:54:41 DEBUG : BackupDir/: Removing directory marker
    run.go:125: removing dir "BackupDir" failed - try 2/3: removing directory marker failed: googleapi: Error 404: No such object: rclone-test-vijovix6fusi/BackupDir/, notFound
2025/03/21 03:54:42 DEBUG : BackupDir/: Removing directory marker
    run.go:125: removing dir "BackupDir" failed - try 3/3: removing directory marker failed: googleapi: Error 404: No such object: rclone-test-vijovix6fusi/BackupDir/, notFound
    run.go:128: removing dir "BackupDir" failed: removing directory marker failed: googleapi: Error 404: No such object: rclone-test-vijovix6fusi/BackupDir/, notFound
    fstest.go:292: Sleeping for 1s for list eventual consistency: 1/3
    fstest.go:292: Sleeping for 2s for list eventual consistency: 2/3
    fstest.go:292: Sleeping for 4s for list eventual consistency: 3/3
    fstest.go:321: 
        	Error Trace:	/home/rclone/go/src/github.com/rclone/rclone/fstest/fstest.go:321
        	            				/home/rclone/go/src/github.com/rclone/rclone/fstest/fstest.go:332
        	            				/home/rclone/go/src/github.com/rclone/rclone/fstest/run.go:173
        	            				/home/rclone/go/src/github.com/rclone/rclone/fstest/run.go:388
        	            				/home/rclone/go/pkg/mod/golang.org/toolchain@v0.0.1-go1.23.0.linux-amd64/src/testing/testing.go:1176
        	            				/home/rclone/go/pkg/mod/golang.org/toolchain@v0.0.1-go1.23.0.linux-amd64/src/testing/testing.go:1354
        	            				/home/rclone/go/pkg/mod/golang.org/toolchain@v0.0.1-go1.23.0.linux-amd64/src/testing/testing.go:1684
        	Error:      	Not equal: 
        	            	expected: []string{}
        	            	actual  : []string{"BackupDir", "dst"}
        	            	
        	            	Diff:
        	            	--- Expected
        	            	+++ Actual
        	            	@@ -1,2 +1,4 @@
        	            	-([]string) {
        	            	+([]string) (len=2) {
        	            	+ (string) (len=9) "BackupDir",
        	            	+ (string) (len=3) "dst"
        	            	 }
        	Test:       	TestHashSums
        	Messages:   	directories
--- FAIL: TestHashSums (14.17s)
    --- PASS: TestHashSums/Md5 (0.07s)
    --- PASS: TestHashSums/Md5Download (0.14s)
=== RUN   TestCount
    run.go:180: Remote "GCS bucket rclone-test-vijovix6fusi", Local "Local file system at /tmp/rclone3327980596", Modify Window "1ns"
2025/03/21 03:54:51 DEBUG : sub dir/: Creating directory marker
2025/03/21 03:54:52 DEBUG : sub dir/: Removing directory marker
2025/03/21 03:54:52 DEBUG : dst/: Removing directory marker
    run.go:125: removing dir "dst" failed - try 1/3: removing directory marker failed: googleapi: Error 404: No such object: rclone-test-vijovix6fusi/dst/, notFound
2025/03/21 03:54:53 DEBUG : dst/: Removing directory marker
    run.go:125: removing dir "dst" failed - try 2/3: removing directory marker failed: googleapi: Error 404: No such object: rclone-test-vijovix6fusi/dst/, notFound
2025/03/21 03:54:54 DEBUG : dst/: Removing directory marker
    run.go:125: removing dir "dst" failed - try 3/3: removing directory marker failed: googleapi: Error 404: No such object: rclone-test-vijovix6fusi/dst/, notFound
    run.go:128: removing dir "dst" failed: removing directory marker failed: googleapi: Error 404: No such object: rclone-test-vijovix6fusi/dst/, notFound
2025/03/21 03:54:55 DEBUG : BackupDir/: Removing directory marker
    run.go:125: removing dir "BackupDir" failed - try 1/3: removing directory marker failed: googleapi: Error 404: No such object: rclone-test-vijovix6fusi/BackupDir/, notFound
2025/03/21 03:54:56 DEBUG : BackupDir/: Removing directory marker
    run.go:125: removing dir "BackupDir" failed - try 2/3: removing directory marker failed: googleapi: Error 404: No such object: rclone-test-vijovix6fusi/BackupDir/, notFound
2025/03/21 03:54:57 DEBUG : BackupDir/: Removing directory marker
    run.go:125: removing dir "BackupDir" failed - try 3/3: removing directory marker failed: googleapi: Error 404: No such object: rclone-test-vijovix6fusi/BackupDir/, notFound
    run.go:128: removing dir "BackupDir" failed: removing directory marker failed: googleapi: Error 404: No such object: rclone-test-vijovix6fusi/BackupDir/, notFound
    fstest.go:292: Sleeping for 1s for list eventual consistency: 1/3
    fstest.go:292: Sleeping for 2s for list eventual consistency: 2/3
    fstest.go:292: Sleeping for 4s for list eventual consistency: 3/3
    fstest.go:321: 
        	Error Trace:	/home/rclone/go/src/github.com/rclone/rclone/fstest/fstest.go:321
        	            				/home/rclone/go/src/github.com/rclone/rclone/fstest/fstest.go:332
        	            				/home/rclone/go/src/github.com/rclone/rclone/fstest/run.go:173
        	            				/home/rclone/go/src/github.com/rclone/rclone/fstest/run.go:388
        	            				/home/rclone/go/pkg/mod/golang.org/toolchain@v0.0.1-go1.23.0.linux-amd64/src/testing/testing.go:1176
        	            				/home/rclone/go/pkg/mod/golang.org/toolchain@v0.0.1-go1.23.0.linux-amd64/src/testing/testing.go:1354
        	            				/home/rclone/go/pkg/mod/golang.org/toolchain@v0.0.1-go1.23.0.linux-amd64/src/testing/testing.go:1684
        	Error:      	Not equal: 
        	            	expected: []string{}
        	            	actual  : []string{"BackupDir", "dst"}
        	            	
        	            	Diff:
        	            	--- Expected
        	            	+++ Actual
        	            	@@ -1,2 +1,4 @@
        	            	-([]string) {
        	            	+([]string) (len=2) {
        	            	+ (string) (len=9) "BackupDir",
        	            	+ (string) (len=3) "dst"
        	            	 }
        	Test:       	TestCount
        	Messages:   	directories
--- FAIL: TestCount (14.65s)
=== RUN   TestDelete
    run.go:180: Remote "GCS bucket rclone-test-vijovix6fusi", Local "Local file system at /tmp/rclone3327980596", Modify Window "1ns"
2025/03/21 03:55:06 DEBUG : Waiting for deletions to finish
2025/03/21 03:55:06 DEBUG : large: Excluded (Size Filter)
2025/03/21 03:55:06 INFO  : small: Deleted
2025/03/21 03:55:06 INFO  : medium: Deleted
2025/03/21 03:55:06 DEBUG : dst/: Removing directory marker
    run.go:125: removing dir "dst" failed - try 1/3: removing directory marker failed: googleapi: Error 404: No such object: rclone-test-vijovix6fusi/dst/, notFound
2025/03/21 03:55:07 DEBUG : dst/: Removing directory marker
    run.go:125: removing dir "dst" failed - try 2/3: removing directory marker failed: googleapi: Error 404: No such object: rclone-test-vijovix6fusi/dst/, notFound
2025/03/21 03:55:08 DEBUG : dst/: Removing directory marker
    run.go:125: removing dir "dst" failed - try 3/3: removing directory marker failed: googleapi: Error 404: No such object: rclone-test-vijovix6fusi/dst/, notFound
    run.go:128: removing dir "dst" failed: removing directory marker failed: googleapi: Error 404: No such object: rclone-test-vijovix6fusi/dst/, notFound
2025/03/21 03:55:09 DEBUG : BackupDir/: Removing directory marker
    run.go:125: removing dir "BackupDir" failed - try 1/3: removing directory marker failed: googleapi: Error 404: No such object: rclone-test-vijovix6fusi/BackupDir/, notFound
2025/03/21 03:55:10 DEBUG : BackupDir/: Removing directory marker
    run.go:125: removing dir "BackupDir" failed - try 2/3: removing directory marker failed: googleapi: Error 404: No such object: rclone-test-vijovix6fusi/BackupDir/, notFound
2025/03/21 03:55:11 DEBUG : BackupDir/: Removing directory marker
    run.go:125: removing dir "BackupDir" failed - try 3/3: removing directory marker failed: googleapi: Error 404: No such object: rclone-test-vijovix6fusi/BackupDir/, notFound
    run.go:128: removing dir "BackupDir" failed: removing directory marker failed: googleapi: Error 404: No such object: rclone-test-vijovix6fusi/BackupDir/, notFound
    fstest.go:292: Sleeping for 1s for list eventual consistency: 1/3
    fstest.go:292: Sleeping for 2s for list eventual consistency: 2/3
    fstest.go:292: Sleeping for 4s for list eventual consistency: 3/3
    fstest.go:321: 
        	Error Trace:	/home/rclone/go/src/github.com/rclone/rclone/fstest/fstest.go:321
        	            				/home/rclone/go/src/github.com/rclone/rclone/fstest/fstest.go:332
        	            				/home/rclone/go/src/github.com/rclone/rclone/fstest/run.go:173
        	            				/home/rclone/go/src/github.com/rclone/rclone/fstest/run.go:388
        	            				/home/rclone/go/pkg/mod/golang.org/toolchain@v0.0.1-go1.23.0.linux-amd64/src/testing/testing.go:1176
        	            				/home/rclone/go/pkg/mod/golang.org/toolchain@v0.0.1-go1.23.0.linux-amd64/src/testing/testing.go:1354
        	            				/home/rclone/go/pkg/mod/golang.org/toolchain@v0.0.1-go1.23.0.linux-amd64/src/testing/testing.go:1684
        	Error:      	Not equal: 
        	            	expected: []string{}
        	            	actual  : []string{"BackupDir", "dst"}
        	            	
        	            	Diff:
        	            	--- Expected
        	            	+++ Actual
        	            	@@ -1,2 +1,4 @@
        	            	-([]string) {
        	            	+([]string) (len=2) {
        	            	+ (string) (len=9) "BackupDir",
        	            	+ (string) (len=3) "dst"
        	            	 }
        	Test:       	TestDelete
        	Messages:   	directories
--- FAIL: TestDelete (14.20s)
=== RUN   TestMaxDelete
    run.go:180: Remote "GCS bucket rclone-test-vijovix6fusi", Local "Local file system at /tmp/rclone3327980596", Modify Window "1ns"
2025/03/21 03:55:20 DEBUG : Waiting for deletions to finish
2025/03/21 03:55:20 ERROR : small: Got fatal error on delete: --max-delete threshold reached
2025/03/21 03:55:20 INFO  : large: Deleted
2025/03/21 03:55:20 INFO  : medium: Deleted
2025/03/21 03:55:20 DEBUG : dst/: Removing directory marker
    run.go:125: removing dir "dst" failed - try 1/3: removing directory marker failed: googleapi: Error 404: No such object: rclone-test-vijovix6fusi/dst/, notFound
2025/03/21 03:55:21 DEBUG : dst/: Removing directory marker
    run.go:125: removing dir "dst" failed - try 2/3: removing directory marker failed: googleapi: Error 404: No such object: rclone-test-vijovix6fusi/dst/, notFound
2025/03/21 03:55:22 DEBUG : dst/: Removing directory marker
    run.go:125: removing dir "dst" failed - try 3/3: removing directory marker failed: googleapi: Error 404: No such object: rclone-test-vijovix6fusi/dst/, notFound
    run.go:128: removing dir "dst" failed: removing directory marker failed: googleapi: Error 404: No such object: rclone-test-vijovix6fusi/dst/, notFound
2025/03/21 03:55:23 DEBUG : BackupDir/: Removing directory marker
    run.go:125: removing dir "BackupDir" failed - try 1/3: removing directory marker failed: googleapi: Error 404: No such object: rclone-test-vijovix6fusi/BackupDir/, notFound
2025/03/21 03:55:24 DEBUG : BackupDir/: Removing directory marker
    run.go:125: removing dir "BackupDir" failed - try 2/3: removing directory marker failed: googleapi: Error 404: No such object: rclone-test-vijovix6fusi/BackupDir/, notFound
2025/03/21 03:55:25 DEBUG : BackupDir/: Removing directory marker
    run.go:125: removing dir "BackupDir" failed - try 3/3: removing directory marker failed: googleapi: Error 404: No such object: rclone-test-vijovix6fusi/BackupDir/, notFound
    run.go:128: removing dir "BackupDir" failed: removing directory marker failed: googleapi: Error 404: No such object: rclone-test-vijovix6fusi/BackupDir/, notFound
    fstest.go:292: Sleeping for 1s for list eventual consistency: 1/3
    fstest.go:292: Sleeping for 2s for list eventual consistency: 2/3
    fstest.go:292: Sleeping for 4s for list eventual consistency: 3/3
    fstest.go:321: 
        	Error Trace:	/home/rclone/go/src/github.com/rclone/rclone/fstest/fstest.go:321
        	            				/home/rclone/go/src/github.com/rclone/rclone/fstest/fstest.go:332
        	            				/home/rclone/go/src/github.com/rclone/rclone/fstest/run.go:173
        	            				/home/rclone/go/src/github.com/rclone/rclone/fstest/run.go:388
        	            				/home/rclone/go/src/github.com/rclone/rclone/fs/operations/operations_test.go:454
        	Error:      	Not equal: 
        	            	expected: []string{}
        	            	actual  : []string{"BackupDir", "dst"}
        	            	
        	            	Diff:
        	            	--- Expected
        	            	+++ Actual
        	            	@@ -1,2 +1,4 @@
        	            	-([]string) {
        	            	+([]string) (len=2) {
        	            	+ (string) (len=9) "BackupDir",
        	            	+ (string) (len=3) "dst"
        	            	 }
        	Test:       	TestMaxDelete
        	Messages:   	directories
2025/03/21 03:55:34 DEBUG : dst/: Removing directory marker
    run.go:125: removing dir "dst" failed - try 1/3: removing directory marker failed: googleapi: Error 404: No such object: rclone-test-vijovix6fusi/dst/, notFound
2025/03/21 03:55:35 DEBUG : dst/: Removing directory marker
    run.go:125: removing dir "dst" failed - try 2/3: removing directory marker failed: googleapi: Error 404: No such object: rclone-test-vijovix6fusi/dst/, notFound
2025/03/21 03:55:36 DEBUG : dst/: Removing directory marker
    run.go:125: removing dir "dst" failed - try 3/3: removing directory marker failed: googleapi: Error 404: No such object: rclone-test-vijovix6fusi/dst/, notFound
    run.go:128: removing dir "dst" failed: removing directory marker failed: googleapi: Error 404: No such object: rclone-test-vijovix6fusi/dst/, notFound
2025/03/21 03:55:37 DEBUG : BackupDir/: Removing directory marker
    run.go:125: removing dir "BackupDir" failed - try 1/3: removing directory marker failed: googleapi: Error 404: No such object: rclone-test-vijovix6fusi/BackupDir/, notFound
2025/03/21 03:55:38 DEBUG : BackupDir/: Removing directory marker
    run.go:125: removing dir "BackupDir" failed - try 2/3: removing directory marker failed: googleapi: Error 404: No such object: rclone-test-vijovix6fusi/BackupDir/, notFound
2025/03/21 03:55:39 DEBUG : BackupDir/: Removing directory marker
    run.go:125: removing dir "BackupDir" failed - try 3/3: removing directory marker failed: googleapi: Error 404: No such object: rclone-test-vijovix6fusi/BackupDir/, notFound
    run.go:128: removing dir "BackupDir" failed: removing directory marker failed: googleapi: Error 404: No such object: rclone-test-vijovix6fusi/BackupDir/, notFound
    fstest.go:292: Sleeping for 1s for list eventual consistency: 1/3
    fstest.go:292: Sleeping for 2s for list eventual consistency: 2/3
    fstest.go:292: Sleeping for 4s for list eventual consistency: 3/3
    fstest.go:321: 
        	Error Trace:	/home/rclone/go/src/github.com/rclone/rclone/fstest/fstest.go:321
        	            				/home/rclone/go/src/github.com/rclone/rclone/fstest/fstest.go:332
        	            				/home/rclone/go/src/github.com/rclone/rclone/fstest/run.go:173
        	            				/home/rclone/go/src/github.com/rclone/rclone/fstest/run.go:388
        	            				/home/rclone/go/pkg/mod/golang.org/toolchain@v0.0.1-go1.23.0.linux-amd64/src/testing/testing.go:1176
        	            				/home/rclone/go/pkg/mod/golang.org/toolchain@v0.0.1-go1.23.0.linux-amd64/src/testing/testing.go:1354
        	            				/home/rclone/go/pkg/mod/golang.org/toolchain@v0.0.1-go1.23.0.linux-amd64/src/testing/testing.go:1684
        	Error:      	Not equal: 
        	            	expected: []string{}
        	            	actual  : []string{"BackupDir", "dst"}
        	            	
        	            	Diff:
        	            	--- Expected
        	            	+++ Actual
        	            	@@ -1,2 +1,4 @@
        	            	-([]string) {
        	            	+([]string) (len=2) {
        	            	+ (string) (len=9) "BackupDir",
        	            	+ (string) (len=3) "dst"
        	            	 }
        	Test:       	TestMaxDelete
        	Messages:   	directories
--- FAIL: TestMaxDelete (27.79s)
=== RUN   TestMaxDeleteSizeLargeFile
    run.go:180: Remote "GCS bucket rclone-test-vijovix6fusi", Local "Local file system at /tmp/rclone3327980596", Modify Window "1ns"
2025/03/21 03:55:48 DEBUG : Waiting for deletions to finish
2025/03/21 03:55:48 ERROR : large: Got fatal error on delete: --max-delete-size threshold reached
2025/03/21 03:55:48 INFO  : small: Deleted
2025/03/21 03:55:48 INFO  : medium: Deleted
2025/03/21 03:55:48 DEBUG : dst/: Removing directory marker
    run.go:125: removing dir "dst" failed - try 1/3: removing directory marker failed: googleapi: Error 404: No such object: rclone-test-vijovix6fusi/dst/, notFound
2025/03/21 03:55:49 DEBUG : dst/: Removing directory marker
    run.go:125: removing dir "dst" failed - try 2/3: removing directory marker failed: googleapi: Error 404: No such object: rclone-test-vijovix6fusi/dst/, notFound
2025/03/21 03:55:50 DEBUG : dst/: Removing directory marker
    run.go:125: removing dir "dst" failed - try 3/3: removing directory marker failed: googleapi: Error 404: No such object: rclone-test-vijovix6fusi/dst/, notFound
    run.go:128: removing dir "dst" failed: removing directory marker failed: googleapi: Error 404: No such object: rclone-test-vijovix6fusi/dst/, notFound
2025/03/21 03:55:51 DEBUG : BackupDir/: Removing directory marker
    run.go:125: removing dir "BackupDir" failed - try 1/3: removing directory marker failed: googleapi: Error 404: No such object: rclone-test-vijovix6fusi/BackupDir/, notFound
2025/03/21 03:55:52 DEBUG : BackupDir/: Removing directory marker
    run.go:125: removing dir "BackupDir" failed - try 2/3: removing directory marker failed: googleapi: Error 404: No such object: rclone-test-vijovix6fusi/BackupDir/, notFound
2025/03/21 03:55:53 DEBUG : BackupDir/: Removing directory marker
    run.go:125: removing dir "BackupDir" failed - try 3/3: removing directory marker failed: googleapi: Error 404: No such object: rclone-test-vijovix6fusi/BackupDir/, notFound
    run.go:128: removing dir "BackupDir" failed: removing directory marker failed: googleapi: Error 404: No such object: rclone-test-vijovix6fusi/BackupDir/, notFound
    fstest.go:292: Sleeping for 1s for list eventual consistency: 1/3
    fstest.go:292: Sleeping for 2s for list eventual consistency: 2/3
    fstest.go:292: Sleeping for 4s for list eventual consistency: 3/3
    fstest.go:321: 
        	Error Trace:	/home/rclone/go/src/github.com/rclone/rclone/fstest/fstest.go:321
        	            				/home/rclone/go/src/github.com/rclone/rclone/fstest/fstest.go:332
        	            				/home/rclone/go/src/github.com/rclone/rclone/fstest/run.go:173
        	            				/home/rclone/go/src/github.com/rclone/rclone/fstest/run.go:388
        	            				/home/rclone/go/src/github.com/rclone/rclone/fs/operations/operations_test.go:473
        	Error:      	Not equal: 
        	            	expected: []string{}
        	            	actual  : []string{"BackupDir", "dst"}
        	            	
        	            	Diff:
        	            	--- Expected
        	            	+++ Actual
        	            	@@ -1,2 +1,4 @@
        	            	-([]string) {
        	            	+([]string) (len=2) {
        	            	+ (string) (len=9) "BackupDir",
        	            	+ (string) (len=3) "dst"
        	            	 }
        	Test:       	TestMaxDeleteSizeLargeFile
        	Messages:   	directories
2025/03/21 03:56:02 DEBUG : dst/: Removing directory marker
    run.go:125: removing dir "dst" failed - try 1/3: removing directory marker failed: googleapi: Error 404: No such object: rclone-test-vijovix6fusi/dst/, notFound
2025/03/21 03:56:03 DEBUG : dst/: Removing directory marker
    run.go:125: removing dir "dst" failed - try 2/3: removing directory marker failed: googleapi: Error 404: No such object: rclone-test-vijovix6fusi/dst/, notFound
2025/03/21 03:56:04 DEBUG : dst/: Removing directory marker
    run.go:125: removing dir "dst" failed - try 3/3: removing directory marker failed: googleapi: Error 404: No such object: rclone-test-vijovix6fusi/dst/, notFound
    run.go:128: removing dir "dst" failed: removing directory marker failed: googleapi: Error 404: No such object: rclone-test-vijovix6fusi/dst/, notFound
2025/03/21 03:56:05 DEBUG : BackupDir/: Removing directory marker
    run.go:125: removing dir "BackupDir" failed - try 1/3: removing directory marker failed: googleapi: Error 404: No such object: rclone-test-vijovix6fusi/BackupDir/, notFound
2025/03/21 03:56:06 DEBUG : BackupDir/: Removing directory marker
    run.go:125: removing dir "BackupDir" failed - try 2/3: removing directory marker failed: googleapi: Error 404: No such object: rclone-test-vijovix6fusi/BackupDir/, notFound
2025/03/21 03:56:07 DEBUG : BackupDir/: Removing directory marker
    run.go:125: removing dir "BackupDir" failed - try 3/3: removing directory marker failed: googleapi: Error 404: No such object: rclone-test-vijovix6fusi/BackupDir/, notFound
    run.go:128: removing dir "BackupDir" failed: removing directory marker failed: googleapi: Error 404: No such object: rclone-test-vijovix6fusi/BackupDir/, notFound
    fstest.go:292: Sleeping for 1s for list eventual consistency: 1/3
    fstest.go:292: Sleeping for 2s for list eventual consistency: 2/3
    fstest.go:292: Sleeping for 4s for list eventual consistency: 3/3
    fstest.go:321: 
        	Error Trace:	/home/rclone/go/src/github.com/rclone/rclone/fstest/fstest.go:321
        	            				/home/rclone/go/src/github.com/rclone/rclone/fstest/fstest.go:332
        	            				/home/rclone/go/src/github.com/rclone/rclone/fstest/run.go:173
        	            				/home/rclone/go/src/github.com/rclone/rclone/fstest/run.go:388
        	            				/home/rclone/go/pkg/mod/golang.org/toolchain@v0.0.1-go1.23.0.linux-amd64/src/testing/testing.go:1176
        	            				/home/rclone/go/pkg/mod/golang.org/toolchain@v0.0.1-go1.23.0.linux-amd64/src/testing/testing.go:1354
        	            				/home/rclone/go/pkg/mod/golang.org/toolchain@v0.0.1-go1.23.0.linux-amd64/src/testing/testing.go:1684
        	Error:      	Not equal: 
        	            	expected: []string{}
        	            	actual  : []string{"BackupDir", "dst"}
        	            	
        	            	Diff:
        	            	--- Expected
        	            	+++ Actual
        	            	@@ -1,2 +1,4 @@
        	            	-([]string) {
        	            	+([]string) (len=2) {
        	            	+ (string) (len=9) "BackupDir",
        	            	+ (string) (len=3) "dst"
        	            	 }
        	Test:       	TestMaxDeleteSizeLargeFile
        	Messages:   	directories
--- FAIL: TestMaxDeleteSizeLargeFile (27.86s)
=== RUN   TestMaxDeleteSize
    run.go:180: Remote "GCS bucket rclone-test-vijovix6fusi", Local "Local file system at /tmp/rclone3327980596", Modify Window "1ns"
2025/03/21 03:56:16 DEBUG : Waiting for deletions to finish
2025/03/21 03:56:16 ERROR : small: Got fatal error on delete: --max-delete-size threshold reached
2025/03/21 03:56:16 INFO  : large: Deleted
2025/03/21 03:56:16 INFO  : medium: Deleted
2025/03/21 03:56:16 DEBUG : dst/: Removing directory marker
    run.go:125: removing dir "dst" failed - try 1/3: removing directory marker failed: googleapi: Error 404: No such object: rclone-test-vijovix6fusi/dst/, notFound
2025/03/21 03:56:18 DEBUG : dst/: Removing directory marker
    run.go:125: removing dir "dst" failed - try 2/3: removing directory marker failed: googleapi: Error 404: No such object: rclone-test-vijovix6fusi/dst/, notFound
2025/03/21 03:56:19 DEBUG : dst/: Removing directory marker
    run.go:125: removing dir "dst" failed - try 3/3: removing directory marker failed: googleapi: Error 404: No such object: rclone-test-vijovix6fusi/dst/, notFound
    run.go:128: removing dir "dst" failed: removing directory marker failed: googleapi: Error 404: No such object: rclone-test-vijovix6fusi/dst/, notFound
2025/03/21 03:56:20 DEBUG : BackupDir/: Removing directory marker
    run.go:125: removing dir "BackupDir" failed - try 1/3: removing directory marker failed: googleapi: Error 404: No such object: rclone-test-vijovix6fusi/BackupDir/, notFound
2025/03/21 03:56:21 DEBUG : BackupDir/: Removing directory marker
    run.go:125: removing dir "BackupDir" failed - try 2/3: removing directory marker failed: googleapi: Error 404: No such object: rclone-test-vijovix6fusi/BackupDir/, notFound
2025/03/21 03:56:22 DEBUG : BackupDir/: Removing directory marker
    run.go:125: removing dir "BackupDir" failed - try 3/3: removing directory marker failed: googleapi: Error 404: No such object: rclone-test-vijovix6fusi/BackupDir/, notFound
    run.go:128: removing dir "BackupDir" failed: removing directory marker failed: googleapi: Error 404: No such object: rclone-test-vijovix6fusi/BackupDir/, notFound
    fstest.go:292: Sleeping for 1s for list eventual consistency: 1/3
    fstest.go:292: Sleeping for 2s for list eventual consistency: 2/3
    fstest.go:292: Sleeping for 4s for list eventual consistency: 3/3
    fstest.go:321: 
        	Error Trace:	/home/rclone/go/src/github.com/rclone/rclone/fstest/fstest.go:321
        	            				/home/rclone/go/src/github.com/rclone/rclone/fstest/fstest.go:332
        	            				/home/rclone/go/src/github.com/rclone/rclone/fstest/run.go:173
        	            				/home/rclone/go/src/github.com/rclone/rclone/fstest/run.go:388
        	            				/home/rclone/go/src/github.com/rclone/rclone/fs/operations/operations_test.go:493
        	Error:      	Not equal: 
        	            	expected: []string{}
        	            	actual  : []string{"BackupDir", "dst"}
        	            	
        	            	Diff:
        	            	--- Expected
        	            	+++ Actual
        	            	@@ -1,2 +1,4 @@
        	            	-([]string) {
        	            	+([]string) (len=2) {
        	            	+ (string) (len=9) "BackupDir",
        	            	+ (string) (len=3) "dst"
        	            	 }
        	Test:       	TestMaxDeleteSize
        	Messages:   	directories
2025/03/21 03:56:30 DEBUG : dst/: Removing directory marker
    run.go:125: removing dir "dst" failed - try 1/3: removing directory marker failed: googleapi: Error 404: No such object: rclone-test-vijovix6fusi/dst/, notFound
2025/03/21 03:56:31 DEBUG : dst/: Removing directory marker
    run.go:125: removing dir "dst" failed - try 2/3: removing directory marker failed: googleapi: Error 404: No such object: rclone-test-vijovix6fusi/dst/, notFound
2025/03/21 03:56:33 DEBUG : dst/: Removing directory marker
    run.go:125: removing dir "dst" failed - try 3/3: removing directory marker failed: googleapi: Error 404: No such object: rclone-test-vijovix6fusi/dst/, notFound
    run.go:128: removing dir "dst" failed: removing directory marker failed: googleapi: Error 404: No such object: rclone-test-vijovix6fusi/dst/, notFound
2025/03/21 03:56:34 DEBUG : BackupDir/: Removing directory marker
    run.go:125: removing dir "BackupDir" failed - try 1/3: removing directory marker failed: googleapi: Error 404: No such object: rclone-test-vijovix6fusi/BackupDir/, notFound
2025/03/21 03:56:35 DEBUG : BackupDir/: Removing directory marker
    run.go:125: removing dir "BackupDir" failed - try 2/3: removing directory marker failed: googleapi: Error 404: No such object: rclone-test-vijovix6fusi/BackupDir/, notFound
2025/03/21 03:56:36 DEBUG : BackupDir/: Removing directory marker
    run.go:125: removing dir "BackupDir" failed - try 3/3: removing directory marker failed: googleapi: Error 404: No such object: rclone-test-vijovix6fusi/BackupDir/, notFound
    run.go:128: removing dir "BackupDir" failed: removing directory marker failed: googleapi: Error 404: No such object: rclone-test-vijovix6fusi/BackupDir/, notFound
    fstest.go:292: Sleeping for 1s for list eventual consistency: 1/3
    fstest.go:292: Sleeping for 2s for list eventual consistency: 2/3
    fstest.go:292: Sleeping for 4s for list eventual consistency: 3/3
    fstest.go:321: 
        	Error Trace:	/home/rclone/go/src/github.com/rclone/rclone/fstest/fstest.go:321
        	            				/home/rclone/go/src/github.com/rclone/rclone/fstest/fstest.go:332
        	            				/home/rclone/go/src/github.com/rclone/rclone/fstest/run.go:173
        	            				/home/rclone/go/src/github.com/rclone/rclone/fstest/run.go:388
        	            				/home/rclone/go/pkg/mod/golang.org/toolchain@v0.0.1-go1.23.0.linux-amd64/src/testing/testing.go:1176
        	            				/home/rclone/go/pkg/mod/golang.org/toolchain@v0.0.1-go1.23.0.linux-amd64/src/testing/testing.go:1354
        	            				/home/rclone/go/pkg/mod/golang.org/toolchain@v0.0.1-go1.23.0.linux-amd64/src/testing/testing.go:1684
        	Error:      	Not equal: 
        	            	expected: []string{}
        	            	actual  : []string{"BackupDir", "dst"}
        	            	
        	            	Diff:
        	            	--- Expected
        	            	+++ Actual
        	            	@@ -1,2 +1,4 @@
        	            	-([]string) {
        	            	+([]string) (len=2) {
        	            	+ (string) (len=9) "BackupDir",
        	            	+ (string) (len=3) "dst"
        	            	 }
        	Test:       	TestMaxDeleteSize
        	Messages:   	directories
--- FAIL: TestMaxDeleteSize (28.82s)
=== RUN   TestReadFile
    run.go:180: Remote "GCS bucket rclone-test-vijovix6fusi", Local "Local file system at /tmp/rclone3327980596", Modify Window "1ns"
2025/03/21 03:56:45 DEBUG : dst/: Removing directory marker
    run.go:125: removing dir "dst" failed - try 1/3: removing directory marker failed: googleapi: Error 404: No such object: rclone-test-vijovix6fusi/dst/, notFound
2025/03/21 03:56:46 DEBUG : dst/: Removing directory marker
    run.go:125: removing dir "dst" failed - try 2/3: removing directory marker failed: googleapi: Error 404: No such object: rclone-test-vijovix6fusi/dst/, notFound
2025/03/21 03:56:47 DEBUG : dst/: Removing directory marker
    run.go:125: removing dir "dst" failed - try 3/3: removing directory marker failed: googleapi: Error 404: No such object: rclone-test-vijovix6fusi/dst/, notFound
    run.go:128: removing dir "dst" failed: removing directory marker failed: googleapi: Error 404: No such object: rclone-test-vijovix6fusi/dst/, notFound
2025/03/21 03:56:48 DEBUG : BackupDir/: Removing directory marker
    run.go:125: removing dir "BackupDir" failed - try 1/3: removing directory marker failed: googleapi: Error 404: No such object: rclone-test-vijovix6fusi/BackupDir/, notFound
2025/03/21 03:56:49 DEBUG : BackupDir/: Removing directory marker
    run.go:125: removing dir "BackupDir" failed - try 2/3: removing directory marker failed: googleapi: Error 404: No such object: rclone-test-vijovix6fusi/BackupDir/, notFound
2025/03/21 03:56:50 DEBUG : BackupDir/: Removing directory marker
    run.go:125: removing dir "BackupDir" failed - try 3/3: removing directory marker failed: googleapi: Error 404: No such object: rclone-test-vijovix6fusi/BackupDir/, notFound
    run.go:128: removing dir "BackupDir" failed: removing directory marker failed: googleapi: Error 404: No such object: rclone-test-vijovix6fusi/BackupDir/, notFound
    fstest.go:292: Sleeping for 1s for list eventual consistency: 1/3
    fstest.go:292: Sleeping for 2s for list eventual consistency: 2/3
    fstest.go:292: Sleeping for 4s for list eventual consistency: 3/3
    fstest.go:321: 
        	Error Trace:	/home/rclone/go/src/github.com/rclone/rclone/fstest/fstest.go:321
        	            				/home/rclone/go/src/github.com/rclone/rclone/fstest/fstest.go:332
        	            				/home/rclone/go/src/github.com/rclone/rclone/fstest/run.go:173
        	            				/home/rclone/go/src/github.com/rclone/rclone/fstest/run.go:388
        	            				/home/rclone/go/src/github.com/rclone/rclone/fs/operations/operations_test.go:510
        	Error:      	Not equal: 
        	            	expected: []string{}
        	            	actual  : []string{"BackupDir", "dst"}
        	            	
        	            	Diff:
        	            	--- Expected
        	            	+++ Actual
        	            	@@ -1,2 +1,4 @@
        	            	-([]string) {
        	            	+([]string) (len=2) {
        	            	+ (string) (len=9) "BackupDir",
        	            	+ (string) (len=3) "dst"
        	            	 }
        	Test:       	TestReadFile
        	Messages:   	directories
2025/03/21 03:56:58 DEBUG : dst/: Removing directory marker
    run.go:125: removing dir "dst" failed - try 1/3: removing directory marker failed: googleapi: Error 404: No such object: rclone-test-vijovix6fusi/dst/, notFound
2025/03/21 03:56:59 DEBUG : dst/: Removing directory marker
    run.go:125: removing dir "dst" failed - try 2/3: removing directory marker failed: googleapi: Error 404: No such object: rclone-test-vijovix6fusi/dst/, notFound
2025/03/21 03:57:01 DEBUG : dst/: Removing directory marker
    run.go:125: removing dir "dst" failed - try 3/3: removing directory marker failed: googleapi: Error 404: No such object: rclone-test-vijovix6fusi/dst/, notFound
    run.go:128: removing dir "dst" failed: removing directory marker failed: googleapi: Error 404: No such object: rclone-test-vijovix6fusi/dst/, notFound
2025/03/21 03:57:02 DEBUG : BackupDir/: Removing directory marker
    run.go:125: removing dir "BackupDir" failed - try 1/3: removing directory marker failed: googleapi: Error 404: No such object: rclone-test-vijovix6fusi/BackupDir/, notFound
2025/03/21 03:57:03 DEBUG : BackupDir/: Removing directory marker
    run.go:125: removing dir "BackupDir" failed - try 2/3: removing directory marker failed: googleapi: Error 404: No such object: rclone-test-vijovix6fusi/BackupDir/, notFound
2025/03/21 03:57:04 DEBUG : BackupDir/: Removing directory marker
    run.go:125: removing dir "BackupDir" failed - try 3/3: removing directory marker failed: googleapi: Error 404: No such object: rclone-test-vijovix6fusi/BackupDir/, notFound
    run.go:128: removing dir "BackupDir" failed: removing directory marker failed: googleapi: Error 404: No such object: rclone-test-vijovix6fusi/BackupDir/, notFound
    fstest.go:292: Sleeping for 1s for list eventual consistency: 1/3
    fstest.go:292: Sleeping for 2s for list eventual consistency: 2/3
    fstest.go:292: Sleeping for 4s for list eventual consistency: 3/3
    fstest.go:321: 
        	Error Trace:	/home/rclone/go/src/github.com/rclone/rclone/fstest/fstest.go:321
        	            				/home/rclone/go/src/github.com/rclone/rclone/fstest/fstest.go:332
        	            				/home/rclone/go/src/github.com/rclone/rclone/fstest/run.go:173
        	            				/home/rclone/go/src/github.com/rclone/rclone/fstest/run.go:388
        	            				/home/rclone/go/pkg/mod/golang.org/toolchain@v0.0.1-go1.23.0.linux-amd64/src/testing/testing.go:1176
        	            				/home/rclone/go/pkg/mod/golang.org/toolchain@v0.0.1-go1.23.0.linux-amd64/src/testing/testing.go:1354
        	            				/home/rclone/go/pkg/mod/golang.org/toolchain@v0.0.1-go1.23.0.linux-amd64/src/testing/testing.go:1684
        	Error:      	Not equal: 
        	            	expected: []string{}
        	            	actual  : []string{"BackupDir", "dst"}
        	            	
        	            	Diff:
        	            	--- Expected
        	            	+++ Actual
        	            	@@ -1,2 +1,4 @@
        	            	-([]string) {
        	            	+([]string) (len=2) {
        	            	+ (string) (len=9) "BackupDir",
        	            	+ (string) (len=3) "dst"
        	            	 }
        	Test:       	TestReadFile
        	Messages:   	directories
--- FAIL: TestReadFile (28.22s)
=== RUN   TestCat
    run.go:180: Remote "GCS bucket rclone-test-vijovix6fusi", Local "Local file system at /tmp/rclone3327980596", Modify Window "1ns"
2025/03/21 03:57:14 DEBUG : dst/: Removing directory marker
    run.go:125: removing dir "dst" failed - try 1/3: removing directory marker failed: googleapi: Error 404: No such object: rclone-test-vijovix6fusi/dst/, notFound
2025/03/21 03:57:15 DEBUG : dst/: Removing directory marker
    run.go:125: removing dir "dst" failed - try 2/3: removing directory marker failed: googleapi: Error 404: No such object: rclone-test-vijovix6fusi/dst/, notFound
2025/03/21 03:57:16 DEBUG : dst/: Removing directory marker
    run.go:125: removing dir "dst" failed - try 3/3: removing directory marker failed: googleapi: Error 404: No such object: rclone-test-vijovix6fusi/dst/, notFound
    run.go:128: removing dir "dst" failed: removing directory marker failed: googleapi: Error 404: No such object: rclone-test-vijovix6fusi/dst/, notFound
2025/03/21 03:57:17 DEBUG : BackupDir/: Removing directory marker
    run.go:125: removing dir "BackupDir" failed - try 1/3: removing directory marker failed: googleapi: Error 404: No such object: rclone-test-vijovix6fusi/BackupDir/, notFound
2025/03/21 03:57:19 DEBUG : BackupDir/: Removing directory marker
    run.go:125: removing dir "BackupDir" failed - try 2/3: removing directory marker failed: googleapi: Error 404: No such object: rclone-test-vijovix6fusi/BackupDir/, notFound
2025/03/21 03:57:20 DEBUG : BackupDir/: Removing directory marker
    run.go:125: removing dir "BackupDir" failed - try 3/3: removing directory marker failed: googleapi: Error 404: No such object: rclone-test-vijovix6fusi/BackupDir/, notFound
    run.go:128: removing dir "BackupDir" failed: removing directory marker failed: googleapi: Error 404: No such object: rclone-test-vijovix6fusi/BackupDir/, notFound
    fstest.go:292: Sleeping for 1s for list eventual consistency: 1/3
    fstest.go:292: Sleeping for 2s for list eventual consistency: 2/3
    fstest.go:292: Sleeping for 4s for list eventual consistency: 3/3
    fstest.go:321: 
        	Error Trace:	/home/rclone/go/src/github.com/rclone/rclone/fstest/fstest.go:321
        	            				/home/rclone/go/src/github.com/rclone/rclone/fstest/fstest.go:332
        	            				/home/rclone/go/src/github.com/rclone/rclone/fstest/run.go:173
        	            				/home/rclone/go/src/github.com/rclone/rclone/fstest/run.go:388
        	            				/home/rclone/go/pkg/mod/golang.org/toolchain@v0.0.1-go1.23.0.linux-amd64/src/testing/testing.go:1176
        	            				/home/rclone/go/pkg/mod/golang.org/toolchain@v0.0.1-go1.23.0.linux-amd64/src/testing/testing.go:1354
        	            				/home/rclone/go/pkg/mod/golang.org/toolchain@v0.0.1-go1.23.0.linux-amd64/src/testing/testing.go:1684
        	Error:      	Not equal: 
        	            	expected: []string{}
        	            	actual  : []string{"BackupDir", "dst"}
        	            	
        	            	Diff:
        	            	--- Expected
        	            	+++ Actual
        	            	@@ -1,2 +1,4 @@
        	            	-([]string) {
        	            	+([]string) (len=2) {
        	            	+ (string) (len=9) "BackupDir",
        	            	+ (string) (len=3) "dst"
        	            	 }
        	Test:       	TestCat
        	Messages:   	directories
--- FAIL: TestCat (15.64s)
=== RUN   TestRmdirsNoLeaveRoot
    run.go:180: Remote "GCS bucket rclone-test-vijovix6fusi", Local "Local file system at /tmp/rclone3327980596", Modify Window "1ns"
2025/03/21 03:57:28 DEBUG : A1/B1/C1/: Creating directory marker
2025/03/21 03:57:29 DEBUG : A1/B1/: Creating directory marker
2025/03/21 03:57:29 DEBUG : A1/: Creating directory marker
2025/03/21 03:57:29 INFO  : A2: Making directory
2025/03/21 03:57:29 DEBUG : A2/: Creating directory marker
2025/03/21 03:57:29 INFO  : A1/B2: Making directory
2025/03/21 03:57:30 DEBUG : A1/B2/: Creating directory marker
2025/03/21 03:57:30 INFO  : A1/B2/C2: Making directory
2025/03/21 03:57:30 DEBUG : A1/B2/C2/: Creating directory marker
2025/03/21 03:57:30 INFO  : A1/B1/C3: Making directory
2025/03/21 03:57:31 DEBUG : A1/B1/C3/: Creating directory marker
2025/03/21 03:57:31 INFO  : A3: Making directory
2025/03/21 03:57:31 DEBUG : A3/: Creating directory marker
2025/03/21 03:57:31 INFO  : A3/B3: Making directory
2025/03/21 03:57:31 DEBUG : A3/B3/: Creating directory marker
2025/03/21 03:57:32 INFO  : A3/B3/C4: Making directory
2025/03/21 03:57:32 DEBUG : A3/B3/C4/: Creating directory marker
    fstest.go:292: Sleeping for 1s for list eventual consistency: 1/3
    fstest.go:292: Sleeping for 2s for list eventual consistency: 2/3
    fstest.go:292: Sleeping for 4s for list eventual consistency: 3/3
    fstest.go:321: 
        	Error Trace:	/home/rclone/go/src/github.com/rclone/rclone/fstest/fstest.go:321
        	            				/home/rclone/go/src/github.com/rclone/rclone/fstest/fstest.go:332
        	            				/home/rclone/go/src/github.com/rclone/rclone/fs/operations/operations_test.go:662
        	Error:      	Not equal: 
        	            	expected: []string{"A1", "A1/B1", "A1/B1/C1", "A1/B1/C3", "A1/B2", "A1/B2/C2", "A2", "A3", "A3/B3", "A3/B3/C4"}
        	            	actual  : []string{"A1", "A1/B1", "A1/B1/C1", "A1/B1/C3", "A1/B2", "A1/B2/C2", "A2", "A3", "A3/B3", "A3/B3/C4", "BackupDir", "dst"}
        	            	
        	            	Diff:
        	            	--- Expected
        	            	+++ Actual
        	            	@@ -1,2 +1,2 @@
        	            	-([]string) (len=10) {
        	            	+([]string) (len=12) {
        	            	  (string) (len=2) "A1",
        	            	@@ -10,3 +10,5 @@
        	            	  (string) (len=5) "A3/B3",
        	            	- (string) (len=8) "A3/B3/C4"
        	            	+ (string) (len=8) "A3/B3/C4",
        	            	+ (string) (len=9) "BackupDir",
        	            	+ (string) (len=3) "dst"
        	            	 }
        	Test:       	TestRmdirsNoLeaveRoot
        	Messages:   	directories
2025/03/21 03:57:39 DEBUG : removing 1 level 3 directories
2025/03/21 03:57:39 INFO  : A3/B3/C4: Removing directory
2025/03/21 03:57:39 DEBUG : A3/B3/C4/: Removing directory marker
    fstest.go:292: Sleeping for 1s for list eventual consistency: 1/3
    fstest.go:292: Sleeping for 2s for list eventual consistency: 2/3
    fstest.go:292: Sleeping for 4s for list eventual consistency: 3/3
    fstest.go:321: 
        	Error Trace:	/home/rclone/go/src/github.com/rclone/rclone/fstest/fstest.go:321
        	            				/home/rclone/go/src/github.com/rclone/rclone/fstest/fstest.go:332
        	            				/home/rclone/go/src/github.com/rclone/rclone/fs/operations/operations_test.go:685
        	Error:      	Not equal: 
        	            	expected: []string{"A1", "A1/B1", "A1/B1/C1", "A1/B1/C3", "A1/B2", "A1/B2/C2", "A2", "A3", "A3/B3"}
        	            	actual  : []string{"A1", "A1/B1", "A1/B1/C1", "A1/B1/C3", "A1/B2", "A1/B2/C2", "A2", "A3", "A3/B3", "BackupDir", "dst"}
        	            	
        	            	Diff:
        	            	--- Expected
        	            	+++ Actual
        	            	@@ -1,2 +1,2 @@
        	            	-([]string) (len=9) {
        	            	+([]string) (len=11) {
        	            	  (string) (len=2) "A1",
        	            	@@ -9,3 +9,5 @@
        	            	  (string) (len=2) "A3",
        	            	- (string) (len=5) "A3/B3"
        	            	+ (string) (len=5) "A3/B3",
        	            	+ (string) (len=9) "BackupDir",
        	            	+ (string) (len=3) "dst"
        	            	 }
        	Test:       	TestRmdirsNoLeaveRoot
        	Messages:   	directories
2025/03/21 03:57:47 DEBUG : removing 2 level 3 directories
2025/03/21 03:57:47 INFO  : A1/B2/C2: Removing directory
2025/03/21 03:57:47 DEBUG : A1/B2/C2/: Removing directory marker
2025/03/21 03:57:47 INFO  : A1/B1/C3: Removing directory
2025/03/21 03:57:47 DEBUG : A1/B1/C3/: Removing directory marker
2025/03/21 03:57:47 DEBUG : removing 4 level 2 directories
2025/03/21 03:57:47 INFO  : dst/: Removing directory
2025/03/21 03:57:47 DEBUG : dst//: Removing directory marker
2025/03/21 03:57:47 INFO  : A3/B3: Removing directory
2025/03/21 03:57:47 DEBUG : A3/B3/: Removing directory marker
2025/03/21 03:57:47 INFO  : A1/B2: Removing directory
2025/03/21 03:57:47 DEBUG : A1/B2/: Removing directory marker
2025/03/21 03:57:47 INFO  : BackupDir/: Removing directory
2025/03/21 03:57:47 DEBUG : BackupDir//: Removing directory marker
2025/03/21 03:57:47 DEBUG : removing 4 level 1 directories
2025/03/21 03:57:47 INFO  : dst: Removing directory
2025/03/21 03:57:47 DEBUG : dst/: Removing directory marker
2025/03/21 03:57:47 INFO  : A3: Removing directory
2025/03/21 03:57:47 DEBUG : A3/: Removing directory marker
2025/03/21 03:57:47 INFO  : BackupDir: Removing directory
2025/03/21 03:57:47 DEBUG : BackupDir/: Removing directory marker
2025/03/21 03:57:47 INFO  : A2: Removing directory
2025/03/21 03:57:47 DEBUG : A2/: Removing directory marker
2025/03/21 03:57:47 ERROR : dst: Failed to rmdir: removing directory marker failed: googleapi: Error 404: No such object: rclone-test-vijovix6fusi/dst/, notFound
2025/03/21 03:57:47 ERROR : BackupDir: Failed to rmdir: removing directory marker failed: googleapi: Error 404: No such object: rclone-test-vijovix6fusi/BackupDir/, notFound
    operations_test.go:705: 
        	Error Trace:	/home/rclone/go/src/github.com/rclone/rclone/fs/operations/operations_test.go:705
        	Error:      	Received unexpected error:
        	            	failed to remove directories: 2 errors: last error: removing directory marker failed: googleapi: Error 404: No such object: rclone-test-vijovix6fusi/BackupDir/, notFound
        	Test:       	TestRmdirsNoLeaveRoot
2025/03/21 03:57:48 DEBUG : A1/B1/C1/: Removing directory marker
2025/03/21 03:57:48 DEBUG : A1/B1/: Removing directory marker
2025/03/21 03:57:48 DEBUG : A1/: Removing directory marker
--- FAIL: TestRmdirsNoLeaveRoot (20.11s)
FAIL
2025/03/21 03:57:48 DEBUG : GCS bucket rclone-test-vijovix6fusi: Purge dir ""
"./operations.test -test.v -test.timeout 1h0m0s -remote 'TestGoogleCloudStorage,directory_markers:' -verbose -test.run '^(TestCat|TestCopyFileCompareDest|TestCopyFileCopyDest|TestCopyFileMaxTransfer|TestCopyInplace|TestCopyLongFileName|TestCount|TestDeduplicateFirst|TestDeduplicateInteractive|TestDeduplicateLargest|TestDeduplicateNewest|TestDeduplicateNewestByHash|TestDeduplicateOldest|TestDeduplicateRename|TestDeduplicateSizeOnly|TestDeduplicateSkip|TestDeduplicateSmallest|TestDelete|TestHashSums|TestListDirSorted|TestLs|TestLsLong|TestLsWithFilesFrom|TestLsd|TestMaxDelete|TestMaxDeleteSize|TestMaxDeleteSizeLargeFile|TestMergeDirs|TestMkdir|TestReadFile|TestRmdirsNoLeaveRoot|TestStatJSON)$|^TestListJSON$/^(Default|DirsOnly|Metadata|Recurse)$'" - Finished ERROR in 9m13.862440121s (try 5/5): exit status 1: Failed [TestCopyFileCompareDest TestCopyFileCopyDest TestCopyInplace TestCopyLongFileName TestCopyFileMaxTransfer TestDeduplicateInteractive TestDeduplicateSkip TestDeduplicateSizeOnly TestDeduplicateFirst TestDeduplicateNewest TestDeduplicateNewestByHash TestDeduplicateOldest TestDeduplicateLargest TestDeduplicateSmallest TestDeduplicateRename TestMergeDirs TestListDirSorted TestListJSON/Default TestListJSON/DirsOnly TestListJSON/Recurse TestListJSON/Metadata TestStatJSON TestMkdir TestLsd TestLs TestLsWithFilesFrom TestLsLong TestHashSums TestCount TestDelete TestMaxDelete TestMaxDeleteSizeLargeFile TestMaxDeleteSize TestReadFile TestCat TestRmdirsNoLeaveRoot]