"./sync.test -test.v -test.timeout 1h0m0s -remote 'TestGoogleCloudStorage,directory_markers:' -verbose -test.run '^(TestSyncCompareDest|TestSyncMultipleCompareDest|TestSyncOverlapWithFilter)$'" - Starting (try 4/5)
2025/03/15 07:38:54 DEBUG : Creating backend with remote "TestGoogleCloudStorage,directory_markers:rclone-test-werugiq8benu"
2025/03/15 07:38:54 DEBUG : Using config file from "/home/rclone/.rclone.conf"
2025/03/15 07:38:54 DEBUG : TestGoogleCloudStorage: detected overridden config - adding "{juk_h}" suffix to name
2025/03/15 07:38:54 DEBUG : Creating backend with remote "/tmp/rclone2533315254"
=== RUN   TestSyncOverlapWithFilter
    run.go:180: Remote "GCS bucket rclone-test-werugiq8benu", Local "Local file system at /tmp/rclone2533315254", Modify Window "1ns"
2025/03/15 07:38:54 DEBUG : Creating backend with remote "TestGoogleCloudStorage,directory_markers:rclone-test-werugiq8benu/rclone-sync-test"
2025/03/15 07:38:54 DEBUG : TestGoogleCloudStorage: detected overridden config - adding "{juk_h}" suffix to name
2025/03/15 07:38:57 DEBUG : /: Creating directory marker
2025/03/15 07:38:57 DEBUG : Creating backend with remote "TestGoogleCloudStorage,directory_markers:rclone-test-werugiq8benu/rclone-sync-test-include/layer2"
2025/03/15 07:38:57 DEBUG : TestGoogleCloudStorage: detected overridden config - adding "{juk_h}" suffix to name
2025/03/15 07:38:58 DEBUG : /: Creating directory marker
2025/03/15 07:38:58 DEBUG : Creating backend with remote "TestGoogleCloudStorage,directory_markers:rclone-test-werugiq8benu/rclone-sync-test-ignore-file"
2025/03/15 07:38:58 DEBUG : TestGoogleCloudStorage: detected overridden config - adding "{juk_h}" suffix to name
2025/03/15 07:38:59 DEBUG : /: Creating directory marker
2025/03/15 07:39:00 DEBUG : rclone-sync-test-ignore-file/: Creating directory marker
2025/03/15 07:39:01 DEBUG : rclone-sync-test-ignore-file: Excluded
2025/03/15 07:39:01 ERROR : : Entry doesn't belong in directory "" (same as directory) - ignoring
2025/03/15 07:39:01 DEBUG : rclone-sync-test: Excluded
2025/03/15 07:39:02 DEBUG : rclone-sync-test-include/layer2: Excluded
2025/03/15 07:39:02 DEBUG : GCS bucket rclone-test-werugiq8benu path rclone-sync-test: Waiting for checks to finish
2025/03/15 07:39:02 DEBUG : GCS bucket rclone-test-werugiq8benu path rclone-sync-test: Waiting for transfers to finish
2025/03/15 07:39:02 DEBUG : Waiting for deletions to finish
2025/03/15 07:39:02 INFO  : There was nothing to transfer
2025/03/15 07:39:02 DEBUG : rclone-sync-test-ignore-file: Excluded
2025/03/15 07:39:03 ERROR : : Entry doesn't belong in directory "" (same as directory) - ignoring
2025/03/15 07:39:03 DEBUG : rclone-sync-test: Excluded
2025/03/15 07:39:03 DEBUG : rclone-sync-test-include/layer2: Excluded
2025/03/15 07:39:03 DEBUG : GCS bucket rclone-test-werugiq8benu: Waiting for checks to finish
2025/03/15 07:39:03 DEBUG : GCS bucket rclone-test-werugiq8benu: Waiting for transfers to finish
2025/03/15 07:39:03 DEBUG : Waiting for deletions to finish
2025/03/15 07:39:03 INFO  : rclone-sync-test-include: Removing directory
2025/03/15 07:39:03 DEBUG : rclone-sync-test-include/: Removing directory marker
2025/03/15 07:39:04 DEBUG : rclone-sync-test-include: Failed to Rmdir: removing directory marker failed: googleapi: Error 404: No such object: rclone-test-werugiq8benu/rclone-sync-test-include/, notFound
2025/03/15 07:39:04 DEBUG : GCS bucket rclone-test-werugiq8benu: failed to delete 1 directories
2025/03/15 07:39:04 INFO  : There was nothing to transfer
    run.go:180: Remote "GCS bucket rclone-test-werugiq8benu", Local "Local file system at /tmp/rclone2533315254", Modify Window "1ns"
2025/03/15 07:39:04 DEBUG : rclone-sync-test-ignore-file: Excluded
2025/03/15 07:39:05 DEBUG : rclone-sync-test: Excluded
2025/03/15 07:39:05 DEBUG : rclone-sync-test-include/layer2: Excluded
    run.go:180: Remote "GCS bucket rclone-test-werugiq8benu", Local "Local file system at /tmp/rclone2533315254", Modify Window "1ns"
2025/03/15 07:39:05 DEBUG : rclone-sync-test-ignore-file: Excluded
2025/03/15 07:39:06 DEBUG : rclone-sync-test: Excluded
2025/03/15 07:39:07 DEBUG : rclone-sync-test-include/layer2: Excluded
    run.go:180: Remote "GCS bucket rclone-test-werugiq8benu", Local "Local file system at /tmp/rclone2533315254", Modify Window "1ns"
2025/03/15 07:39:07 DEBUG : rclone-sync-test-ignore-file: Excluded
2025/03/15 07:39:07 DEBUG : rclone-sync-test: Excluded
2025/03/15 07:39:08 DEBUG : rclone-sync-test-include/layer2: Excluded
    run.go:180: Remote "GCS bucket rclone-test-werugiq8benu", Local "Local file system at /tmp/rclone2533315254", Modify Window "1ns"
2025/03/15 07:39:08 DEBUG : rclone-sync-test-ignore-file: Excluded
2025/03/15 07:39:09 DEBUG : rclone-sync-test: Excluded
2025/03/15 07:39:09 DEBUG : rclone-sync-test-include/layer2: Excluded
    run.go:180: Remote "GCS bucket rclone-test-werugiq8benu", Local "Local file system at /tmp/rclone2533315254", Modify Window "1ns"
2025/03/15 07:39:09 DEBUG : rclone-sync-test-ignore-file: Excluded
2025/03/15 07:39:10 DEBUG : rclone-sync-test: Excluded
2025/03/15 07:39:10 DEBUG : rclone-sync-test-include/layer2: Excluded
    run.go:180: Remote "GCS bucket rclone-test-werugiq8benu", Local "Local file system at /tmp/rclone2533315254", Modify Window "1ns"
2025/03/15 07:39:10 DEBUG : rclone-sync-test-ignore-file: Excluded
2025/03/15 07:39:11 DEBUG : rclone-sync-test: Excluded
2025/03/15 07:39:12 DEBUG : rclone-sync-test-include/layer2: Excluded
2025/03/15 07:39:12 DEBUG : rclone-sync-test-ignore-file: Excluded
2025/03/15 07:39:12 ERROR : : Entry doesn't belong in directory "" (same as directory) - ignoring
2025/03/15 07:39:13 DEBUG : rclone-sync-test: Excluded
2025/03/15 07:39:13 DEBUG : rclone-sync-test-include/layer2: Excluded
2025/03/15 07:39:13 DEBUG : GCS bucket rclone-test-werugiq8benu path rclone-sync-test-include/layer2: Waiting for checks to finish
2025/03/15 07:39:13 DEBUG : GCS bucket rclone-test-werugiq8benu path rclone-sync-test-include/layer2: Waiting for transfers to finish
2025/03/15 07:39:13 DEBUG : Waiting for deletions to finish
2025/03/15 07:39:13 INFO  : There was nothing to transfer
    run.go:180: Remote "GCS bucket rclone-test-werugiq8benu", Local "Local file system at /tmp/rclone2533315254", Modify Window "1ns"
2025/03/15 07:39:14 DEBUG : rclone-sync-test-ignore-file: Excluded
2025/03/15 07:39:14 DEBUG : rclone-sync-test: Excluded
2025/03/15 07:39:15 DEBUG : rclone-sync-test-include/layer2: Excluded
    run.go:180: Remote "GCS bucket rclone-test-werugiq8benu", Local "Local file system at /tmp/rclone2533315254", Modify Window "1ns"
2025/03/15 07:39:15 DEBUG : rclone-sync-test-ignore-file: Excluded
2025/03/15 07:39:16 DEBUG : rclone-sync-test: Excluded
2025/03/15 07:39:16 DEBUG : rclone-sync-test-include/layer2: Excluded
2025/03/15 07:39:17 DEBUG : rclone-sync-test-ignore-file: Excluded
2025/03/15 07:39:17 ERROR : : Entry doesn't belong in directory "" (same as directory) - ignoring
2025/03/15 07:39:17 DEBUG : rclone-sync-test: Excluded
2025/03/15 07:39:18 DEBUG : rclone-sync-test-include/layer2: Excluded
2025/03/15 07:39:18 DEBUG : GCS bucket rclone-test-werugiq8benu: Waiting for checks to finish
2025/03/15 07:39:18 DEBUG : GCS bucket rclone-test-werugiq8benu: Waiting for transfers to finish
2025/03/15 07:39:18 DEBUG : Waiting for deletions to finish
2025/03/15 07:39:18 INFO  : rclone-sync-test-include: Removing directory
2025/03/15 07:39:18 DEBUG : rclone-sync-test-include/: Removing directory marker
2025/03/15 07:39:18 DEBUG : rclone-sync-test-include: Failed to Rmdir: removing directory marker failed: googleapi: Error 404: No such object: rclone-test-werugiq8benu/rclone-sync-test-include/, notFound
2025/03/15 07:39:18 DEBUG : GCS bucket rclone-test-werugiq8benu: failed to delete 1 directories
2025/03/15 07:39:18 INFO  : There was nothing to transfer
    run.go:180: Remote "GCS bucket rclone-test-werugiq8benu", Local "Local file system at /tmp/rclone2533315254", Modify Window "1ns"
2025/03/15 07:39:18 DEBUG : rclone-sync-test-ignore-file: Excluded
2025/03/15 07:39:18 DEBUG : rclone-sync-test: Excluded
2025/03/15 07:39:19 DEBUG : rclone-sync-test-include/layer2: Excluded
    run.go:180: Remote "GCS bucket rclone-test-werugiq8benu", Local "Local file system at /tmp/rclone2533315254", Modify Window "1ns"
2025/03/15 07:39:19 DEBUG : rclone-sync-test-ignore-file: Excluded
2025/03/15 07:39:20 DEBUG : rclone-sync-test: Excluded
2025/03/15 07:39:20 DEBUG : rclone-sync-test-include/layer2: Excluded
    run.go:180: Remote "GCS bucket rclone-test-werugiq8benu", Local "Local file system at /tmp/rclone2533315254", Modify Window "1ns"
2025/03/15 07:39:20 DEBUG : rclone-sync-test-ignore-file: Excluded
2025/03/15 07:39:21 DEBUG : rclone-sync-test: Excluded
2025/03/15 07:39:21 DEBUG : rclone-sync-test-include/layer2: Excluded
    run.go:180: Remote "GCS bucket rclone-test-werugiq8benu", Local "Local file system at /tmp/rclone2533315254", Modify Window "1ns"
2025/03/15 07:39:21 DEBUG : rclone-sync-test-ignore-file: Excluded
2025/03/15 07:39:22 DEBUG : rclone-sync-test: Excluded
2025/03/15 07:39:22 DEBUG : rclone-sync-test-include/layer2: Excluded
2025/03/15 07:39:23 DEBUG : rclone-sync-test-ignore-file: Excluded
2025/03/15 07:39:23 DEBUG : : Excluded
2025/03/15 07:39:23 DEBUG : rclone-sync-test: Excluded
2025/03/15 07:39:24 DEBUG : rclone-sync-test-include/layer2: Excluded
2025/03/15 07:39:24 DEBUG : GCS bucket rclone-test-werugiq8benu path rclone-sync-test-ignore-file: Waiting for checks to finish
2025/03/15 07:39:24 DEBUG : GCS bucket rclone-test-werugiq8benu path rclone-sync-test-ignore-file: Waiting for transfers to finish
2025/03/15 07:39:24 DEBUG : Waiting for deletions to finish
2025/03/15 07:39:24 INFO  : There was nothing to transfer
    run.go:180: Remote "GCS bucket rclone-test-werugiq8benu", Local "Local file system at /tmp/rclone2533315254", Modify Window "1ns"
2025/03/15 07:39:24 DEBUG : rclone-sync-test-ignore-file: Excluded
2025/03/15 07:39:25 DEBUG : rclone-sync-test: Excluded
2025/03/15 07:39:25 DEBUG : rclone-sync-test-include/layer2: Excluded
    run.go:180: Remote "GCS bucket rclone-test-werugiq8benu", Local "Local file system at /tmp/rclone2533315254", Modify Window "1ns"
2025/03/15 07:39:25 DEBUG : rclone-sync-test-ignore-file: Excluded
2025/03/15 07:39:26 DEBUG : rclone-sync-test: Excluded
2025/03/15 07:39:26 DEBUG : rclone-sync-test-include/layer2: Excluded
    run.go:180: Remote "GCS bucket rclone-test-werugiq8benu", Local "Local file system at /tmp/rclone2533315254", Modify Window "1ns"
2025/03/15 07:39:26 DEBUG : rclone-sync-test-ignore-file: Excluded
2025/03/15 07:39:27 DEBUG : rclone-sync-test: Excluded
2025/03/15 07:39:27 DEBUG : rclone-sync-test-include/layer2: Excluded
    run.go:180: Remote "GCS bucket rclone-test-werugiq8benu", Local "Local file system at /tmp/rclone2533315254", Modify Window "1ns"
2025/03/15 07:39:27 DEBUG : rclone-sync-test-ignore-file: Excluded
2025/03/15 07:39:28 DEBUG : rclone-sync-test: Excluded
2025/03/15 07:39:28 DEBUG : rclone-sync-test-include/layer2: Excluded
    run.go:180: Remote "GCS bucket rclone-test-werugiq8benu", Local "Local file system at /tmp/rclone2533315254", Modify Window "1ns"
2025/03/15 07:39:29 DEBUG : rclone-sync-test-ignore-file: Excluded
2025/03/15 07:39:29 DEBUG : rclone-sync-test: Excluded
2025/03/15 07:39:30 DEBUG : rclone-sync-test-include/layer2: Excluded
2025/03/15 07:39:30 DEBUG : rclone-sync-test-include/layer2/: Removing directory marker
    run.go:125: removing dir "rclone-sync-test-include/layer2" failed - try 1/3: removing directory marker failed: googleapi: Error 404: No such object: rclone-test-werugiq8benu/rclone-sync-test-include/layer2/, notFound
2025/03/15 07:39:31 DEBUG : rclone-sync-test-include/layer2/: Removing directory marker
    run.go:125: removing dir "rclone-sync-test-include/layer2" failed - try 2/3: removing directory marker failed: googleapi: Error 404: No such object: rclone-test-werugiq8benu/rclone-sync-test-include/layer2/, notFound
2025/03/15 07:39:32 DEBUG : rclone-sync-test-include/layer2/: Removing directory marker
    run.go:125: removing dir "rclone-sync-test-include/layer2" failed - try 3/3: removing directory marker failed: googleapi: Error 404: No such object: rclone-test-werugiq8benu/rclone-sync-test-include/layer2/, notFound
    run.go:128: removing dir "rclone-sync-test-include/layer2" failed: removing directory marker failed: googleapi: Error 404: No such object: rclone-test-werugiq8benu/rclone-sync-test-include/layer2/, notFound
2025/03/15 07:39:33 DEBUG : rclone-sync-test-include/: Removing directory marker
    run.go:125: removing dir "rclone-sync-test-include" failed - try 1/3: removing directory marker failed: googleapi: Error 404: No such object: rclone-test-werugiq8benu/rclone-sync-test-include/, notFound
2025/03/15 07:39:34 DEBUG : rclone-sync-test-include/: Removing directory marker
    run.go:125: removing dir "rclone-sync-test-include" failed - try 2/3: removing directory marker failed: googleapi: Error 404: No such object: rclone-test-werugiq8benu/rclone-sync-test-include/, notFound
2025/03/15 07:39:35 DEBUG : rclone-sync-test-include/: Removing directory marker
    run.go:125: removing dir "rclone-sync-test-include" failed - try 3/3: removing directory marker failed: googleapi: Error 404: No such object: rclone-test-werugiq8benu/rclone-sync-test-include/, notFound
    run.go:128: removing dir "rclone-sync-test-include" failed: removing directory marker failed: googleapi: Error 404: No such object: rclone-test-werugiq8benu/rclone-sync-test-include/, notFound
2025/03/15 07:39:36 DEBUG : rclone-sync-test-ignore-file/: Removing directory marker
2025/03/15 07:39:36 DEBUG : rclone-sync-test-ignore-file/: Removing directory marker
    run.go:125: removing dir "rclone-sync-test-ignore-file" failed - try 1/3: removing directory marker failed: googleapi: Error 404: No such object: rclone-test-werugiq8benu/rclone-sync-test-ignore-file/, notFound
2025/03/15 07:39:37 DEBUG : rclone-sync-test-ignore-file/: Removing directory marker
    run.go:125: removing dir "rclone-sync-test-ignore-file" failed - try 2/3: removing directory marker failed: googleapi: Error 404: No such object: rclone-test-werugiq8benu/rclone-sync-test-ignore-file/, notFound
2025/03/15 07:39:38 DEBUG : rclone-sync-test-ignore-file/: Removing directory marker
    run.go:125: removing dir "rclone-sync-test-ignore-file" failed - try 3/3: removing directory marker failed: googleapi: Error 404: No such object: rclone-test-werugiq8benu/rclone-sync-test-ignore-file/, notFound
    run.go:128: removing dir "rclone-sync-test-ignore-file" failed: removing directory marker failed: googleapi: Error 404: No such object: rclone-test-werugiq8benu/rclone-sync-test-ignore-file/, notFound
2025/03/15 07:39:39 DEBUG : rclone-sync-test/: Removing directory marker
    run.go:125: removing dir "rclone-sync-test" failed - try 1/3: removing directory marker failed: googleapi: Error 404: No such object: rclone-test-werugiq8benu/rclone-sync-test/, notFound
2025/03/15 07:39:40 DEBUG : rclone-sync-test/: Removing directory marker
    run.go:125: removing dir "rclone-sync-test" failed - try 2/3: removing directory marker failed: googleapi: Error 404: No such object: rclone-test-werugiq8benu/rclone-sync-test/, notFound
2025/03/15 07:39:41 DEBUG : rclone-sync-test/: Removing directory marker
    run.go:125: removing dir "rclone-sync-test" failed - try 3/3: removing directory marker failed: googleapi: Error 404: No such object: rclone-test-werugiq8benu/rclone-sync-test/, notFound
    run.go:128: removing dir "rclone-sync-test" failed: removing directory marker failed: googleapi: Error 404: No such object: rclone-test-werugiq8benu/rclone-sync-test/, notFound
    fstest.go:292: Sleeping for 1s for list eventual consistency: 1/3
    fstest.go:292: Sleeping for 2s for list eventual consistency: 2/3
    fstest.go:292: Sleeping for 4s for list eventual consistency: 3/3
    fstest.go:321: 
        	Error Trace:	/home/rclone/go/src/github.com/rclone/rclone/fstest/fstest.go:321
        	            				/home/rclone/go/src/github.com/rclone/rclone/fstest/fstest.go:332
        	            				/home/rclone/go/src/github.com/rclone/rclone/fstest/run.go:173
        	            				/home/rclone/go/src/github.com/rclone/rclone/fstest/run.go:388
        	            				/home/rclone/go/pkg/mod/golang.org/toolchain@v0.0.1-go1.23.0.linux-amd64/src/testing/testing.go:1176
        	            				/home/rclone/go/pkg/mod/golang.org/toolchain@v0.0.1-go1.23.0.linux-amd64/src/testing/testing.go:1354
        	            				/home/rclone/go/pkg/mod/golang.org/toolchain@v0.0.1-go1.23.0.linux-amd64/src/testing/testing.go:1684
        	Error:      	Not equal: 
        	            	expected: []string{}
        	            	actual  : []string{"rclone-sync-test", "rclone-sync-test-ignore-file", "rclone-sync-test-include", "rclone-sync-test-include/layer2"}
        	            	
        	            	Diff:
        	            	--- Expected
        	            	+++ Actual
        	            	@@ -1,2 +1,6 @@
        	            	-([]string) {
        	            	+([]string) (len=4) {
        	            	+ (string) (len=16) "rclone-sync-test",
        	            	+ (string) (len=28) "rclone-sync-test-ignore-file",
        	            	+ (string) (len=24) "rclone-sync-test-include",
        	            	+ (string) (len=31) "rclone-sync-test-include/layer2"
        	            	 }
        	Test:       	TestSyncOverlapWithFilter
        	Messages:   	directories
2025/03/15 07:39:50 DEBUG : rclone-sync-test-include/layer2/: Removing directory marker
    run.go:125: removing dir "rclone-sync-test-include/layer2" failed - try 1/3: removing directory marker failed: googleapi: Error 404: No such object: rclone-test-werugiq8benu/rclone-sync-test-include/layer2/, notFound
2025/03/15 07:39:51 DEBUG : rclone-sync-test-include/layer2/: Removing directory marker
    run.go:125: removing dir "rclone-sync-test-include/layer2" failed - try 2/3: removing directory marker failed: googleapi: Error 404: No such object: rclone-test-werugiq8benu/rclone-sync-test-include/layer2/, notFound
2025/03/15 07:39:52 DEBUG : rclone-sync-test-include/layer2/: Removing directory marker
    run.go:125: removing dir "rclone-sync-test-include/layer2" failed - try 3/3: removing directory marker failed: googleapi: Error 404: No such object: rclone-test-werugiq8benu/rclone-sync-test-include/layer2/, notFound
    run.go:128: removing dir "rclone-sync-test-include/layer2" failed: removing directory marker failed: googleapi: Error 404: No such object: rclone-test-werugiq8benu/rclone-sync-test-include/layer2/, notFound
2025/03/15 07:39:53 DEBUG : rclone-sync-test-include/: Removing directory marker
    run.go:125: removing dir "rclone-sync-test-include" failed - try 1/3: removing directory marker failed: googleapi: Error 404: No such object: rclone-test-werugiq8benu/rclone-sync-test-include/, notFound
2025/03/15 07:39:54 DEBUG : rclone-sync-test-include/: Removing directory marker
    run.go:125: removing dir "rclone-sync-test-include" failed - try 2/3: removing directory marker failed: googleapi: Error 404: No such object: rclone-test-werugiq8benu/rclone-sync-test-include/, notFound
2025/03/15 07:39:55 DEBUG : rclone-sync-test-include/: Removing directory marker
    run.go:125: removing dir "rclone-sync-test-include" failed - try 3/3: removing directory marker failed: googleapi: Error 404: No such object: rclone-test-werugiq8benu/rclone-sync-test-include/, notFound
    run.go:128: removing dir "rclone-sync-test-include" failed: removing directory marker failed: googleapi: Error 404: No such object: rclone-test-werugiq8benu/rclone-sync-test-include/, notFound
2025/03/15 07:39:56 DEBUG : rclone-sync-test-ignore-file/: Removing directory marker
    run.go:125: removing dir "rclone-sync-test-ignore-file" failed - try 1/3: removing directory marker failed: googleapi: Error 404: No such object: rclone-test-werugiq8benu/rclone-sync-test-ignore-file/, notFound
2025/03/15 07:39:57 DEBUG : rclone-sync-test-ignore-file/: Removing directory marker
    run.go:125: removing dir "rclone-sync-test-ignore-file" failed - try 2/3: removing directory marker failed: googleapi: Error 404: No such object: rclone-test-werugiq8benu/rclone-sync-test-ignore-file/, notFound
2025/03/15 07:39:58 DEBUG : rclone-sync-test-ignore-file/: Removing directory marker
    run.go:125: removing dir "rclone-sync-test-ignore-file" failed - try 3/3: removing directory marker failed: googleapi: Error 404: No such object: rclone-test-werugiq8benu/rclone-sync-test-ignore-file/, notFound
    run.go:128: removing dir "rclone-sync-test-ignore-file" failed: removing directory marker failed: googleapi: Error 404: No such object: rclone-test-werugiq8benu/rclone-sync-test-ignore-file/, notFound
2025/03/15 07:39:59 DEBUG : rclone-sync-test/: Removing directory marker
    run.go:125: removing dir "rclone-sync-test" failed - try 1/3: removing directory marker failed: googleapi: Error 404: No such object: rclone-test-werugiq8benu/rclone-sync-test/, notFound
2025/03/15 07:40:00 DEBUG : rclone-sync-test/: Removing directory marker
    run.go:125: removing dir "rclone-sync-test" failed - try 2/3: removing directory marker failed: googleapi: Error 404: No such object: rclone-test-werugiq8benu/rclone-sync-test/, notFound
2025/03/15 07:40:01 DEBUG : rclone-sync-test/: Removing directory marker
    run.go:125: removing dir "rclone-sync-test" failed - try 3/3: removing directory marker failed: googleapi: Error 404: No such object: rclone-test-werugiq8benu/rclone-sync-test/, notFound
    run.go:128: removing dir "rclone-sync-test" failed: removing directory marker failed: googleapi: Error 404: No such object: rclone-test-werugiq8benu/rclone-sync-test/, notFound
    fstest.go:292: Sleeping for 1s for list eventual consistency: 1/3
    fstest.go:292: Sleeping for 2s for list eventual consistency: 2/3
    fstest.go:292: Sleeping for 4s for list eventual consistency: 3/3
    fstest.go:321: 
        	Error Trace:	/home/rclone/go/src/github.com/rclone/rclone/fstest/fstest.go:321
        	            				/home/rclone/go/src/github.com/rclone/rclone/fstest/fstest.go:332
        	            				/home/rclone/go/src/github.com/rclone/rclone/fstest/run.go:173
        	            				/home/rclone/go/src/github.com/rclone/rclone/fstest/run.go:388
        	            				/home/rclone/go/pkg/mod/golang.org/toolchain@v0.0.1-go1.23.0.linux-amd64/src/testing/testing.go:1176
        	            				/home/rclone/go/pkg/mod/golang.org/toolchain@v0.0.1-go1.23.0.linux-amd64/src/testing/testing.go:1354
        	            				/home/rclone/go/pkg/mod/golang.org/toolchain@v0.0.1-go1.23.0.linux-amd64/src/testing/testing.go:1684
        	Error:      	Not equal: 
        	            	expected: []string{}
        	            	actual  : []string{"rclone-sync-test", "rclone-sync-test-ignore-file", "rclone-sync-test-include", "rclone-sync-test-include/layer2"}
        	            	
        	            	Diff:
        	            	--- Expected
        	            	+++ Actual
        	            	@@ -1,2 +1,6 @@
        	            	-([]string) {
        	            	+([]string) (len=4) {
        	            	+ (string) (len=16) "rclone-sync-test",
        	            	+ (string) (len=28) "rclone-sync-test-ignore-file",
        	            	+ (string) (len=24) "rclone-sync-test-include",
        	            	+ (string) (len=31) "rclone-sync-test-include/layer2"
        	            	 }
        	Test:       	TestSyncOverlapWithFilter
        	Messages:   	directories
2025/03/15 07:40:10 DEBUG : rclone-sync-test-include/layer2/: Removing directory marker
    run.go:125: removing dir "rclone-sync-test-include/layer2" failed - try 1/3: removing directory marker failed: googleapi: Error 404: No such object: rclone-test-werugiq8benu/rclone-sync-test-include/layer2/, notFound
2025/03/15 07:40:11 DEBUG : rclone-sync-test-include/layer2/: Removing directory marker
    run.go:125: removing dir "rclone-sync-test-include/layer2" failed - try 2/3: removing directory marker failed: googleapi: Error 404: No such object: rclone-test-werugiq8benu/rclone-sync-test-include/layer2/, notFound
2025/03/15 07:40:12 DEBUG : rclone-sync-test-include/layer2/: Removing directory marker
    run.go:125: removing dir "rclone-sync-test-include/layer2" failed - try 3/3: removing directory marker failed: googleapi: Error 404: No such object: rclone-test-werugiq8benu/rclone-sync-test-include/layer2/, notFound
    run.go:128: removing dir "rclone-sync-test-include/layer2" failed: removing directory marker failed: googleapi: Error 404: No such object: rclone-test-werugiq8benu/rclone-sync-test-include/layer2/, notFound
2025/03/15 07:40:13 DEBUG : rclone-sync-test-include/: Removing directory marker
    run.go:125: removing dir "rclone-sync-test-include" failed - try 1/3: removing directory marker failed: googleapi: Error 404: No such object: rclone-test-werugiq8benu/rclone-sync-test-include/, notFound
2025/03/15 07:40:14 DEBUG : rclone-sync-test-include/: Removing directory marker
    run.go:125: removing dir "rclone-sync-test-include" failed - try 2/3: removing directory marker failed: googleapi: Error 404: No such object: rclone-test-werugiq8benu/rclone-sync-test-include/, notFound
2025/03/15 07:40:15 DEBUG : rclone-sync-test-include/: Removing directory marker
    run.go:125: removing dir "rclone-sync-test-include" failed - try 3/3: removing directory marker failed: googleapi: Error 404: No such object: rclone-test-werugiq8benu/rclone-sync-test-include/, notFound
    run.go:128: removing dir "rclone-sync-test-include" failed: removing directory marker failed: googleapi: Error 404: No such object: rclone-test-werugiq8benu/rclone-sync-test-include/, notFound
2025/03/15 07:40:16 DEBUG : rclone-sync-test-ignore-file/: Removing directory marker
    run.go:125: removing dir "rclone-sync-test-ignore-file" failed - try 1/3: removing directory marker failed: googleapi: Error 404: No such object: rclone-test-werugiq8benu/rclone-sync-test-ignore-file/, notFound
2025/03/15 07:40:17 DEBUG : rclone-sync-test-ignore-file/: Removing directory marker
    run.go:125: removing dir "rclone-sync-test-ignore-file" failed - try 2/3: removing directory marker failed: googleapi: Error 404: No such object: rclone-test-werugiq8benu/rclone-sync-test-ignore-file/, notFound
2025/03/15 07:40:18 DEBUG : rclone-sync-test-ignore-file/: Removing directory marker
    run.go:125: removing dir "rclone-sync-test-ignore-file" failed - try 3/3: removing directory marker failed: googleapi: Error 404: No such object: rclone-test-werugiq8benu/rclone-sync-test-ignore-file/, notFound
    run.go:128: removing dir "rclone-sync-test-ignore-file" failed: removing directory marker failed: googleapi: Error 404: No such object: rclone-test-werugiq8benu/rclone-sync-test-ignore-file/, notFound
2025/03/15 07:40:19 DEBUG : rclone-sync-test/: Removing directory marker
    run.go:125: removing dir "rclone-sync-test" failed - try 1/3: removing directory marker failed: googleapi: Error 404: No such object: rclone-test-werugiq8benu/rclone-sync-test/, notFound
2025/03/15 07:40:20 DEBUG : rclone-sync-test/: Removing directory marker
    run.go:125: removing dir "rclone-sync-test" failed - try 2/3: removing directory marker failed: googleapi: Error 404: No such object: rclone-test-werugiq8benu/rclone-sync-test/, notFound
2025/03/15 07:40:21 DEBUG : rclone-sync-test/: Removing directory marker
    run.go:125: removing dir "rclone-sync-test" failed - try 3/3: removing directory marker failed: googleapi: Error 404: No such object: rclone-test-werugiq8benu/rclone-sync-test/, notFound
    run.go:128: removing dir "rclone-sync-test" failed: removing directory marker failed: googleapi: Error 404: No such object: rclone-test-werugiq8benu/rclone-sync-test/, notFound
    fstest.go:292: Sleeping for 1s for list eventual consistency: 1/3
    fstest.go:292: Sleeping for 2s for list eventual consistency: 2/3
    fstest.go:292: Sleeping for 4s for list eventual consistency: 3/3
    fstest.go:321: 
        	Error Trace:	/home/rclone/go/src/github.com/rclone/rclone/fstest/fstest.go:321
        	            				/home/rclone/go/src/github.com/rclone/rclone/fstest/fstest.go:332
        	            				/home/rclone/go/src/github.com/rclone/rclone/fstest/run.go:173
        	            				/home/rclone/go/src/github.com/rclone/rclone/fstest/run.go:388
        	            				/home/rclone/go/pkg/mod/golang.org/toolchain@v0.0.1-go1.23.0.linux-amd64/src/testing/testing.go:1176
        	            				/home/rclone/go/pkg/mod/golang.org/toolchain@v0.0.1-go1.23.0.linux-amd64/src/testing/testing.go:1354
        	            				/home/rclone/go/pkg/mod/golang.org/toolchain@v0.0.1-go1.23.0.linux-amd64/src/testing/testing.go:1684
        	Error:      	Not equal: 
        	            	expected: []string{}
        	            	actual  : []string{"rclone-sync-test", "rclone-sync-test-ignore-file", "rclone-sync-test-include", "rclone-sync-test-include/layer2"}
        	            	
        	            	Diff:
        	            	--- Expected
        	            	+++ Actual
        	            	@@ -1,2 +1,6 @@
        	            	-([]string) {
        	            	+([]string) (len=4) {
        	            	+ (string) (len=16) "rclone-sync-test",
        	            	+ (string) (len=28) "rclone-sync-test-ignore-file",
        	            	+ (string) (len=24) "rclone-sync-test-include",
        	            	+ (string) (len=31) "rclone-sync-test-include/layer2"
        	            	 }
        	Test:       	TestSyncOverlapWithFilter
        	Messages:   	directories
2025/03/15 07:40:30 DEBUG : rclone-sync-test-include/layer2/: Removing directory marker
    run.go:125: removing dir "rclone-sync-test-include/layer2" failed - try 1/3: removing directory marker failed: googleapi: Error 404: No such object: rclone-test-werugiq8benu/rclone-sync-test-include/layer2/, notFound
2025/03/15 07:40:31 DEBUG : rclone-sync-test-include/layer2/: Removing directory marker
    run.go:125: removing dir "rclone-sync-test-include/layer2" failed - try 2/3: removing directory marker failed: googleapi: Error 404: No such object: rclone-test-werugiq8benu/rclone-sync-test-include/layer2/, notFound
2025/03/15 07:40:32 DEBUG : rclone-sync-test-include/layer2/: Removing directory marker
    run.go:125: removing dir "rclone-sync-test-include/layer2" failed - try 3/3: removing directory marker failed: googleapi: Error 404: No such object: rclone-test-werugiq8benu/rclone-sync-test-include/layer2/, notFound
    run.go:128: removing dir "rclone-sync-test-include/layer2" failed: removing directory marker failed: googleapi: Error 404: No such object: rclone-test-werugiq8benu/rclone-sync-test-include/layer2/, notFound
2025/03/15 07:40:33 DEBUG : rclone-sync-test-include/: Removing directory marker
    run.go:125: removing dir "rclone-sync-test-include" failed - try 1/3: removing directory marker failed: googleapi: Error 404: No such object: rclone-test-werugiq8benu/rclone-sync-test-include/, notFound
2025/03/15 07:40:34 DEBUG : rclone-sync-test-include/: Removing directory marker
    run.go:125: removing dir "rclone-sync-test-include" failed - try 2/3: removing directory marker failed: googleapi: Error 404: No such object: rclone-test-werugiq8benu/rclone-sync-test-include/, notFound
2025/03/15 07:40:35 DEBUG : rclone-sync-test-include/: Removing directory marker
    run.go:125: removing dir "rclone-sync-test-include" failed - try 3/3: removing directory marker failed: googleapi: Error 404: No such object: rclone-test-werugiq8benu/rclone-sync-test-include/, notFound
    run.go:128: removing dir "rclone-sync-test-include" failed: removing directory marker failed: googleapi: Error 404: No such object: rclone-test-werugiq8benu/rclone-sync-test-include/, notFound
2025/03/15 07:40:36 DEBUG : rclone-sync-test-ignore-file/: Removing directory marker
    run.go:125: removing dir "rclone-sync-test-ignore-file" failed - try 1/3: removing directory marker failed: googleapi: Error 404: No such object: rclone-test-werugiq8benu/rclone-sync-test-ignore-file/, notFound
2025/03/15 07:40:37 DEBUG : rclone-sync-test-ignore-file/: Removing directory marker
    run.go:125: removing dir "rclone-sync-test-ignore-file" failed - try 2/3: removing directory marker failed: googleapi: Error 404: No such object: rclone-test-werugiq8benu/rclone-sync-test-ignore-file/, notFound
2025/03/15 07:40:38 DEBUG : rclone-sync-test-ignore-file/: Removing directory marker
    run.go:125: removing dir "rclone-sync-test-ignore-file" failed - try 3/3: removing directory marker failed: googleapi: Error 404: No such object: rclone-test-werugiq8benu/rclone-sync-test-ignore-file/, notFound
    run.go:128: removing dir "rclone-sync-test-ignore-file" failed: removing directory marker failed: googleapi: Error 404: No such object: rclone-test-werugiq8benu/rclone-sync-test-ignore-file/, notFound
2025/03/15 07:40:39 DEBUG : rclone-sync-test/: Removing directory marker
    run.go:125: removing dir "rclone-sync-test" failed - try 1/3: removing directory marker failed: googleapi: Error 404: No such object: rclone-test-werugiq8benu/rclone-sync-test/, notFound
2025/03/15 07:40:40 DEBUG : rclone-sync-test/: Removing directory marker
    run.go:125: removing dir "rclone-sync-test" failed - try 2/3: removing directory marker failed: googleapi: Error 404: No such object: rclone-test-werugiq8benu/rclone-sync-test/, notFound
2025/03/15 07:40:41 DEBUG : rclone-sync-test/: Removing directory marker
    run.go:125: removing dir "rclone-sync-test" failed - try 3/3: removing directory marker failed: googleapi: Error 404: No such object: rclone-test-werugiq8benu/rclone-sync-test/, notFound
    run.go:128: removing dir "rclone-sync-test" failed: removing directory marker failed: googleapi: Error 404: No such object: rclone-test-werugiq8benu/rclone-sync-test/, notFound
    fstest.go:292: Sleeping for 1s for list eventual consistency: 1/3
    fstest.go:292: Sleeping for 2s for list eventual consistency: 2/3
    fstest.go:292: Sleeping for 4s for list eventual consistency: 3/3
    fstest.go:321: 
        	Error Trace:	/home/rclone/go/src/github.com/rclone/rclone/fstest/fstest.go:321
        	            				/home/rclone/go/src/github.com/rclone/rclone/fstest/fstest.go:332
        	            				/home/rclone/go/src/github.com/rclone/rclone/fstest/run.go:173
        	            				/home/rclone/go/src/github.com/rclone/rclone/fstest/run.go:388
        	            				/home/rclone/go/pkg/mod/golang.org/toolchain@v0.0.1-go1.23.0.linux-amd64/src/testing/testing.go:1176
        	            				/home/rclone/go/pkg/mod/golang.org/toolchain@v0.0.1-go1.23.0.linux-amd64/src/testing/testing.go:1354
        	            				/home/rclone/go/pkg/mod/golang.org/toolchain@v0.0.1-go1.23.0.linux-amd64/src/testing/testing.go:1684
        	Error:      	Not equal: 
        	            	expected: []string{}
        	            	actual  : []string{"rclone-sync-test", "rclone-sync-test-ignore-file", "rclone-sync-test-include", "rclone-sync-test-include/layer2"}
        	            	
        	            	Diff:
        	            	--- Expected
        	            	+++ Actual
        	            	@@ -1,2 +1,6 @@
        	            	-([]string) {
        	            	+([]string) (len=4) {
        	            	+ (string) (len=16) "rclone-sync-test",
        	            	+ (string) (len=28) "rclone-sync-test-ignore-file",
        	            	+ (string) (len=24) "rclone-sync-test-include",
        	            	+ (string) (len=31) "rclone-sync-test-include/layer2"
        	            	 }
        	Test:       	TestSyncOverlapWithFilter
        	Messages:   	directories
2025/03/15 07:40:50 DEBUG : rclone-sync-test-include/layer2/: Removing directory marker
    run.go:125: removing dir "rclone-sync-test-include/layer2" failed - try 1/3: removing directory marker failed: googleapi: Error 404: No such object: rclone-test-werugiq8benu/rclone-sync-test-include/layer2/, notFound
2025/03/15 07:40:51 DEBUG : rclone-sync-test-include/layer2/: Removing directory marker
    run.go:125: removing dir "rclone-sync-test-include/layer2" failed - try 2/3: removing directory marker failed: googleapi: Error 404: No such object: rclone-test-werugiq8benu/rclone-sync-test-include/layer2/, notFound
2025/03/15 07:40:52 DEBUG : rclone-sync-test-include/layer2/: Removing directory marker
    run.go:125: removing dir "rclone-sync-test-include/layer2" failed - try 3/3: removing directory marker failed: googleapi: Error 404: No such object: rclone-test-werugiq8benu/rclone-sync-test-include/layer2/, notFound
    run.go:128: removing dir "rclone-sync-test-include/layer2" failed: removing directory marker failed: googleapi: Error 404: No such object: rclone-test-werugiq8benu/rclone-sync-test-include/layer2/, notFound
2025/03/15 07:40:53 DEBUG : rclone-sync-test-include/: Removing directory marker
    run.go:125: removing dir "rclone-sync-test-include" failed - try 1/3: removing directory marker failed: googleapi: Error 404: No such object: rclone-test-werugiq8benu/rclone-sync-test-include/, notFound
2025/03/15 07:40:54 DEBUG : rclone-sync-test-include/: Removing directory marker
    run.go:125: removing dir "rclone-sync-test-include" failed - try 2/3: removing directory marker failed: googleapi: Error 404: No such object: rclone-test-werugiq8benu/rclone-sync-test-include/, notFound
2025/03/15 07:40:55 DEBUG : rclone-sync-test-include/: Removing directory marker
    run.go:125: removing dir "rclone-sync-test-include" failed - try 3/3: removing directory marker failed: googleapi: Error 404: No such object: rclone-test-werugiq8benu/rclone-sync-test-include/, notFound
    run.go:128: removing dir "rclone-sync-test-include" failed: removing directory marker failed: googleapi: Error 404: No such object: rclone-test-werugiq8benu/rclone-sync-test-include/, notFound
2025/03/15 07:40:56 DEBUG : rclone-sync-test-ignore-file/: Removing directory marker
    run.go:125: removing dir "rclone-sync-test-ignore-file" failed - try 1/3: removing directory marker failed: googleapi: Error 404: No such object: rclone-test-werugiq8benu/rclone-sync-test-ignore-file/, notFound
2025/03/15 07:40:57 DEBUG : rclone-sync-test-ignore-file/: Removing directory marker
    run.go:125: removing dir "rclone-sync-test-ignore-file" failed - try 2/3: removing directory marker failed: googleapi: Error 404: No such object: rclone-test-werugiq8benu/rclone-sync-test-ignore-file/, notFound
2025/03/15 07:40:58 DEBUG : rclone-sync-test-ignore-file/: Removing directory marker
    run.go:125: removing dir "rclone-sync-test-ignore-file" failed - try 3/3: removing directory marker failed: googleapi: Error 404: No such object: rclone-test-werugiq8benu/rclone-sync-test-ignore-file/, notFound
    run.go:128: removing dir "rclone-sync-test-ignore-file" failed: removing directory marker failed: googleapi: Error 404: No such object: rclone-test-werugiq8benu/rclone-sync-test-ignore-file/, notFound
2025/03/15 07:40:59 DEBUG : rclone-sync-test/: Removing directory marker
    run.go:125: removing dir "rclone-sync-test" failed - try 1/3: removing directory marker failed: googleapi: Error 404: No such object: rclone-test-werugiq8benu/rclone-sync-test/, notFound
2025/03/15 07:41:00 DEBUG : rclone-sync-test/: Removing directory marker
    run.go:125: removing dir "rclone-sync-test" failed - try 2/3: removing directory marker failed: googleapi: Error 404: No such object: rclone-test-werugiq8benu/rclone-sync-test/, notFound
2025/03/15 07:41:01 DEBUG : rclone-sync-test/: Removing directory marker
    run.go:125: removing dir "rclone-sync-test" failed - try 3/3: removing directory marker failed: googleapi: Error 404: No such object: rclone-test-werugiq8benu/rclone-sync-test/, notFound
    run.go:128: removing dir "rclone-sync-test" failed: removing directory marker failed: googleapi: Error 404: No such object: rclone-test-werugiq8benu/rclone-sync-test/, notFound
    fstest.go:292: Sleeping for 1s for list eventual consistency: 1/3
    fstest.go:292: Sleeping for 2s for list eventual consistency: 2/3
    fstest.go:292: Sleeping for 4s for list eventual consistency: 3/3
    fstest.go:321: 
        	Error Trace:	/home/rclone/go/src/github.com/rclone/rclone/fstest/fstest.go:321
        	            				/home/rclone/go/src/github.com/rclone/rclone/fstest/fstest.go:332
        	            				/home/rclone/go/src/github.com/rclone/rclone/fstest/run.go:173
        	            				/home/rclone/go/src/github.com/rclone/rclone/fstest/run.go:388
        	            				/home/rclone/go/pkg/mod/golang.org/toolchain@v0.0.1-go1.23.0.linux-amd64/src/testing/testing.go:1176
        	            				/home/rclone/go/pkg/mod/golang.org/toolchain@v0.0.1-go1.23.0.linux-amd64/src/testing/testing.go:1354
        	            				/home/rclone/go/pkg/mod/golang.org/toolchain@v0.0.1-go1.23.0.linux-amd64/src/testing/testing.go:1684
        	Error:      	Not equal: 
        	            	expected: []string{}
        	            	actual  : []string{"rclone-sync-test", "rclone-sync-test-ignore-file", "rclone-sync-test-include", "rclone-sync-test-include/layer2"}
        	            	
        	            	Diff:
        	            	--- Expected
        	            	+++ Actual
        	            	@@ -1,2 +1,6 @@
        	            	-([]string) {
        	            	+([]string) (len=4) {
        	            	+ (string) (len=16) "rclone-sync-test",
        	            	+ (string) (len=28) "rclone-sync-test-ignore-file",
        	            	+ (string) (len=24) "rclone-sync-test-include",
        	            	+ (string) (len=31) "rclone-sync-test-include/layer2"
        	            	 }
        	Test:       	TestSyncOverlapWithFilter
        	Messages:   	directories
2025/03/15 07:41:09 DEBUG : rclone-sync-test-include/layer2/: Removing directory marker
    run.go:125: removing dir "rclone-sync-test-include/layer2" failed - try 1/3: removing directory marker failed: googleapi: Error 404: No such object: rclone-test-werugiq8benu/rclone-sync-test-include/layer2/, notFound
2025/03/15 07:41:10 DEBUG : rclone-sync-test-include/layer2/: Removing directory marker
    run.go:125: removing dir "rclone-sync-test-include/layer2" failed - try 2/3: removing directory marker failed: googleapi: Error 404: No such object: rclone-test-werugiq8benu/rclone-sync-test-include/layer2/, notFound
2025/03/15 07:41:12 DEBUG : rclone-sync-test-include/layer2/: Removing directory marker
    run.go:125: removing dir "rclone-sync-test-include/layer2" failed - try 3/3: removing directory marker failed: googleapi: Error 404: No such object: rclone-test-werugiq8benu/rclone-sync-test-include/layer2/, notFound
    run.go:128: removing dir "rclone-sync-test-include/layer2" failed: removing directory marker failed: googleapi: Error 404: No such object: rclone-test-werugiq8benu/rclone-sync-test-include/layer2/, notFound
2025/03/15 07:41:13 DEBUG : rclone-sync-test-include/: Removing directory marker
    run.go:125: removing dir "rclone-sync-test-include" failed - try 1/3: removing directory marker failed: googleapi: Error 404: No such object: rclone-test-werugiq8benu/rclone-sync-test-include/, notFound
2025/03/15 07:41:14 DEBUG : rclone-sync-test-include/: Removing directory marker
    run.go:125: removing dir "rclone-sync-test-include" failed - try 2/3: removing directory marker failed: googleapi: Error 404: No such object: rclone-test-werugiq8benu/rclone-sync-test-include/, notFound
2025/03/15 07:41:15 DEBUG : rclone-sync-test-include/: Removing directory marker
    run.go:125: removing dir "rclone-sync-test-include" failed - try 3/3: removing directory marker failed: googleapi: Error 404: No such object: rclone-test-werugiq8benu/rclone-sync-test-include/, notFound
    run.go:128: removing dir "rclone-sync-test-include" failed: removing directory marker failed: googleapi: Error 404: No such object: rclone-test-werugiq8benu/rclone-sync-test-include/, notFound
2025/03/15 07:41:16 DEBUG : rclone-sync-test-ignore-file/: Removing directory marker
    run.go:125: removing dir "rclone-sync-test-ignore-file" failed - try 1/3: removing directory marker failed: googleapi: Error 404: No such object: rclone-test-werugiq8benu/rclone-sync-test-ignore-file/, notFound
2025/03/15 07:41:17 DEBUG : rclone-sync-test-ignore-file/: Removing directory marker
    run.go:125: removing dir "rclone-sync-test-ignore-file" failed - try 2/3: removing directory marker failed: googleapi: Error 404: No such object: rclone-test-werugiq8benu/rclone-sync-test-ignore-file/, notFound
2025/03/15 07:41:18 DEBUG : rclone-sync-test-ignore-file/: Removing directory marker
    run.go:125: removing dir "rclone-sync-test-ignore-file" failed - try 3/3: removing directory marker failed: googleapi: Error 404: No such object: rclone-test-werugiq8benu/rclone-sync-test-ignore-file/, notFound
    run.go:128: removing dir "rclone-sync-test-ignore-file" failed: removing directory marker failed: googleapi: Error 404: No such object: rclone-test-werugiq8benu/rclone-sync-test-ignore-file/, notFound
2025/03/15 07:41:19 DEBUG : rclone-sync-test/: Removing directory marker
    run.go:125: removing dir "rclone-sync-test" failed - try 1/3: removing directory marker failed: googleapi: Error 404: No such object: rclone-test-werugiq8benu/rclone-sync-test/, notFound
2025/03/15 07:41:20 DEBUG : rclone-sync-test/: Removing directory marker
    run.go:125: removing dir "rclone-sync-test" failed - try 2/3: removing directory marker failed: googleapi: Error 404: No such object: rclone-test-werugiq8benu/rclone-sync-test/, notFound
2025/03/15 07:41:21 DEBUG : rclone-sync-test/: Removing directory marker
    run.go:125: removing dir "rclone-sync-test" failed - try 3/3: removing directory marker failed: googleapi: Error 404: No such object: rclone-test-werugiq8benu/rclone-sync-test/, notFound
    run.go:128: removing dir "rclone-sync-test" failed: removing directory marker failed: googleapi: Error 404: No such object: rclone-test-werugiq8benu/rclone-sync-test/, notFound
    fstest.go:292: Sleeping for 1s for list eventual consistency: 1/3
    fstest.go:292: Sleeping for 2s for list eventual consistency: 2/3
    fstest.go:292: Sleeping for 4s for list eventual consistency: 3/3
    fstest.go:321: 
        	Error Trace:	/home/rclone/go/src/github.com/rclone/rclone/fstest/fstest.go:321
        	            				/home/rclone/go/src/github.com/rclone/rclone/fstest/fstest.go:332
        	            				/home/rclone/go/src/github.com/rclone/rclone/fstest/run.go:173
        	            				/home/rclone/go/src/github.com/rclone/rclone/fstest/run.go:388
        	            				/home/rclone/go/pkg/mod/golang.org/toolchain@v0.0.1-go1.23.0.linux-amd64/src/testing/testing.go:1176
        	            				/home/rclone/go/pkg/mod/golang.org/toolchain@v0.0.1-go1.23.0.linux-amd64/src/testing/testing.go:1354
        	            				/home/rclone/go/pkg/mod/golang.org/toolchain@v0.0.1-go1.23.0.linux-amd64/src/testing/testing.go:1684
        	Error:      	Not equal: 
        	            	expected: []string{}
        	            	actual  : []string{"rclone-sync-test", "rclone-sync-test-ignore-file", "rclone-sync-test-include", "rclone-sync-test-include/layer2"}
        	            	
        	            	Diff:
        	            	--- Expected
        	            	+++ Actual
        	            	@@ -1,2 +1,6 @@
        	            	-([]string) {
        	            	+([]string) (len=4) {
        	            	+ (string) (len=16) "rclone-sync-test",
        	            	+ (string) (len=28) "rclone-sync-test-ignore-file",
        	            	+ (string) (len=24) "rclone-sync-test-include",
        	            	+ (string) (len=31) "rclone-sync-test-include/layer2"
        	            	 }
        	Test:       	TestSyncOverlapWithFilter
        	Messages:   	directories
2025/03/15 07:41:29 DEBUG : rclone-sync-test-include/layer2/: Removing directory marker
    run.go:125: removing dir "rclone-sync-test-include/layer2" failed - try 1/3: removing directory marker failed: googleapi: Error 404: No such object: rclone-test-werugiq8benu/rclone-sync-test-include/layer2/, notFound
2025/03/15 07:41:30 DEBUG : rclone-sync-test-include/layer2/: Removing directory marker
    run.go:125: removing dir "rclone-sync-test-include/layer2" failed - try 2/3: removing directory marker failed: googleapi: Error 404: No such object: rclone-test-werugiq8benu/rclone-sync-test-include/layer2/, notFound
2025/03/15 07:41:31 DEBUG : rclone-sync-test-include/layer2/: Removing directory marker
    run.go:125: removing dir "rclone-sync-test-include/layer2" failed - try 3/3: removing directory marker failed: googleapi: Error 404: No such object: rclone-test-werugiq8benu/rclone-sync-test-include/layer2/, notFound
    run.go:128: removing dir "rclone-sync-test-include/layer2" failed: removing directory marker failed: googleapi: Error 404: No such object: rclone-test-werugiq8benu/rclone-sync-test-include/layer2/, notFound
2025/03/15 07:41:32 DEBUG : rclone-sync-test-include/: Removing directory marker
    run.go:125: removing dir "rclone-sync-test-include" failed - try 1/3: removing directory marker failed: googleapi: Error 404: No such object: rclone-test-werugiq8benu/rclone-sync-test-include/, notFound
2025/03/15 07:41:33 DEBUG : rclone-sync-test-include/: Removing directory marker
    run.go:125: removing dir "rclone-sync-test-include" failed - try 2/3: removing directory marker failed: googleapi: Error 404: No such object: rclone-test-werugiq8benu/rclone-sync-test-include/, notFound
2025/03/15 07:41:35 DEBUG : rclone-sync-test-include/: Removing directory marker
    run.go:125: removing dir "rclone-sync-test-include" failed - try 3/3: removing directory marker failed: googleapi: Error 404: No such object: rclone-test-werugiq8benu/rclone-sync-test-include/, notFound
    run.go:128: removing dir "rclone-sync-test-include" failed: removing directory marker failed: googleapi: Error 404: No such object: rclone-test-werugiq8benu/rclone-sync-test-include/, notFound
2025/03/15 07:41:36 DEBUG : rclone-sync-test-ignore-file/: Removing directory marker
    run.go:125: removing dir "rclone-sync-test-ignore-file" failed - try 1/3: removing directory marker failed: googleapi: Error 404: No such object: rclone-test-werugiq8benu/rclone-sync-test-ignore-file/, notFound
2025/03/15 07:41:37 DEBUG : rclone-sync-test-ignore-file/: Removing directory marker
    run.go:125: removing dir "rclone-sync-test-ignore-file" failed - try 2/3: removing directory marker failed: googleapi: Error 404: No such object: rclone-test-werugiq8benu/rclone-sync-test-ignore-file/, notFound
2025/03/15 07:41:38 DEBUG : rclone-sync-test-ignore-file/: Removing directory marker
    run.go:125: removing dir "rclone-sync-test-ignore-file" failed - try 3/3: removing directory marker failed: googleapi: Error 404: No such object: rclone-test-werugiq8benu/rclone-sync-test-ignore-file/, notFound
    run.go:128: removing dir "rclone-sync-test-ignore-file" failed: removing directory marker failed: googleapi: Error 404: No such object: rclone-test-werugiq8benu/rclone-sync-test-ignore-file/, notFound
2025/03/15 07:41:39 DEBUG : rclone-sync-test/: Removing directory marker
    run.go:125: removing dir "rclone-sync-test" failed - try 1/3: removing directory marker failed: googleapi: Error 404: No such object: rclone-test-werugiq8benu/rclone-sync-test/, notFound
2025/03/15 07:41:40 DEBUG : rclone-sync-test/: Removing directory marker
    run.go:125: removing dir "rclone-sync-test" failed - try 2/3: removing directory marker failed: googleapi: Error 404: No such object: rclone-test-werugiq8benu/rclone-sync-test/, notFound
2025/03/15 07:41:41 DEBUG : rclone-sync-test/: Removing directory marker
    run.go:125: removing dir "rclone-sync-test" failed - try 3/3: removing directory marker failed: googleapi: Error 404: No such object: rclone-test-werugiq8benu/rclone-sync-test/, notFound
    run.go:128: removing dir "rclone-sync-test" failed: removing directory marker failed: googleapi: Error 404: No such object: rclone-test-werugiq8benu/rclone-sync-test/, notFound
    fstest.go:292: Sleeping for 1s for list eventual consistency: 1/3
    fstest.go:292: Sleeping for 2s for list eventual consistency: 2/3
    fstest.go:292: Sleeping for 4s for list eventual consistency: 3/3
    fstest.go:321: 
        	Error Trace:	/home/rclone/go/src/github.com/rclone/rclone/fstest/fstest.go:321
        	            				/home/rclone/go/src/github.com/rclone/rclone/fstest/fstest.go:332
        	            				/home/rclone/go/src/github.com/rclone/rclone/fstest/run.go:173
        	            				/home/rclone/go/src/github.com/rclone/rclone/fstest/run.go:388
        	            				/home/rclone/go/pkg/mod/golang.org/toolchain@v0.0.1-go1.23.0.linux-amd64/src/testing/testing.go:1176
        	            				/home/rclone/go/pkg/mod/golang.org/toolchain@v0.0.1-go1.23.0.linux-amd64/src/testing/testing.go:1354
        	            				/home/rclone/go/pkg/mod/golang.org/toolchain@v0.0.1-go1.23.0.linux-amd64/src/testing/testing.go:1684
        	Error:      	Not equal: 
        	            	expected: []string{}
        	            	actual  : []string{"rclone-sync-test", "rclone-sync-test-ignore-file", "rclone-sync-test-include", "rclone-sync-test-include/layer2"}
        	            	
        	            	Diff:
        	            	--- Expected
        	            	+++ Actual
        	            	@@ -1,2 +1,6 @@
        	            	-([]string) {
        	            	+([]string) (len=4) {
        	            	+ (string) (len=16) "rclone-sync-test",
        	            	+ (string) (len=28) "rclone-sync-test-ignore-file",
        	            	+ (string) (len=24) "rclone-sync-test-include",
        	            	+ (string) (len=31) "rclone-sync-test-include/layer2"
        	            	 }
        	Test:       	TestSyncOverlapWithFilter
        	Messages:   	directories
2025/03/15 07:41:49 DEBUG : rclone-sync-test-include/layer2/: Removing directory marker
    run.go:125: removing dir "rclone-sync-test-include/layer2" failed - try 1/3: removing directory marker failed: googleapi: Error 404: No such object: rclone-test-werugiq8benu/rclone-sync-test-include/layer2/, notFound
2025/03/15 07:41:50 DEBUG : rclone-sync-test-include/layer2/: Removing directory marker
    run.go:125: removing dir "rclone-sync-test-include/layer2" failed - try 2/3: removing directory marker failed: googleapi: Error 404: No such object: rclone-test-werugiq8benu/rclone-sync-test-include/layer2/, notFound
2025/03/15 07:41:51 DEBUG : rclone-sync-test-include/layer2/: Removing directory marker
    run.go:125: removing dir "rclone-sync-test-include/layer2" failed - try 3/3: removing directory marker failed: googleapi: Error 404: No such object: rclone-test-werugiq8benu/rclone-sync-test-include/layer2/, notFound
    run.go:128: removing dir "rclone-sync-test-include/layer2" failed: removing directory marker failed: googleapi: Error 404: No such object: rclone-test-werugiq8benu/rclone-sync-test-include/layer2/, notFound
2025/03/15 07:41:52 DEBUG : rclone-sync-test-include/: Removing directory marker
    run.go:125: removing dir "rclone-sync-test-include" failed - try 1/3: removing directory marker failed: googleapi: Error 404: No such object: rclone-test-werugiq8benu/rclone-sync-test-include/, notFound
2025/03/15 07:41:53 DEBUG : rclone-sync-test-include/: Removing directory marker
    run.go:125: removing dir "rclone-sync-test-include" failed - try 2/3: removing directory marker failed: googleapi: Error 404: No such object: rclone-test-werugiq8benu/rclone-sync-test-include/, notFound
2025/03/15 07:41:54 DEBUG : rclone-sync-test-include/: Removing directory marker
    run.go:125: removing dir "rclone-sync-test-include" failed - try 3/3: removing directory marker failed: googleapi: Error 404: No such object: rclone-test-werugiq8benu/rclone-sync-test-include/, notFound
    run.go:128: removing dir "rclone-sync-test-include" failed: removing directory marker failed: googleapi: Error 404: No such object: rclone-test-werugiq8benu/rclone-sync-test-include/, notFound
2025/03/15 07:41:55 DEBUG : rclone-sync-test-ignore-file/: Removing directory marker
    run.go:125: removing dir "rclone-sync-test-ignore-file" failed - try 1/3: removing directory marker failed: googleapi: Error 404: No such object: rclone-test-werugiq8benu/rclone-sync-test-ignore-file/, notFound
2025/03/15 07:41:57 DEBUG : rclone-sync-test-ignore-file/: Removing directory marker
    run.go:125: removing dir "rclone-sync-test-ignore-file" failed - try 2/3: removing directory marker failed: googleapi: Error 404: No such object: rclone-test-werugiq8benu/rclone-sync-test-ignore-file/, notFound
2025/03/15 07:41:58 DEBUG : rclone-sync-test-ignore-file/: Removing directory marker
    run.go:125: removing dir "rclone-sync-test-ignore-file" failed - try 3/3: removing directory marker failed: googleapi: Error 404: No such object: rclone-test-werugiq8benu/rclone-sync-test-ignore-file/, notFound
    run.go:128: removing dir "rclone-sync-test-ignore-file" failed: removing directory marker failed: googleapi: Error 404: No such object: rclone-test-werugiq8benu/rclone-sync-test-ignore-file/, notFound
2025/03/15 07:41:59 DEBUG : rclone-sync-test/: Removing directory marker
    run.go:125: removing dir "rclone-sync-test" failed - try 1/3: removing directory marker failed: googleapi: Error 404: No such object: rclone-test-werugiq8benu/rclone-sync-test/, notFound
2025/03/15 07:42:00 DEBUG : rclone-sync-test/: Removing directory marker
    run.go:125: removing dir "rclone-sync-test" failed - try 2/3: removing directory marker failed: googleapi: Error 404: No such object: rclone-test-werugiq8benu/rclone-sync-test/, notFound
2025/03/15 07:42:01 DEBUG : rclone-sync-test/: Removing directory marker
    run.go:125: removing dir "rclone-sync-test" failed - try 3/3: removing directory marker failed: googleapi: Error 404: No such object: rclone-test-werugiq8benu/rclone-sync-test/, notFound
    run.go:128: removing dir "rclone-sync-test" failed: removing directory marker failed: googleapi: Error 404: No such object: rclone-test-werugiq8benu/rclone-sync-test/, notFound
    fstest.go:292: Sleeping for 1s for list eventual consistency: 1/3
    fstest.go:292: Sleeping for 2s for list eventual consistency: 2/3
    fstest.go:292: Sleeping for 4s for list eventual consistency: 3/3
    fstest.go:321: 
        	Error Trace:	/home/rclone/go/src/github.com/rclone/rclone/fstest/fstest.go:321
        	            				/home/rclone/go/src/github.com/rclone/rclone/fstest/fstest.go:332
        	            				/home/rclone/go/src/github.com/rclone/rclone/fstest/run.go:173
        	            				/home/rclone/go/src/github.com/rclone/rclone/fstest/run.go:388
        	            				/home/rclone/go/pkg/mod/golang.org/toolchain@v0.0.1-go1.23.0.linux-amd64/src/testing/testing.go:1176
        	            				/home/rclone/go/pkg/mod/golang.org/toolchain@v0.0.1-go1.23.0.linux-amd64/src/testing/testing.go:1354
        	            				/home/rclone/go/pkg/mod/golang.org/toolchain@v0.0.1-go1.23.0.linux-amd64/src/testing/testing.go:1684
        	Error:      	Not equal: 
        	            	expected: []string{}
        	            	actual  : []string{"rclone-sync-test", "rclone-sync-test-ignore-file", "rclone-sync-test-include", "rclone-sync-test-include/layer2"}
        	            	
        	            	Diff:
        	            	--- Expected
        	            	+++ Actual
        	            	@@ -1,2 +1,6 @@
        	            	-([]string) {
        	            	+([]string) (len=4) {
        	            	+ (string) (len=16) "rclone-sync-test",
        	            	+ (string) (len=28) "rclone-sync-test-ignore-file",
        	            	+ (string) (len=24) "rclone-sync-test-include",
        	            	+ (string) (len=31) "rclone-sync-test-include/layer2"
        	            	 }
        	Test:       	TestSyncOverlapWithFilter
        	Messages:   	directories
2025/03/15 07:42:09 DEBUG : rclone-sync-test-include/layer2/: Removing directory marker
    run.go:125: removing dir "rclone-sync-test-include/layer2" failed - try 1/3: removing directory marker failed: googleapi: Error 404: No such object: rclone-test-werugiq8benu/rclone-sync-test-include/layer2/, notFound
2025/03/15 07:42:10 DEBUG : rclone-sync-test-include/layer2/: Removing directory marker
    run.go:125: removing dir "rclone-sync-test-include/layer2" failed - try 2/3: removing directory marker failed: googleapi: Error 404: No such object: rclone-test-werugiq8benu/rclone-sync-test-include/layer2/, notFound
2025/03/15 07:42:11 DEBUG : rclone-sync-test-include/layer2/: Removing directory marker
    run.go:125: removing dir "rclone-sync-test-include/layer2" failed - try 3/3: removing directory marker failed: googleapi: Error 404: No such object: rclone-test-werugiq8benu/rclone-sync-test-include/layer2/, notFound
    run.go:128: removing dir "rclone-sync-test-include/layer2" failed: removing directory marker failed: googleapi: Error 404: No such object: rclone-test-werugiq8benu/rclone-sync-test-include/layer2/, notFound
2025/03/15 07:42:12 DEBUG : rclone-sync-test-include/: Removing directory marker
    run.go:125: removing dir "rclone-sync-test-include" failed - try 1/3: removing directory marker failed: googleapi: Error 404: No such object: rclone-test-werugiq8benu/rclone-sync-test-include/, notFound
2025/03/15 07:42:13 DEBUG : rclone-sync-test-include/: Removing directory marker
    run.go:125: removing dir "rclone-sync-test-include" failed - try 2/3: removing directory marker failed: googleapi: Error 404: No such object: rclone-test-werugiq8benu/rclone-sync-test-include/, notFound
2025/03/15 07:42:14 DEBUG : rclone-sync-test-include/: Removing directory marker
    run.go:125: removing dir "rclone-sync-test-include" failed - try 3/3: removing directory marker failed: googleapi: Error 404: No such object: rclone-test-werugiq8benu/rclone-sync-test-include/, notFound
    run.go:128: removing dir "rclone-sync-test-include" failed: removing directory marker failed: googleapi: Error 404: No such object: rclone-test-werugiq8benu/rclone-sync-test-include/, notFound
2025/03/15 07:42:15 DEBUG : rclone-sync-test-ignore-file/: Removing directory marker
    run.go:125: removing dir "rclone-sync-test-ignore-file" failed - try 1/3: removing directory marker failed: googleapi: Error 404: No such object: rclone-test-werugiq8benu/rclone-sync-test-ignore-file/, notFound
2025/03/15 07:42:16 DEBUG : rclone-sync-test-ignore-file/: Removing directory marker
    run.go:125: removing dir "rclone-sync-test-ignore-file" failed - try 2/3: removing directory marker failed: googleapi: Error 404: No such object: rclone-test-werugiq8benu/rclone-sync-test-ignore-file/, notFound
2025/03/15 07:42:17 DEBUG : rclone-sync-test-ignore-file/: Removing directory marker
    run.go:125: removing dir "rclone-sync-test-ignore-file" failed - try 3/3: removing directory marker failed: googleapi: Error 404: No such object: rclone-test-werugiq8benu/rclone-sync-test-ignore-file/, notFound
    run.go:128: removing dir "rclone-sync-test-ignore-file" failed: removing directory marker failed: googleapi: Error 404: No such object: rclone-test-werugiq8benu/rclone-sync-test-ignore-file/, notFound
2025/03/15 07:42:19 DEBUG : rclone-sync-test/: Removing directory marker
    run.go:125: removing dir "rclone-sync-test" failed - try 1/3: removing directory marker failed: googleapi: Error 404: No such object: rclone-test-werugiq8benu/rclone-sync-test/, notFound
2025/03/15 07:42:20 DEBUG : rclone-sync-test/: Removing directory marker
    run.go:125: removing dir "rclone-sync-test" failed - try 2/3: removing directory marker failed: googleapi: Error 404: No such object: rclone-test-werugiq8benu/rclone-sync-test/, notFound
2025/03/15 07:42:21 DEBUG : rclone-sync-test/: Removing directory marker
    run.go:125: removing dir "rclone-sync-test" failed - try 3/3: removing directory marker failed: googleapi: Error 404: No such object: rclone-test-werugiq8benu/rclone-sync-test/, notFound
    run.go:128: removing dir "rclone-sync-test" failed: removing directory marker failed: googleapi: Error 404: No such object: rclone-test-werugiq8benu/rclone-sync-test/, notFound
    fstest.go:292: Sleeping for 1s for list eventual consistency: 1/3
    fstest.go:292: Sleeping for 2s for list eventual consistency: 2/3
    fstest.go:292: Sleeping for 4s for list eventual consistency: 3/3
    fstest.go:321: 
        	Error Trace:	/home/rclone/go/src/github.com/rclone/rclone/fstest/fstest.go:321
        	            				/home/rclone/go/src/github.com/rclone/rclone/fstest/fstest.go:332
        	            				/home/rclone/go/src/github.com/rclone/rclone/fstest/run.go:173
        	            				/home/rclone/go/src/github.com/rclone/rclone/fstest/run.go:388
        	            				/home/rclone/go/pkg/mod/golang.org/toolchain@v0.0.1-go1.23.0.linux-amd64/src/testing/testing.go:1176
        	            				/home/rclone/go/pkg/mod/golang.org/toolchain@v0.0.1-go1.23.0.linux-amd64/src/testing/testing.go:1354
        	            				/home/rclone/go/pkg/mod/golang.org/toolchain@v0.0.1-go1.23.0.linux-amd64/src/testing/testing.go:1684
        	Error:      	Not equal: 
        	            	expected: []string{}
        	            	actual  : []string{"rclone-sync-test", "rclone-sync-test-ignore-file", "rclone-sync-test-include", "rclone-sync-test-include/layer2"}
        	            	
        	            	Diff:
        	            	--- Expected
        	            	+++ Actual
        	            	@@ -1,2 +1,6 @@
        	            	-([]string) {
        	            	+([]string) (len=4) {
        	            	+ (string) (len=16) "rclone-sync-test",
        	            	+ (string) (len=28) "rclone-sync-test-ignore-file",
        	            	+ (string) (len=24) "rclone-sync-test-include",
        	            	+ (string) (len=31) "rclone-sync-test-include/layer2"
        	            	 }
        	Test:       	TestSyncOverlapWithFilter
        	Messages:   	directories
2025/03/15 07:42:29 DEBUG : rclone-sync-test-include/layer2/: Removing directory marker
    run.go:125: removing dir "rclone-sync-test-include/layer2" failed - try 1/3: removing directory marker failed: googleapi: Error 404: No such object: rclone-test-werugiq8benu/rclone-sync-test-include/layer2/, notFound
2025/03/15 07:42:30 DEBUG : rclone-sync-test-include/layer2/: Removing directory marker
    run.go:125: removing dir "rclone-sync-test-include/layer2" failed - try 2/3: removing directory marker failed: googleapi: Error 404: No such object: rclone-test-werugiq8benu/rclone-sync-test-include/layer2/, notFound
2025/03/15 07:42:31 DEBUG : rclone-sync-test-include/layer2/: Removing directory marker
    run.go:125: removing dir "rclone-sync-test-include/layer2" failed - try 3/3: removing directory marker failed: googleapi: Error 404: No such object: rclone-test-werugiq8benu/rclone-sync-test-include/layer2/, notFound
    run.go:128: removing dir "rclone-sync-test-include/layer2" failed: removing directory marker failed: googleapi: Error 404: No such object: rclone-test-werugiq8benu/rclone-sync-test-include/layer2/, notFound
2025/03/15 07:42:32 DEBUG : rclone-sync-test-include/: Removing directory marker
    run.go:125: removing dir "rclone-sync-test-include" failed - try 1/3: removing directory marker failed: googleapi: Error 404: No such object: rclone-test-werugiq8benu/rclone-sync-test-include/, notFound
2025/03/15 07:42:33 DEBUG : rclone-sync-test-include/: Removing directory marker
    run.go:125: removing dir "rclone-sync-test-include" failed - try 2/3: removing directory marker failed: googleapi: Error 404: No such object: rclone-test-werugiq8benu/rclone-sync-test-include/, notFound
2025/03/15 07:42:34 DEBUG : rclone-sync-test-include/: Removing directory marker
    run.go:125: removing dir "rclone-sync-test-include" failed - try 3/3: removing directory marker failed: googleapi: Error 404: No such object: rclone-test-werugiq8benu/rclone-sync-test-include/, notFound
    run.go:128: removing dir "rclone-sync-test-include" failed: removing directory marker failed: googleapi: Error 404: No such object: rclone-test-werugiq8benu/rclone-sync-test-include/, notFound
2025/03/15 07:42:35 DEBUG : rclone-sync-test-ignore-file/: Removing directory marker
    run.go:125: removing dir "rclone-sync-test-ignore-file" failed - try 1/3: removing directory marker failed: googleapi: Error 404: No such object: rclone-test-werugiq8benu/rclone-sync-test-ignore-file/, notFound
2025/03/15 07:42:36 DEBUG : rclone-sync-test-ignore-file/: Removing directory marker
    run.go:125: removing dir "rclone-sync-test-ignore-file" failed - try 2/3: removing directory marker failed: googleapi: Error 404: No such object: rclone-test-werugiq8benu/rclone-sync-test-ignore-file/, notFound
2025/03/15 07:42:37 DEBUG : rclone-sync-test-ignore-file/: Removing directory marker
    run.go:125: removing dir "rclone-sync-test-ignore-file" failed - try 3/3: removing directory marker failed: googleapi: Error 404: No such object: rclone-test-werugiq8benu/rclone-sync-test-ignore-file/, notFound
    run.go:128: removing dir "rclone-sync-test-ignore-file" failed: removing directory marker failed: googleapi: Error 404: No such object: rclone-test-werugiq8benu/rclone-sync-test-ignore-file/, notFound
2025/03/15 07:42:38 DEBUG : rclone-sync-test/: Removing directory marker
    run.go:125: removing dir "rclone-sync-test" failed - try 1/3: removing directory marker failed: googleapi: Error 404: No such object: rclone-test-werugiq8benu/rclone-sync-test/, notFound
2025/03/15 07:42:39 DEBUG : rclone-sync-test/: Removing directory marker
    run.go:125: removing dir "rclone-sync-test" failed - try 2/3: removing directory marker failed: googleapi: Error 404: No such object: rclone-test-werugiq8benu/rclone-sync-test/, notFound
2025/03/15 07:42:40 DEBUG : rclone-sync-test/: Removing directory marker
    run.go:125: removing dir "rclone-sync-test" failed - try 3/3: removing directory marker failed: googleapi: Error 404: No such object: rclone-test-werugiq8benu/rclone-sync-test/, notFound
    run.go:128: removing dir "rclone-sync-test" failed: removing directory marker failed: googleapi: Error 404: No such object: rclone-test-werugiq8benu/rclone-sync-test/, notFound
    fstest.go:292: Sleeping for 1s for list eventual consistency: 1/3
    fstest.go:292: Sleeping for 2s for list eventual consistency: 2/3
    fstest.go:292: Sleeping for 4s for list eventual consistency: 3/3
    fstest.go:321: 
        	Error Trace:	/home/rclone/go/src/github.com/rclone/rclone/fstest/fstest.go:321
        	            				/home/rclone/go/src/github.com/rclone/rclone/fstest/fstest.go:332
        	            				/home/rclone/go/src/github.com/rclone/rclone/fstest/run.go:173
        	            				/home/rclone/go/src/github.com/rclone/rclone/fstest/run.go:388
        	            				/home/rclone/go/pkg/mod/golang.org/toolchain@v0.0.1-go1.23.0.linux-amd64/src/testing/testing.go:1176
        	            				/home/rclone/go/pkg/mod/golang.org/toolchain@v0.0.1-go1.23.0.linux-amd64/src/testing/testing.go:1354
        	            				/home/rclone/go/pkg/mod/golang.org/toolchain@v0.0.1-go1.23.0.linux-amd64/src/testing/testing.go:1684
        	Error:      	Not equal: 
        	            	expected: []string{}
        	            	actual  : []string{"rclone-sync-test", "rclone-sync-test-ignore-file", "rclone-sync-test-include", "rclone-sync-test-include/layer2"}
        	            	
        	            	Diff:
        	            	--- Expected
        	            	+++ Actual
        	            	@@ -1,2 +1,6 @@
        	            	-([]string) {
        	            	+([]string) (len=4) {
        	            	+ (string) (len=16) "rclone-sync-test",
        	            	+ (string) (len=28) "rclone-sync-test-ignore-file",
        	            	+ (string) (len=24) "rclone-sync-test-include",
        	            	+ (string) (len=31) "rclone-sync-test-include/layer2"
        	            	 }
        	Test:       	TestSyncOverlapWithFilter
        	Messages:   	directories
2025/03/15 07:42:49 DEBUG : rclone-sync-test-include/layer2/: Removing directory marker
    run.go:125: removing dir "rclone-sync-test-include/layer2" failed - try 1/3: removing directory marker failed: googleapi: Error 404: No such object: rclone-test-werugiq8benu/rclone-sync-test-include/layer2/, notFound
2025/03/15 07:42:50 DEBUG : rclone-sync-test-include/layer2/: Removing directory marker
    run.go:125: removing dir "rclone-sync-test-include/layer2" failed - try 2/3: removing directory marker failed: googleapi: Error 404: No such object: rclone-test-werugiq8benu/rclone-sync-test-include/layer2/, notFound
2025/03/15 07:42:51 DEBUG : rclone-sync-test-include/layer2/: Removing directory marker
    run.go:125: removing dir "rclone-sync-test-include/layer2" failed - try 3/3: removing directory marker failed: googleapi: Error 404: No such object: rclone-test-werugiq8benu/rclone-sync-test-include/layer2/, notFound
    run.go:128: removing dir "rclone-sync-test-include/layer2" failed: removing directory marker failed: googleapi: Error 404: No such object: rclone-test-werugiq8benu/rclone-sync-test-include/layer2/, notFound
2025/03/15 07:42:52 DEBUG : rclone-sync-test-include/: Removing directory marker
    run.go:125: removing dir "rclone-sync-test-include" failed - try 1/3: removing directory marker failed: googleapi: Error 404: No such object: rclone-test-werugiq8benu/rclone-sync-test-include/, notFound
2025/03/15 07:42:53 DEBUG : rclone-sync-test-include/: Removing directory marker
    run.go:125: removing dir "rclone-sync-test-include" failed - try 2/3: removing directory marker failed: googleapi: Error 404: No such object: rclone-test-werugiq8benu/rclone-sync-test-include/, notFound
2025/03/15 07:42:54 DEBUG : rclone-sync-test-include/: Removing directory marker
    run.go:125: removing dir "rclone-sync-test-include" failed - try 3/3: removing directory marker failed: googleapi: Error 404: No such object: rclone-test-werugiq8benu/rclone-sync-test-include/, notFound
    run.go:128: removing dir "rclone-sync-test-include" failed: removing directory marker failed: googleapi: Error 404: No such object: rclone-test-werugiq8benu/rclone-sync-test-include/, notFound
2025/03/15 07:42:55 DEBUG : rclone-sync-test-ignore-file/: Removing directory marker
    run.go:125: removing dir "rclone-sync-test-ignore-file" failed - try 1/3: removing directory marker failed: googleapi: Error 404: No such object: rclone-test-werugiq8benu/rclone-sync-test-ignore-file/, notFound
2025/03/15 07:42:56 DEBUG : rclone-sync-test-ignore-file/: Removing directory marker
    run.go:125: removing dir "rclone-sync-test-ignore-file" failed - try 2/3: removing directory marker failed: googleapi: Error 404: No such object: rclone-test-werugiq8benu/rclone-sync-test-ignore-file/, notFound
2025/03/15 07:42:57 DEBUG : rclone-sync-test-ignore-file/: Removing directory marker
    run.go:125: removing dir "rclone-sync-test-ignore-file" failed - try 3/3: removing directory marker failed: googleapi: Error 404: No such object: rclone-test-werugiq8benu/rclone-sync-test-ignore-file/, notFound
    run.go:128: removing dir "rclone-sync-test-ignore-file" failed: removing directory marker failed: googleapi: Error 404: No such object: rclone-test-werugiq8benu/rclone-sync-test-ignore-file/, notFound
2025/03/15 07:42:58 DEBUG : rclone-sync-test/: Removing directory marker
    run.go:125: removing dir "rclone-sync-test" failed - try 1/3: removing directory marker failed: googleapi: Error 404: No such object: rclone-test-werugiq8benu/rclone-sync-test/, notFound
2025/03/15 07:42:59 DEBUG : rclone-sync-test/: Removing directory marker
    run.go:125: removing dir "rclone-sync-test" failed - try 2/3: removing directory marker failed: googleapi: Error 404: No such object: rclone-test-werugiq8benu/rclone-sync-test/, notFound
2025/03/15 07:43:00 DEBUG : rclone-sync-test/: Removing directory marker
    run.go:125: removing dir "rclone-sync-test" failed - try 3/3: removing directory marker failed: googleapi: Error 404: No such object: rclone-test-werugiq8benu/rclone-sync-test/, notFound
    run.go:128: removing dir "rclone-sync-test" failed: removing directory marker failed: googleapi: Error 404: No such object: rclone-test-werugiq8benu/rclone-sync-test/, notFound
    fstest.go:292: Sleeping for 1s for list eventual consistency: 1/3
    fstest.go:292: Sleeping for 2s for list eventual consistency: 2/3
    fstest.go:292: Sleeping for 4s for list eventual consistency: 3/3
    fstest.go:321: 
        	Error Trace:	/home/rclone/go/src/github.com/rclone/rclone/fstest/fstest.go:321
        	            				/home/rclone/go/src/github.com/rclone/rclone/fstest/fstest.go:332
        	            				/home/rclone/go/src/github.com/rclone/rclone/fstest/run.go:173
        	            				/home/rclone/go/src/github.com/rclone/rclone/fstest/run.go:388
        	            				/home/rclone/go/pkg/mod/golang.org/toolchain@v0.0.1-go1.23.0.linux-amd64/src/testing/testing.go:1176
        	            				/home/rclone/go/pkg/mod/golang.org/toolchain@v0.0.1-go1.23.0.linux-amd64/src/testing/testing.go:1354
        	            				/home/rclone/go/pkg/mod/golang.org/toolchain@v0.0.1-go1.23.0.linux-amd64/src/testing/testing.go:1684
        	Error:      	Not equal: 
        	            	expected: []string{}
        	            	actual  : []string{"rclone-sync-test", "rclone-sync-test-ignore-file", "rclone-sync-test-include", "rclone-sync-test-include/layer2"}
        	            	
        	            	Diff:
        	            	--- Expected
        	            	+++ Actual
        	            	@@ -1,2 +1,6 @@
        	            	-([]string) {
        	            	+([]string) (len=4) {
        	            	+ (string) (len=16) "rclone-sync-test",
        	            	+ (string) (len=28) "rclone-sync-test-ignore-file",
        	            	+ (string) (len=24) "rclone-sync-test-include",
        	            	+ (string) (len=31) "rclone-sync-test-include/layer2"
        	            	 }
        	Test:       	TestSyncOverlapWithFilter
        	Messages:   	directories
2025/03/15 07:43:09 DEBUG : rclone-sync-test-include/layer2/: Removing directory marker
    run.go:125: removing dir "rclone-sync-test-include/layer2" failed - try 1/3: removing directory marker failed: googleapi: Error 404: No such object: rclone-test-werugiq8benu/rclone-sync-test-include/layer2/, notFound
2025/03/15 07:43:10 DEBUG : rclone-sync-test-include/layer2/: Removing directory marker
    run.go:125: removing dir "rclone-sync-test-include/layer2" failed - try 2/3: removing directory marker failed: googleapi: Error 404: No such object: rclone-test-werugiq8benu/rclone-sync-test-include/layer2/, notFound
2025/03/15 07:43:11 DEBUG : rclone-sync-test-include/layer2/: Removing directory marker
    run.go:125: removing dir "rclone-sync-test-include/layer2" failed - try 3/3: removing directory marker failed: googleapi: Error 404: No such object: rclone-test-werugiq8benu/rclone-sync-test-include/layer2/, notFound
    run.go:128: removing dir "rclone-sync-test-include/layer2" failed: removing directory marker failed: googleapi: Error 404: No such object: rclone-test-werugiq8benu/rclone-sync-test-include/layer2/, notFound
2025/03/15 07:43:12 DEBUG : rclone-sync-test-include/: Removing directory marker
    run.go:125: removing dir "rclone-sync-test-include" failed - try 1/3: removing directory marker failed: googleapi: Error 404: No such object: rclone-test-werugiq8benu/rclone-sync-test-include/, notFound
2025/03/15 07:43:13 DEBUG : rclone-sync-test-include/: Removing directory marker
    run.go:125: removing dir "rclone-sync-test-include" failed - try 2/3: removing directory marker failed: googleapi: Error 404: No such object: rclone-test-werugiq8benu/rclone-sync-test-include/, notFound
2025/03/15 07:43:14 DEBUG : rclone-sync-test-include/: Removing directory marker
    run.go:125: removing dir "rclone-sync-test-include" failed - try 3/3: removing directory marker failed: googleapi: Error 404: No such object: rclone-test-werugiq8benu/rclone-sync-test-include/, notFound
    run.go:128: removing dir "rclone-sync-test-include" failed: removing directory marker failed: googleapi: Error 404: No such object: rclone-test-werugiq8benu/rclone-sync-test-include/, notFound
2025/03/15 07:43:15 DEBUG : rclone-sync-test-ignore-file/: Removing directory marker
    run.go:125: removing dir "rclone-sync-test-ignore-file" failed - try 1/3: removing directory marker failed: googleapi: Error 404: No such object: rclone-test-werugiq8benu/rclone-sync-test-ignore-file/, notFound
2025/03/15 07:43:16 DEBUG : rclone-sync-test-ignore-file/: Removing directory marker
    run.go:125: removing dir "rclone-sync-test-ignore-file" failed - try 2/3: removing directory marker failed: googleapi: Error 404: No such object: rclone-test-werugiq8benu/rclone-sync-test-ignore-file/, notFound
2025/03/15 07:43:17 DEBUG : rclone-sync-test-ignore-file/: Removing directory marker
    run.go:125: removing dir "rclone-sync-test-ignore-file" failed - try 3/3: removing directory marker failed: googleapi: Error 404: No such object: rclone-test-werugiq8benu/rclone-sync-test-ignore-file/, notFound
    run.go:128: removing dir "rclone-sync-test-ignore-file" failed: removing directory marker failed: googleapi: Error 404: No such object: rclone-test-werugiq8benu/rclone-sync-test-ignore-file/, notFound
2025/03/15 07:43:18 DEBUG : rclone-sync-test/: Removing directory marker
    run.go:125: removing dir "rclone-sync-test" failed - try 1/3: removing directory marker failed: googleapi: Error 404: No such object: rclone-test-werugiq8benu/rclone-sync-test/, notFound
2025/03/15 07:43:19 DEBUG : rclone-sync-test/: Removing directory marker
    run.go:125: removing dir "rclone-sync-test" failed - try 2/3: removing directory marker failed: googleapi: Error 404: No such object: rclone-test-werugiq8benu/rclone-sync-test/, notFound
2025/03/15 07:43:20 DEBUG : rclone-sync-test/: Removing directory marker
    run.go:125: removing dir "rclone-sync-test" failed - try 3/3: removing directory marker failed: googleapi: Error 404: No such object: rclone-test-werugiq8benu/rclone-sync-test/, notFound
    run.go:128: removing dir "rclone-sync-test" failed: removing directory marker failed: googleapi: Error 404: No such object: rclone-test-werugiq8benu/rclone-sync-test/, notFound
    fstest.go:292: Sleeping for 1s for list eventual consistency: 1/3
    fstest.go:292: Sleeping for 2s for list eventual consistency: 2/3
    fstest.go:292: Sleeping for 4s for list eventual consistency: 3/3
    fstest.go:321: 
        	Error Trace:	/home/rclone/go/src/github.com/rclone/rclone/fstest/fstest.go:321
        	            				/home/rclone/go/src/github.com/rclone/rclone/fstest/fstest.go:332
        	            				/home/rclone/go/src/github.com/rclone/rclone/fstest/run.go:173
        	            				/home/rclone/go/src/github.com/rclone/rclone/fstest/run.go:388
        	            				/home/rclone/go/pkg/mod/golang.org/toolchain@v0.0.1-go1.23.0.linux-amd64/src/testing/testing.go:1176
        	            				/home/rclone/go/pkg/mod/golang.org/toolchain@v0.0.1-go1.23.0.linux-amd64/src/testing/testing.go:1354
        	            				/home/rclone/go/pkg/mod/golang.org/toolchain@v0.0.1-go1.23.0.linux-amd64/src/testing/testing.go:1684
        	Error:      	Not equal: 
        	            	expected: []string{}
        	            	actual  : []string{"rclone-sync-test", "rclone-sync-test-ignore-file", "rclone-sync-test-include", "rclone-sync-test-include/layer2"}
        	            	
        	            	Diff:
        	            	--- Expected
        	            	+++ Actual
        	            	@@ -1,2 +1,6 @@
        	            	-([]string) {
        	            	+([]string) (len=4) {
        	            	+ (string) (len=16) "rclone-sync-test",
        	            	+ (string) (len=28) "rclone-sync-test-ignore-file",
        	            	+ (string) (len=24) "rclone-sync-test-include",
        	            	+ (string) (len=31) "rclone-sync-test-include/layer2"
        	            	 }
        	Test:       	TestSyncOverlapWithFilter
        	Messages:   	directories
2025/03/15 07:43:29 DEBUG : rclone-sync-test-include/layer2/: Removing directory marker
    run.go:125: removing dir "rclone-sync-test-include/layer2" failed - try 1/3: removing directory marker failed: googleapi: Error 404: No such object: rclone-test-werugiq8benu/rclone-sync-test-include/layer2/, notFound
2025/03/15 07:43:30 DEBUG : rclone-sync-test-include/layer2/: Removing directory marker
    run.go:125: removing dir "rclone-sync-test-include/layer2" failed - try 2/3: removing directory marker failed: googleapi: Error 404: No such object: rclone-test-werugiq8benu/rclone-sync-test-include/layer2/, notFound
2025/03/15 07:43:31 DEBUG : rclone-sync-test-include/layer2/: Removing directory marker
    run.go:125: removing dir "rclone-sync-test-include/layer2" failed - try 3/3: removing directory marker failed: googleapi: Error 404: No such object: rclone-test-werugiq8benu/rclone-sync-test-include/layer2/, notFound
    run.go:128: removing dir "rclone-sync-test-include/layer2" failed: removing directory marker failed: googleapi: Error 404: No such object: rclone-test-werugiq8benu/rclone-sync-test-include/layer2/, notFound
2025/03/15 07:43:32 DEBUG : rclone-sync-test-include/: Removing directory marker
    run.go:125: removing dir "rclone-sync-test-include" failed - try 1/3: removing directory marker failed: googleapi: Error 404: No such object: rclone-test-werugiq8benu/rclone-sync-test-include/, notFound
2025/03/15 07:43:33 DEBUG : rclone-sync-test-include/: Removing directory marker
    run.go:125: removing dir "rclone-sync-test-include" failed - try 2/3: removing directory marker failed: googleapi: Error 404: No such object: rclone-test-werugiq8benu/rclone-sync-test-include/, notFound
2025/03/15 07:43:34 DEBUG : rclone-sync-test-include/: Removing directory marker
    run.go:125: removing dir "rclone-sync-test-include" failed - try 3/3: removing directory marker failed: googleapi: Error 404: No such object: rclone-test-werugiq8benu/rclone-sync-test-include/, notFound
    run.go:128: removing dir "rclone-sync-test-include" failed: removing directory marker failed: googleapi: Error 404: No such object: rclone-test-werugiq8benu/rclone-sync-test-include/, notFound
2025/03/15 07:43:35 DEBUG : rclone-sync-test-ignore-file/: Removing directory marker
    run.go:125: removing dir "rclone-sync-test-ignore-file" failed - try 1/3: removing directory marker failed: googleapi: Error 404: No such object: rclone-test-werugiq8benu/rclone-sync-test-ignore-file/, notFound
2025/03/15 07:43:36 DEBUG : rclone-sync-test-ignore-file/: Removing directory marker
    run.go:125: removing dir "rclone-sync-test-ignore-file" failed - try 2/3: removing directory marker failed: googleapi: Error 404: No such object: rclone-test-werugiq8benu/rclone-sync-test-ignore-file/, notFound
2025/03/15 07:43:37 DEBUG : rclone-sync-test-ignore-file/: Removing directory marker
    run.go:125: removing dir "rclone-sync-test-ignore-file" failed - try 3/3: removing directory marker failed: googleapi: Error 404: No such object: rclone-test-werugiq8benu/rclone-sync-test-ignore-file/, notFound
    run.go:128: removing dir "rclone-sync-test-ignore-file" failed: removing directory marker failed: googleapi: Error 404: No such object: rclone-test-werugiq8benu/rclone-sync-test-ignore-file/, notFound
2025/03/15 07:43:38 DEBUG : rclone-sync-test/: Removing directory marker
    run.go:125: removing dir "rclone-sync-test" failed - try 1/3: removing directory marker failed: googleapi: Error 404: No such object: rclone-test-werugiq8benu/rclone-sync-test/, notFound
2025/03/15 07:43:39 DEBUG : rclone-sync-test/: Removing directory marker
    run.go:125: removing dir "rclone-sync-test" failed - try 2/3: removing directory marker failed: googleapi: Error 404: No such object: rclone-test-werugiq8benu/rclone-sync-test/, notFound
2025/03/15 07:43:40 DEBUG : rclone-sync-test/: Removing directory marker
    run.go:125: removing dir "rclone-sync-test" failed - try 3/3: removing directory marker failed: googleapi: Error 404: No such object: rclone-test-werugiq8benu/rclone-sync-test/, notFound
    run.go:128: removing dir "rclone-sync-test" failed: removing directory marker failed: googleapi: Error 404: No such object: rclone-test-werugiq8benu/rclone-sync-test/, notFound
    fstest.go:292: Sleeping for 1s for list eventual consistency: 1/3
    fstest.go:292: Sleeping for 2s for list eventual consistency: 2/3
    fstest.go:292: Sleeping for 4s for list eventual consistency: 3/3
    fstest.go:321: 
        	Error Trace:	/home/rclone/go/src/github.com/rclone/rclone/fstest/fstest.go:321
        	            				/home/rclone/go/src/github.com/rclone/rclone/fstest/fstest.go:332
        	            				/home/rclone/go/src/github.com/rclone/rclone/fstest/run.go:173
        	            				/home/rclone/go/src/github.com/rclone/rclone/fstest/run.go:388
        	            				/home/rclone/go/pkg/mod/golang.org/toolchain@v0.0.1-go1.23.0.linux-amd64/src/testing/testing.go:1176
        	            				/home/rclone/go/pkg/mod/golang.org/toolchain@v0.0.1-go1.23.0.linux-amd64/src/testing/testing.go:1354
        	            				/home/rclone/go/pkg/mod/golang.org/toolchain@v0.0.1-go1.23.0.linux-amd64/src/testing/testing.go:1684
        	Error:      	Not equal: 
        	            	expected: []string{}
        	            	actual  : []string{"rclone-sync-test", "rclone-sync-test-ignore-file", "rclone-sync-test-include", "rclone-sync-test-include/layer2"}
        	            	
        	            	Diff:
        	            	--- Expected
        	            	+++ Actual
        	            	@@ -1,2 +1,6 @@
        	            	-([]string) {
        	            	+([]string) (len=4) {
        	            	+ (string) (len=16) "rclone-sync-test",
        	            	+ (string) (len=28) "rclone-sync-test-ignore-file",
        	            	+ (string) (len=24) "rclone-sync-test-include",
        	            	+ (string) (len=31) "rclone-sync-test-include/layer2"
        	            	 }
        	Test:       	TestSyncOverlapWithFilter
        	Messages:   	directories
2025/03/15 07:43:48 DEBUG : rclone-sync-test-include/layer2/: Removing directory marker
    run.go:125: removing dir "rclone-sync-test-include/layer2" failed - try 1/3: removing directory marker failed: googleapi: Error 404: No such object: rclone-test-werugiq8benu/rclone-sync-test-include/layer2/, notFound
2025/03/15 07:43:49 DEBUG : rclone-sync-test-include/layer2/: Removing directory marker
    run.go:125: removing dir "rclone-sync-test-include/layer2" failed - try 2/3: removing directory marker failed: googleapi: Error 404: No such object: rclone-test-werugiq8benu/rclone-sync-test-include/layer2/, notFound
2025/03/15 07:43:51 DEBUG : rclone-sync-test-include/layer2/: Removing directory marker
    run.go:125: removing dir "rclone-sync-test-include/layer2" failed - try 3/3: removing directory marker failed: googleapi: Error 404: No such object: rclone-test-werugiq8benu/rclone-sync-test-include/layer2/, notFound
    run.go:128: removing dir "rclone-sync-test-include/layer2" failed: removing directory marker failed: googleapi: Error 404: No such object: rclone-test-werugiq8benu/rclone-sync-test-include/layer2/, notFound
2025/03/15 07:43:52 DEBUG : rclone-sync-test-include/: Removing directory marker
    run.go:125: removing dir "rclone-sync-test-include" failed - try 1/3: removing directory marker failed: googleapi: Error 404: No such object: rclone-test-werugiq8benu/rclone-sync-test-include/, notFound
2025/03/15 07:43:53 DEBUG : rclone-sync-test-include/: Removing directory marker
    run.go:125: removing dir "rclone-sync-test-include" failed - try 2/3: removing directory marker failed: googleapi: Error 404: No such object: rclone-test-werugiq8benu/rclone-sync-test-include/, notFound
2025/03/15 07:43:54 DEBUG : rclone-sync-test-include/: Removing directory marker
    run.go:125: removing dir "rclone-sync-test-include" failed - try 3/3: removing directory marker failed: googleapi: Error 404: No such object: rclone-test-werugiq8benu/rclone-sync-test-include/, notFound
    run.go:128: removing dir "rclone-sync-test-include" failed: removing directory marker failed: googleapi: Error 404: No such object: rclone-test-werugiq8benu/rclone-sync-test-include/, notFound
2025/03/15 07:43:55 DEBUG : rclone-sync-test-ignore-file/: Removing directory marker
    run.go:125: removing dir "rclone-sync-test-ignore-file" failed - try 1/3: removing directory marker failed: googleapi: Error 404: No such object: rclone-test-werugiq8benu/rclone-sync-test-ignore-file/, notFound
2025/03/15 07:43:56 DEBUG : rclone-sync-test-ignore-file/: Removing directory marker
    run.go:125: removing dir "rclone-sync-test-ignore-file" failed - try 2/3: removing directory marker failed: googleapi: Error 404: No such object: rclone-test-werugiq8benu/rclone-sync-test-ignore-file/, notFound
2025/03/15 07:43:57 DEBUG : rclone-sync-test-ignore-file/: Removing directory marker
    run.go:125: removing dir "rclone-sync-test-ignore-file" failed - try 3/3: removing directory marker failed: googleapi: Error 404: No such object: rclone-test-werugiq8benu/rclone-sync-test-ignore-file/, notFound
    run.go:128: removing dir "rclone-sync-test-ignore-file" failed: removing directory marker failed: googleapi: Error 404: No such object: rclone-test-werugiq8benu/rclone-sync-test-ignore-file/, notFound
2025/03/15 07:43:58 DEBUG : rclone-sync-test/: Removing directory marker
    run.go:125: removing dir "rclone-sync-test" failed - try 1/3: removing directory marker failed: googleapi: Error 404: No such object: rclone-test-werugiq8benu/rclone-sync-test/, notFound
2025/03/15 07:43:59 DEBUG : rclone-sync-test/: Removing directory marker
    run.go:125: removing dir "rclone-sync-test" failed - try 2/3: removing directory marker failed: googleapi: Error 404: No such object: rclone-test-werugiq8benu/rclone-sync-test/, notFound
2025/03/15 07:44:00 DEBUG : rclone-sync-test/: Removing directory marker
    run.go:125: removing dir "rclone-sync-test" failed - try 3/3: removing directory marker failed: googleapi: Error 404: No such object: rclone-test-werugiq8benu/rclone-sync-test/, notFound
    run.go:128: removing dir "rclone-sync-test" failed: removing directory marker failed: googleapi: Error 404: No such object: rclone-test-werugiq8benu/rclone-sync-test/, notFound
    fstest.go:292: Sleeping for 1s for list eventual consistency: 1/3
    fstest.go:292: Sleeping for 2s for list eventual consistency: 2/3
    fstest.go:292: Sleeping for 4s for list eventual consistency: 3/3
    fstest.go:321: 
        	Error Trace:	/home/rclone/go/src/github.com/rclone/rclone/fstest/fstest.go:321
        	            				/home/rclone/go/src/github.com/rclone/rclone/fstest/fstest.go:332
        	            				/home/rclone/go/src/github.com/rclone/rclone/fstest/run.go:173
        	            				/home/rclone/go/src/github.com/rclone/rclone/fstest/run.go:388
        	            				/home/rclone/go/pkg/mod/golang.org/toolchain@v0.0.1-go1.23.0.linux-amd64/src/testing/testing.go:1176
        	            				/home/rclone/go/pkg/mod/golang.org/toolchain@v0.0.1-go1.23.0.linux-amd64/src/testing/testing.go:1354
        	            				/home/rclone/go/pkg/mod/golang.org/toolchain@v0.0.1-go1.23.0.linux-amd64/src/testing/testing.go:1684
        	Error:      	Not equal: 
        	            	expected: []string{}
        	            	actual  : []string{"rclone-sync-test", "rclone-sync-test-ignore-file", "rclone-sync-test-include", "rclone-sync-test-include/layer2"}
        	            	
        	            	Diff:
        	            	--- Expected
        	            	+++ Actual
        	            	@@ -1,2 +1,6 @@
        	            	-([]string) {
        	            	+([]string) (len=4) {
        	            	+ (string) (len=16) "rclone-sync-test",
        	            	+ (string) (len=28) "rclone-sync-test-ignore-file",
        	            	+ (string) (len=24) "rclone-sync-test-include",
        	            	+ (string) (len=31) "rclone-sync-test-include/layer2"
        	            	 }
        	Test:       	TestSyncOverlapWithFilter
        	Messages:   	directories
2025/03/15 07:44:08 DEBUG : rclone-sync-test-include/layer2/: Removing directory marker
    run.go:125: removing dir "rclone-sync-test-include/layer2" failed - try 1/3: removing directory marker failed: googleapi: Error 404: No such object: rclone-test-werugiq8benu/rclone-sync-test-include/layer2/, notFound
2025/03/15 07:44:09 DEBUG : rclone-sync-test-include/layer2/: Removing directory marker
    run.go:125: removing dir "rclone-sync-test-include/layer2" failed - try 2/3: removing directory marker failed: googleapi: Error 404: No such object: rclone-test-werugiq8benu/rclone-sync-test-include/layer2/, notFound
2025/03/15 07:44:10 DEBUG : rclone-sync-test-include/layer2/: Removing directory marker
    run.go:125: removing dir "rclone-sync-test-include/layer2" failed - try 3/3: removing directory marker failed: googleapi: Error 404: No such object: rclone-test-werugiq8benu/rclone-sync-test-include/layer2/, notFound
    run.go:128: removing dir "rclone-sync-test-include/layer2" failed: removing directory marker failed: googleapi: Error 404: No such object: rclone-test-werugiq8benu/rclone-sync-test-include/layer2/, notFound
2025/03/15 07:44:11 DEBUG : rclone-sync-test-include/: Removing directory marker
    run.go:125: removing dir "rclone-sync-test-include" failed - try 1/3: removing directory marker failed: googleapi: Error 404: No such object: rclone-test-werugiq8benu/rclone-sync-test-include/, notFound
2025/03/15 07:44:12 DEBUG : rclone-sync-test-include/: Removing directory marker
    run.go:125: removing dir "rclone-sync-test-include" failed - try 2/3: removing directory marker failed: googleapi: Error 404: No such object: rclone-test-werugiq8benu/rclone-sync-test-include/, notFound
2025/03/15 07:44:14 DEBUG : rclone-sync-test-include/: Removing directory marker
    run.go:125: removing dir "rclone-sync-test-include" failed - try 3/3: removing directory marker failed: googleapi: Error 404: No such object: rclone-test-werugiq8benu/rclone-sync-test-include/, notFound
    run.go:128: removing dir "rclone-sync-test-include" failed: removing directory marker failed: googleapi: Error 404: No such object: rclone-test-werugiq8benu/rclone-sync-test-include/, notFound
2025/03/15 07:44:15 DEBUG : rclone-sync-test-ignore-file/: Removing directory marker
    run.go:125: removing dir "rclone-sync-test-ignore-file" failed - try 1/3: removing directory marker failed: googleapi: Error 404: No such object: rclone-test-werugiq8benu/rclone-sync-test-ignore-file/, notFound
2025/03/15 07:44:16 DEBUG : rclone-sync-test-ignore-file/: Removing directory marker
    run.go:125: removing dir "rclone-sync-test-ignore-file" failed - try 2/3: removing directory marker failed: googleapi: Error 404: No such object: rclone-test-werugiq8benu/rclone-sync-test-ignore-file/, notFound
2025/03/15 07:44:17 DEBUG : rclone-sync-test-ignore-file/: Removing directory marker
    run.go:125: removing dir "rclone-sync-test-ignore-file" failed - try 3/3: removing directory marker failed: googleapi: Error 404: No such object: rclone-test-werugiq8benu/rclone-sync-test-ignore-file/, notFound
    run.go:128: removing dir "rclone-sync-test-ignore-file" failed: removing directory marker failed: googleapi: Error 404: No such object: rclone-test-werugiq8benu/rclone-sync-test-ignore-file/, notFound
2025/03/15 07:44:18 DEBUG : rclone-sync-test/: Removing directory marker
    run.go:125: removing dir "rclone-sync-test" failed - try 1/3: removing directory marker failed: googleapi: Error 404: No such object: rclone-test-werugiq8benu/rclone-sync-test/, notFound
2025/03/15 07:44:19 DEBUG : rclone-sync-test/: Removing directory marker
    run.go:125: removing dir "rclone-sync-test" failed - try 2/3: removing directory marker failed: googleapi: Error 404: No such object: rclone-test-werugiq8benu/rclone-sync-test/, notFound
2025/03/15 07:44:20 DEBUG : rclone-sync-test/: Removing directory marker
    run.go:125: removing dir "rclone-sync-test" failed - try 3/3: removing directory marker failed: googleapi: Error 404: No such object: rclone-test-werugiq8benu/rclone-sync-test/, notFound
    run.go:128: removing dir "rclone-sync-test" failed: removing directory marker failed: googleapi: Error 404: No such object: rclone-test-werugiq8benu/rclone-sync-test/, notFound
    fstest.go:292: Sleeping for 1s for list eventual consistency: 1/3
    fstest.go:292: Sleeping for 2s for list eventual consistency: 2/3
    fstest.go:292: Sleeping for 4s for list eventual consistency: 3/3
    fstest.go:321: 
        	Error Trace:	/home/rclone/go/src/github.com/rclone/rclone/fstest/fstest.go:321
        	            				/home/rclone/go/src/github.com/rclone/rclone/fstest/fstest.go:332
        	            				/home/rclone/go/src/github.com/rclone/rclone/fstest/run.go:173
        	            				/home/rclone/go/src/github.com/rclone/rclone/fstest/run.go:388
        	            				/home/rclone/go/pkg/mod/golang.org/toolchain@v0.0.1-go1.23.0.linux-amd64/src/testing/testing.go:1176
        	            				/home/rclone/go/pkg/mod/golang.org/toolchain@v0.0.1-go1.23.0.linux-amd64/src/testing/testing.go:1354
        	            				/home/rclone/go/pkg/mod/golang.org/toolchain@v0.0.1-go1.23.0.linux-amd64/src/testing/testing.go:1684
        	Error:      	Not equal: 
        	            	expected: []string{}
        	            	actual  : []string{"rclone-sync-test", "rclone-sync-test-ignore-file", "rclone-sync-test-include", "rclone-sync-test-include/layer2"}
        	            	
        	            	Diff:
        	            	--- Expected
        	            	+++ Actual
        	            	@@ -1,2 +1,6 @@
        	            	-([]string) {
        	            	+([]string) (len=4) {
        	            	+ (string) (len=16) "rclone-sync-test",
        	            	+ (string) (len=28) "rclone-sync-test-ignore-file",
        	            	+ (string) (len=24) "rclone-sync-test-include",
        	            	+ (string) (len=31) "rclone-sync-test-include/layer2"
        	            	 }
        	Test:       	TestSyncOverlapWithFilter
        	Messages:   	directories
2025/03/15 07:44:28 DEBUG : rclone-sync-test-include/layer2/: Removing directory marker
    run.go:125: removing dir "rclone-sync-test-include/layer2" failed - try 1/3: removing directory marker failed: googleapi: Error 404: No such object: rclone-test-werugiq8benu/rclone-sync-test-include/layer2/, notFound
2025/03/15 07:44:29 DEBUG : rclone-sync-test-include/layer2/: Removing directory marker
    run.go:125: removing dir "rclone-sync-test-include/layer2" failed - try 2/3: removing directory marker failed: googleapi: Error 404: No such object: rclone-test-werugiq8benu/rclone-sync-test-include/layer2/, notFound
2025/03/15 07:44:30 DEBUG : rclone-sync-test-include/layer2/: Removing directory marker
    run.go:125: removing dir "rclone-sync-test-include/layer2" failed - try 3/3: removing directory marker failed: googleapi: Error 404: No such object: rclone-test-werugiq8benu/rclone-sync-test-include/layer2/, notFound
    run.go:128: removing dir "rclone-sync-test-include/layer2" failed: removing directory marker failed: googleapi: Error 404: No such object: rclone-test-werugiq8benu/rclone-sync-test-include/layer2/, notFound
2025/03/15 07:44:31 DEBUG : rclone-sync-test-include/: Removing directory marker
    run.go:125: removing dir "rclone-sync-test-include" failed - try 1/3: removing directory marker failed: googleapi: Error 404: No such object: rclone-test-werugiq8benu/rclone-sync-test-include/, notFound
2025/03/15 07:44:32 DEBUG : rclone-sync-test-include/: Removing directory marker
    run.go:125: removing dir "rclone-sync-test-include" failed - try 2/3: removing directory marker failed: googleapi: Error 404: No such object: rclone-test-werugiq8benu/rclone-sync-test-include/, notFound
2025/03/15 07:44:33 DEBUG : rclone-sync-test-include/: Removing directory marker
    run.go:125: removing dir "rclone-sync-test-include" failed - try 3/3: removing directory marker failed: googleapi: Error 404: No such object: rclone-test-werugiq8benu/rclone-sync-test-include/, notFound
    run.go:128: removing dir "rclone-sync-test-include" failed: removing directory marker failed: googleapi: Error 404: No such object: rclone-test-werugiq8benu/rclone-sync-test-include/, notFound
2025/03/15 07:44:34 DEBUG : rclone-sync-test-ignore-file/: Removing directory marker
    run.go:125: removing dir "rclone-sync-test-ignore-file" failed - try 1/3: removing directory marker failed: googleapi: Error 404: No such object: rclone-test-werugiq8benu/rclone-sync-test-ignore-file/, notFound
2025/03/15 07:44:36 DEBUG : rclone-sync-test-ignore-file/: Removing directory marker
    run.go:125: removing dir "rclone-sync-test-ignore-file" failed - try 2/3: removing directory marker failed: googleapi: Error 404: No such object: rclone-test-werugiq8benu/rclone-sync-test-ignore-file/, notFound
2025/03/15 07:44:37 DEBUG : rclone-sync-test-ignore-file/: Removing directory marker
    run.go:125: removing dir "rclone-sync-test-ignore-file" failed - try 3/3: removing directory marker failed: googleapi: Error 404: No such object: rclone-test-werugiq8benu/rclone-sync-test-ignore-file/, notFound
    run.go:128: removing dir "rclone-sync-test-ignore-file" failed: removing directory marker failed: googleapi: Error 404: No such object: rclone-test-werugiq8benu/rclone-sync-test-ignore-file/, notFound
2025/03/15 07:44:38 DEBUG : rclone-sync-test/: Removing directory marker
    run.go:125: removing dir "rclone-sync-test" failed - try 1/3: removing directory marker failed: googleapi: Error 404: No such object: rclone-test-werugiq8benu/rclone-sync-test/, notFound
2025/03/15 07:44:39 DEBUG : rclone-sync-test/: Removing directory marker
    run.go:125: removing dir "rclone-sync-test" failed - try 2/3: removing directory marker failed: googleapi: Error 404: No such object: rclone-test-werugiq8benu/rclone-sync-test/, notFound
2025/03/15 07:44:40 DEBUG : rclone-sync-test/: Removing directory marker
    run.go:125: removing dir "rclone-sync-test" failed - try 3/3: removing directory marker failed: googleapi: Error 404: No such object: rclone-test-werugiq8benu/rclone-sync-test/, notFound
    run.go:128: removing dir "rclone-sync-test" failed: removing directory marker failed: googleapi: Error 404: No such object: rclone-test-werugiq8benu/rclone-sync-test/, notFound
    fstest.go:292: Sleeping for 1s for list eventual consistency: 1/3
    fstest.go:292: Sleeping for 2s for list eventual consistency: 2/3
    fstest.go:292: Sleeping for 4s for list eventual consistency: 3/3
    fstest.go:321: 
        	Error Trace:	/home/rclone/go/src/github.com/rclone/rclone/fstest/fstest.go:321
        	            				/home/rclone/go/src/github.com/rclone/rclone/fstest/fstest.go:332
        	            				/home/rclone/go/src/github.com/rclone/rclone/fstest/run.go:173
        	            				/home/rclone/go/src/github.com/rclone/rclone/fstest/run.go:388
        	            				/home/rclone/go/pkg/mod/golang.org/toolchain@v0.0.1-go1.23.0.linux-amd64/src/testing/testing.go:1176
        	            				/home/rclone/go/pkg/mod/golang.org/toolchain@v0.0.1-go1.23.0.linux-amd64/src/testing/testing.go:1354
        	            				/home/rclone/go/pkg/mod/golang.org/toolchain@v0.0.1-go1.23.0.linux-amd64/src/testing/testing.go:1684
        	Error:      	Not equal: 
        	            	expected: []string{}
        	            	actual  : []string{"rclone-sync-test", "rclone-sync-test-ignore-file", "rclone-sync-test-include", "rclone-sync-test-include/layer2"}
        	            	
        	            	Diff:
        	            	--- Expected
        	            	+++ Actual
        	            	@@ -1,2 +1,6 @@
        	            	-([]string) {
        	            	+([]string) (len=4) {
        	            	+ (string) (len=16) "rclone-sync-test",
        	            	+ (string) (len=28) "rclone-sync-test-ignore-file",
        	            	+ (string) (len=24) "rclone-sync-test-include",
        	            	+ (string) (len=31) "rclone-sync-test-include/layer2"
        	            	 }
        	Test:       	TestSyncOverlapWithFilter
        	Messages:   	directories
2025/03/15 07:44:48 DEBUG : rclone-sync-test-include/layer2/: Removing directory marker
    run.go:125: removing dir "rclone-sync-test-include/layer2" failed - try 1/3: removing directory marker failed: googleapi: Error 404: No such object: rclone-test-werugiq8benu/rclone-sync-test-include/layer2/, notFound
2025/03/15 07:44:49 DEBUG : rclone-sync-test-include/layer2/: Removing directory marker
    run.go:125: removing dir "rclone-sync-test-include/layer2" failed - try 2/3: removing directory marker failed: googleapi: Error 404: No such object: rclone-test-werugiq8benu/rclone-sync-test-include/layer2/, notFound
2025/03/15 07:44:50 DEBUG : rclone-sync-test-include/layer2/: Removing directory marker
    run.go:125: removing dir "rclone-sync-test-include/layer2" failed - try 3/3: removing directory marker failed: googleapi: Error 404: No such object: rclone-test-werugiq8benu/rclone-sync-test-include/layer2/, notFound
    run.go:128: removing dir "rclone-sync-test-include/layer2" failed: removing directory marker failed: googleapi: Error 404: No such object: rclone-test-werugiq8benu/rclone-sync-test-include/layer2/, notFound
2025/03/15 07:44:51 DEBUG : rclone-sync-test-include/: Removing directory marker
    run.go:125: removing dir "rclone-sync-test-include" failed - try 1/3: removing directory marker failed: googleapi: Error 404: No such object: rclone-test-werugiq8benu/rclone-sync-test-include/, notFound
2025/03/15 07:44:52 DEBUG : rclone-sync-test-include/: Removing directory marker
    run.go:125: removing dir "rclone-sync-test-include" failed - try 2/3: removing directory marker failed: googleapi: Error 404: No such object: rclone-test-werugiq8benu/rclone-sync-test-include/, notFound
2025/03/15 07:44:53 DEBUG : rclone-sync-test-include/: Removing directory marker
    run.go:125: removing dir "rclone-sync-test-include" failed - try 3/3: removing directory marker failed: googleapi: Error 404: No such object: rclone-test-werugiq8benu/rclone-sync-test-include/, notFound
    run.go:128: removing dir "rclone-sync-test-include" failed: removing directory marker failed: googleapi: Error 404: No such object: rclone-test-werugiq8benu/rclone-sync-test-include/, notFound
2025/03/15 07:44:54 DEBUG : rclone-sync-test-ignore-file/: Removing directory marker
    run.go:125: removing dir "rclone-sync-test-ignore-file" failed - try 1/3: removing directory marker failed: googleapi: Error 404: No such object: rclone-test-werugiq8benu/rclone-sync-test-ignore-file/, notFound
2025/03/15 07:44:55 DEBUG : rclone-sync-test-ignore-file/: Removing directory marker
    run.go:125: removing dir "rclone-sync-test-ignore-file" failed - try 2/3: removing directory marker failed: googleapi: Error 404: No such object: rclone-test-werugiq8benu/rclone-sync-test-ignore-file/, notFound
2025/03/15 07:44:56 DEBUG : rclone-sync-test-ignore-file/: Removing directory marker
    run.go:125: removing dir "rclone-sync-test-ignore-file" failed - try 3/3: removing directory marker failed: googleapi: Error 404: No such object: rclone-test-werugiq8benu/rclone-sync-test-ignore-file/, notFound
    run.go:128: removing dir "rclone-sync-test-ignore-file" failed: removing directory marker failed: googleapi: Error 404: No such object: rclone-test-werugiq8benu/rclone-sync-test-ignore-file/, notFound
2025/03/15 07:44:58 DEBUG : rclone-sync-test/: Removing directory marker
    run.go:125: removing dir "rclone-sync-test" failed - try 1/3: removing directory marker failed: googleapi: Error 404: No such object: rclone-test-werugiq8benu/rclone-sync-test/, notFound
2025/03/15 07:44:59 DEBUG : rclone-sync-test/: Removing directory marker
    run.go:125: removing dir "rclone-sync-test" failed - try 2/3: removing directory marker failed: googleapi: Error 404: No such object: rclone-test-werugiq8benu/rclone-sync-test/, notFound
2025/03/15 07:45:00 DEBUG : rclone-sync-test/: Removing directory marker
    run.go:125: removing dir "rclone-sync-test" failed - try 3/3: removing directory marker failed: googleapi: Error 404: No such object: rclone-test-werugiq8benu/rclone-sync-test/, notFound
    run.go:128: removing dir "rclone-sync-test" failed: removing directory marker failed: googleapi: Error 404: No such object: rclone-test-werugiq8benu/rclone-sync-test/, notFound
    fstest.go:292: Sleeping for 1s for list eventual consistency: 1/3
    fstest.go:292: Sleeping for 2s for list eventual consistency: 2/3
    fstest.go:292: Sleeping for 4s for list eventual consistency: 3/3
    fstest.go:321: 
        	Error Trace:	/home/rclone/go/src/github.com/rclone/rclone/fstest/fstest.go:321
        	            				/home/rclone/go/src/github.com/rclone/rclone/fstest/fstest.go:332
        	            				/home/rclone/go/src/github.com/rclone/rclone/fstest/run.go:173
        	            				/home/rclone/go/src/github.com/rclone/rclone/fstest/run.go:388
        	            				/home/rclone/go/pkg/mod/golang.org/toolchain@v0.0.1-go1.23.0.linux-amd64/src/testing/testing.go:1176
        	            				/home/rclone/go/pkg/mod/golang.org/toolchain@v0.0.1-go1.23.0.linux-amd64/src/testing/testing.go:1354
        	            				/home/rclone/go/pkg/mod/golang.org/toolchain@v0.0.1-go1.23.0.linux-amd64/src/testing/testing.go:1684
        	Error:      	Not equal: 
        	            	expected: []string{}
        	            	actual  : []string{"rclone-sync-test", "rclone-sync-test-ignore-file", "rclone-sync-test-include", "rclone-sync-test-include/layer2"}
        	            	
        	            	Diff:
        	            	--- Expected
        	            	+++ Actual
        	            	@@ -1,2 +1,6 @@
        	            	-([]string) {
        	            	+([]string) (len=4) {
        	            	+ (string) (len=16) "rclone-sync-test",
        	            	+ (string) (len=28) "rclone-sync-test-ignore-file",
        	            	+ (string) (len=24) "rclone-sync-test-include",
        	            	+ (string) (len=31) "rclone-sync-test-include/layer2"
        	            	 }
        	Test:       	TestSyncOverlapWithFilter
        	Messages:   	directories
2025/03/15 07:45:08 DEBUG : rclone-sync-test-include/layer2/: Removing directory marker
    run.go:125: removing dir "rclone-sync-test-include/layer2" failed - try 1/3: removing directory marker failed: googleapi: Error 404: No such object: rclone-test-werugiq8benu/rclone-sync-test-include/layer2/, notFound
2025/03/15 07:45:09 DEBUG : rclone-sync-test-include/layer2/: Removing directory marker
    run.go:125: removing dir "rclone-sync-test-include/layer2" failed - try 2/3: removing directory marker failed: googleapi: Error 404: No such object: rclone-test-werugiq8benu/rclone-sync-test-include/layer2/, notFound
2025/03/15 07:45:10 DEBUG : rclone-sync-test-include/layer2/: Removing directory marker
    run.go:125: removing dir "rclone-sync-test-include/layer2" failed - try 3/3: removing directory marker failed: googleapi: Error 404: No such object: rclone-test-werugiq8benu/rclone-sync-test-include/layer2/, notFound
    run.go:128: removing dir "rclone-sync-test-include/layer2" failed: removing directory marker failed: googleapi: Error 404: No such object: rclone-test-werugiq8benu/rclone-sync-test-include/layer2/, notFound
2025/03/15 07:45:11 DEBUG : rclone-sync-test-include/: Removing directory marker
    run.go:125: removing dir "rclone-sync-test-include" failed - try 1/3: removing directory marker failed: googleapi: Error 404: No such object: rclone-test-werugiq8benu/rclone-sync-test-include/, notFound
2025/03/15 07:45:12 DEBUG : rclone-sync-test-include/: Removing directory marker
    run.go:125: removing dir "rclone-sync-test-include" failed - try 2/3: removing directory marker failed: googleapi: Error 404: No such object: rclone-test-werugiq8benu/rclone-sync-test-include/, notFound
2025/03/15 07:45:13 DEBUG : rclone-sync-test-include/: Removing directory marker
    run.go:125: removing dir "rclone-sync-test-include" failed - try 3/3: removing directory marker failed: googleapi: Error 404: No such object: rclone-test-werugiq8benu/rclone-sync-test-include/, notFound
    run.go:128: removing dir "rclone-sync-test-include" failed: removing directory marker failed: googleapi: Error 404: No such object: rclone-test-werugiq8benu/rclone-sync-test-include/, notFound
2025/03/15 07:45:14 DEBUG : rclone-sync-test-ignore-file/: Removing directory marker
    run.go:125: removing dir "rclone-sync-test-ignore-file" failed - try 1/3: removing directory marker failed: googleapi: Error 404: No such object: rclone-test-werugiq8benu/rclone-sync-test-ignore-file/, notFound
2025/03/15 07:45:15 DEBUG : rclone-sync-test-ignore-file/: Removing directory marker
    run.go:125: removing dir "rclone-sync-test-ignore-file" failed - try 2/3: removing directory marker failed: googleapi: Error 404: No such object: rclone-test-werugiq8benu/rclone-sync-test-ignore-file/, notFound
2025/03/15 07:45:16 DEBUG : rclone-sync-test-ignore-file/: Removing directory marker
    run.go:125: removing dir "rclone-sync-test-ignore-file" failed - try 3/3: removing directory marker failed: googleapi: Error 404: No such object: rclone-test-werugiq8benu/rclone-sync-test-ignore-file/, notFound
    run.go:128: removing dir "rclone-sync-test-ignore-file" failed: removing directory marker failed: googleapi: Error 404: No such object: rclone-test-werugiq8benu/rclone-sync-test-ignore-file/, notFound
2025/03/15 07:45:17 DEBUG : rclone-sync-test/: Removing directory marker
    run.go:125: removing dir "rclone-sync-test" failed - try 1/3: removing directory marker failed: googleapi: Error 404: No such object: rclone-test-werugiq8benu/rclone-sync-test/, notFound
2025/03/15 07:45:18 DEBUG : rclone-sync-test/: Removing directory marker
    run.go:125: removing dir "rclone-sync-test" failed - try 2/3: removing directory marker failed: googleapi: Error 404: No such object: rclone-test-werugiq8benu/rclone-sync-test/, notFound
2025/03/15 07:45:19 DEBUG : rclone-sync-test/: Removing directory marker
    run.go:125: removing dir "rclone-sync-test" failed - try 3/3: removing directory marker failed: googleapi: Error 404: No such object: rclone-test-werugiq8benu/rclone-sync-test/, notFound
    run.go:128: removing dir "rclone-sync-test" failed: removing directory marker failed: googleapi: Error 404: No such object: rclone-test-werugiq8benu/rclone-sync-test/, notFound
    fstest.go:292: Sleeping for 1s for list eventual consistency: 1/3
    fstest.go:292: Sleeping for 2s for list eventual consistency: 2/3
    fstest.go:292: Sleeping for 4s for list eventual consistency: 3/3
    fstest.go:321: 
        	Error Trace:	/home/rclone/go/src/github.com/rclone/rclone/fstest/fstest.go:321
        	            				/home/rclone/go/src/github.com/rclone/rclone/fstest/fstest.go:332
        	            				/home/rclone/go/src/github.com/rclone/rclone/fstest/run.go:173
        	            				/home/rclone/go/src/github.com/rclone/rclone/fstest/run.go:388
        	            				/home/rclone/go/pkg/mod/golang.org/toolchain@v0.0.1-go1.23.0.linux-amd64/src/testing/testing.go:1176
        	            				/home/rclone/go/pkg/mod/golang.org/toolchain@v0.0.1-go1.23.0.linux-amd64/src/testing/testing.go:1354
        	            				/home/rclone/go/pkg/mod/golang.org/toolchain@v0.0.1-go1.23.0.linux-amd64/src/testing/testing.go:1684
        	Error:      	Not equal: 
        	            	expected: []string{}
        	            	actual  : []string{"rclone-sync-test", "rclone-sync-test-ignore-file", "rclone-sync-test-include", "rclone-sync-test-include/layer2"}
        	            	
        	            	Diff:
        	            	--- Expected
        	            	+++ Actual
        	            	@@ -1,2 +1,6 @@
        	            	-([]string) {
        	            	+([]string) (len=4) {
        	            	+ (string) (len=16) "rclone-sync-test",
        	            	+ (string) (len=28) "rclone-sync-test-ignore-file",
        	            	+ (string) (len=24) "rclone-sync-test-include",
        	            	+ (string) (len=31) "rclone-sync-test-include/layer2"
        	            	 }
        	Test:       	TestSyncOverlapWithFilter
        	Messages:   	directories
--- FAIL: TestSyncOverlapWithFilter (393.54s)
=== RUN   TestSyncCompareDest
    run.go:180: Remote "GCS bucket rclone-test-werugiq8benu", Local "Local file system at /tmp/rclone2533315254", Modify Window "1ns"
2025/03/15 07:45:28 DEBUG : Creating backend with remote "TestGoogleCloudStorage,directory_markers:rclone-test-werugiq8benu/dst"
2025/03/15 07:45:28 DEBUG : TestGoogleCloudStorage: detected overridden config - adding "{juk_h}" suffix to name
2025/03/15 07:45:28 DEBUG : Creating backend with remote "TestGoogleCloudStorage,directory_markers:rclone-test-werugiq8benu/CompareDest"
2025/03/15 07:45:28 DEBUG : TestGoogleCloudStorage: detected overridden config - adding "{juk_h}" suffix to name
2025/03/15 07:45:29 DEBUG : fs cache: renaming cache item "TestGoogleCloudStorage,directory_markers:rclone-test-werugiq8benu/CompareDest" to be canonical "TestGoogleCloudStorage{juk_h}:rclone-test-werugiq8benu/CompareDest"
2025/03/15 07:45:30 DEBUG : one: Need to transfer - File not found at Destination
2025/03/15 07:45:30 DEBUG : GCS bucket rclone-test-werugiq8benu path dst: Waiting for checks to finish
2025/03/15 07:45:30 DEBUG : GCS bucket rclone-test-werugiq8benu path dst: Waiting for transfers to finish
2025/03/15 07:45:30 DEBUG : /: Creating directory marker
2025/03/15 07:45:30 DEBUG : one: md5 = f97c5d29941bfb1b2fdab0874906ab82 OK
2025/03/15 07:45:30 INFO  : one: Copied (new)
2025/03/15 07:45:30 DEBUG : Waiting for deletions to finish
2025/03/15 07:45:30 DEBUG : fs cache: switching user supplied name "TestGoogleCloudStorage,directory_markers:rclone-test-werugiq8benu/CompareDest" for canonical name "TestGoogleCloudStorage{juk_h}:rclone-test-werugiq8benu/CompareDest"
2025/03/15 07:45:31 ERROR : : Entry doesn't belong in directory "" (same as directory) - ignoring
2025/03/15 07:45:31 DEBUG : one: Sizes differ (src 5 vs dst 3)
2025/03/15 07:45:31 DEBUG : GCS bucket rclone-test-werugiq8benu path dst: Waiting for checks to finish
2025/03/15 07:45:31 DEBUG : GCS bucket rclone-test-werugiq8benu path dst: Waiting for transfers to finish
2025/03/15 07:45:31 DEBUG : one: md5 = 07912d142f5d63ee918b34796b5a2432 OK
2025/03/15 07:45:31 INFO  : one: Copied (replaced existing)
2025/03/15 07:45:31 DEBUG : Waiting for deletions to finish
2025/03/15 07:45:32 DEBUG : dst/: Creating directory marker
2025/03/15 07:45:32 DEBUG : CompareDest/: Creating directory marker
2025/03/15 07:45:32 DEBUG : fs cache: switching user supplied name "TestGoogleCloudStorage,directory_markers:rclone-test-werugiq8benu/CompareDest" for canonical name "TestGoogleCloudStorage{juk_h}:rclone-test-werugiq8benu/CompareDest"
2025/03/15 07:45:33 ERROR : : Entry doesn't belong in directory "" (same as directory) - ignoring
2025/03/15 07:45:33 DEBUG : one: Sizes differ (src 5 vs dst 3)
2025/03/15 07:45:33 DEBUG : GCS bucket rclone-test-werugiq8benu path dst: Waiting for checks to finish
2025/03/15 07:45:33 DEBUG : one: Size and modification time the same (differ by 0s, within tolerance 1ns)
2025/03/15 07:45:33 DEBUG : one: Destination found in --compare-dest, skipping
2025/03/15 07:45:33 DEBUG : GCS bucket rclone-test-werugiq8benu path dst: Waiting for transfers to finish
2025/03/15 07:45:33 DEBUG : Waiting for deletions to finish
2025/03/15 07:45:33 INFO  : There was nothing to transfer
2025/03/15 07:45:33 DEBUG : fs cache: switching user supplied name "TestGoogleCloudStorage,directory_markers:rclone-test-werugiq8benu/CompareDest" for canonical name "TestGoogleCloudStorage{juk_h}:rclone-test-werugiq8benu/CompareDest"
2025/03/15 07:45:33 ERROR : : Entry doesn't belong in directory "" (same as directory) - ignoring
2025/03/15 07:45:33 DEBUG : two: Size and modification time the same (differ by 0s, within tolerance 1ns)
2025/03/15 07:45:33 DEBUG : two: Destination found in --compare-dest, skipping
2025/03/15 07:45:33 DEBUG : one: Sizes differ (src 5 vs dst 3)
2025/03/15 07:45:33 DEBUG : GCS bucket rclone-test-werugiq8benu path dst: Waiting for checks to finish
2025/03/15 07:45:33 DEBUG : one: Size and modification time the same (differ by 0s, within tolerance 1ns)
2025/03/15 07:45:33 DEBUG : one: Destination found in --compare-dest, skipping
2025/03/15 07:45:33 DEBUG : GCS bucket rclone-test-werugiq8benu path dst: Waiting for transfers to finish
2025/03/15 07:45:33 DEBUG : Waiting for deletions to finish
2025/03/15 07:45:33 INFO  : There was nothing to transfer
2025/03/15 07:45:33 DEBUG : fs cache: switching user supplied name "TestGoogleCloudStorage,directory_markers:rclone-test-werugiq8benu/CompareDest" for canonical name "TestGoogleCloudStorage{juk_h}:rclone-test-werugiq8benu/CompareDest"
2025/03/15 07:45:33 ERROR : : Entry doesn't belong in directory "" (same as directory) - ignoring
2025/03/15 07:45:33 DEBUG : two: Size and modification time the same (differ by 0s, within tolerance 1ns)
2025/03/15 07:45:33 DEBUG : two: Destination found in --compare-dest, skipping
2025/03/15 07:45:33 DEBUG : one: Sizes differ (src 5 vs dst 3)
2025/03/15 07:45:33 DEBUG : GCS bucket rclone-test-werugiq8benu path dst: Waiting for checks to finish
2025/03/15 07:45:34 DEBUG : one: Size and modification time the same (differ by 0s, within tolerance 1ns)
2025/03/15 07:45:34 DEBUG : one: Destination found in --compare-dest, skipping
2025/03/15 07:45:34 DEBUG : GCS bucket rclone-test-werugiq8benu path dst: Waiting for transfers to finish
2025/03/15 07:45:34 DEBUG : Waiting for deletions to finish
2025/03/15 07:45:34 INFO  : There was nothing to transfer
2025/03/15 07:45:34 DEBUG : fs cache: switching user supplied name "TestGoogleCloudStorage,directory_markers:rclone-test-werugiq8benu/CompareDest" for canonical name "TestGoogleCloudStorage{juk_h}:rclone-test-werugiq8benu/CompareDest"
2025/03/15 07:45:34 ERROR : : Entry doesn't belong in directory "" (same as directory) - ignoring
2025/03/15 07:45:34 DEBUG : two: Modification times differ by -119h59m59.876543211s: 2011-12-30 12:59:59 +0000 UTC, 2011-12-25 12:59:59.123456789 +0000 UTC
2025/03/15 07:45:34 DEBUG : two: md5 = b8a9f715dbb64fd5c56e7783c6820a61 OK
2025/03/15 07:45:34 DEBUG : two: Destination found in --compare-dest, skipping
2025/03/15 07:45:34 DEBUG : one: Sizes differ (src 5 vs dst 3)
2025/03/15 07:45:34 DEBUG : GCS bucket rclone-test-werugiq8benu path dst: Waiting for checks to finish
2025/03/15 07:45:34 DEBUG : one: Size and modification time the same (differ by 0s, within tolerance 1ns)
2025/03/15 07:45:34 DEBUG : one: Destination found in --compare-dest, skipping
2025/03/15 07:45:34 DEBUG : GCS bucket rclone-test-werugiq8benu path dst: Waiting for transfers to finish
2025/03/15 07:45:34 DEBUG : Waiting for deletions to finish
2025/03/15 07:45:34 INFO  : There was nothing to transfer
2025/03/15 07:45:34 DEBUG : fs cache: switching user supplied name "TestGoogleCloudStorage,directory_markers:rclone-test-werugiq8benu/CompareDest" for canonical name "TestGoogleCloudStorage{juk_h}:rclone-test-werugiq8benu/CompareDest"
2025/03/15 07:45:34 ERROR : : Entry doesn't belong in directory "" (same as directory) - ignoring
2025/03/15 07:45:34 DEBUG : two: Sizes differ (src 5 vs dst 3)
2025/03/15 07:45:34 DEBUG : two: Need to transfer - File not found at Destination
2025/03/15 07:45:34 DEBUG : one: Sizes differ (src 5 vs dst 3)
2025/03/15 07:45:34 DEBUG : GCS bucket rclone-test-werugiq8benu path dst: Waiting for checks to finish
2025/03/15 07:45:35 DEBUG : one: Size and modification time the same (differ by 0s, within tolerance 1ns)
2025/03/15 07:45:35 DEBUG : one: Destination found in --compare-dest, skipping
2025/03/15 07:45:35 DEBUG : GCS bucket rclone-test-werugiq8benu path dst: Waiting for transfers to finish
2025/03/15 07:45:35 DEBUG : two: md5 = 2379e4ce8c3380e996ab0509f17069ad OK
2025/03/15 07:45:35 INFO  : two: Copied (new)
2025/03/15 07:45:35 DEBUG : Waiting for deletions to finish
2025/03/15 07:45:35 DEBUG : rclone-sync-test-include/layer2/: Removing directory marker
    run.go:125: removing dir "rclone-sync-test-include/layer2" failed - try 1/3: removing directory marker failed: googleapi: Error 404: No such object: rclone-test-werugiq8benu/rclone-sync-test-include/layer2/, notFound
2025/03/15 07:45:36 DEBUG : rclone-sync-test-include/layer2/: Removing directory marker
    run.go:125: removing dir "rclone-sync-test-include/layer2" failed - try 2/3: removing directory marker failed: googleapi: Error 404: No such object: rclone-test-werugiq8benu/rclone-sync-test-include/layer2/, notFound
2025/03/15 07:45:37 DEBUG : rclone-sync-test-include/layer2/: Removing directory marker
    run.go:125: removing dir "rclone-sync-test-include/layer2" failed - try 3/3: removing directory marker failed: googleapi: Error 404: No such object: rclone-test-werugiq8benu/rclone-sync-test-include/layer2/, notFound
    run.go:128: removing dir "rclone-sync-test-include/layer2" failed: removing directory marker failed: googleapi: Error 404: No such object: rclone-test-werugiq8benu/rclone-sync-test-include/layer2/, notFound
2025/03/15 07:45:38 DEBUG : rclone-sync-test-include/: Removing directory marker
    run.go:125: removing dir "rclone-sync-test-include" failed - try 1/3: removing directory marker failed: googleapi: Error 404: No such object: rclone-test-werugiq8benu/rclone-sync-test-include/, notFound
2025/03/15 07:45:39 DEBUG : rclone-sync-test-include/: Removing directory marker
    run.go:125: removing dir "rclone-sync-test-include" failed - try 2/3: removing directory marker failed: googleapi: Error 404: No such object: rclone-test-werugiq8benu/rclone-sync-test-include/, notFound
2025/03/15 07:45:40 DEBUG : rclone-sync-test-include/: Removing directory marker
    run.go:125: removing dir "rclone-sync-test-include" failed - try 3/3: removing directory marker failed: googleapi: Error 404: No such object: rclone-test-werugiq8benu/rclone-sync-test-include/, notFound
    run.go:128: removing dir "rclone-sync-test-include" failed: removing directory marker failed: googleapi: Error 404: No such object: rclone-test-werugiq8benu/rclone-sync-test-include/, notFound
2025/03/15 07:45:41 DEBUG : rclone-sync-test-ignore-file/: Removing directory marker
    run.go:125: removing dir "rclone-sync-test-ignore-file" failed - try 1/3: removing directory marker failed: googleapi: Error 404: No such object: rclone-test-werugiq8benu/rclone-sync-test-ignore-file/, notFound
2025/03/15 07:45:42 DEBUG : rclone-sync-test-ignore-file/: Removing directory marker
    run.go:125: removing dir "rclone-sync-test-ignore-file" failed - try 2/3: removing directory marker failed: googleapi: Error 404: No such object: rclone-test-werugiq8benu/rclone-sync-test-ignore-file/, notFound
2025/03/15 07:45:44 DEBUG : rclone-sync-test-ignore-file/: Removing directory marker
    run.go:125: removing dir "rclone-sync-test-ignore-file" failed - try 3/3: removing directory marker failed: googleapi: Error 404: No such object: rclone-test-werugiq8benu/rclone-sync-test-ignore-file/, notFound
    run.go:128: removing dir "rclone-sync-test-ignore-file" failed: removing directory marker failed: googleapi: Error 404: No such object: rclone-test-werugiq8benu/rclone-sync-test-ignore-file/, notFound
2025/03/15 07:45:45 DEBUG : rclone-sync-test/: Removing directory marker
    run.go:125: removing dir "rclone-sync-test" failed - try 1/3: removing directory marker failed: googleapi: Error 404: No such object: rclone-test-werugiq8benu/rclone-sync-test/, notFound
2025/03/15 07:45:46 DEBUG : rclone-sync-test/: Removing directory marker
    run.go:125: removing dir "rclone-sync-test" failed - try 2/3: removing directory marker failed: googleapi: Error 404: No such object: rclone-test-werugiq8benu/rclone-sync-test/, notFound
2025/03/15 07:45:47 DEBUG : rclone-sync-test/: Removing directory marker
    run.go:125: removing dir "rclone-sync-test" failed - try 3/3: removing directory marker failed: googleapi: Error 404: No such object: rclone-test-werugiq8benu/rclone-sync-test/, notFound
    run.go:128: removing dir "rclone-sync-test" failed: removing directory marker failed: googleapi: Error 404: No such object: rclone-test-werugiq8benu/rclone-sync-test/, notFound
2025/03/15 07:45:48 DEBUG : dst/: Removing directory marker
2025/03/15 07:45:48 DEBUG : dst/: Removing directory marker
    run.go:125: removing dir "dst" failed - try 1/3: removing directory marker failed: googleapi: Error 404: No such object: rclone-test-werugiq8benu/dst/, notFound
2025/03/15 07:45:49 DEBUG : dst/: Removing directory marker
    run.go:125: removing dir "dst" failed - try 2/3: removing directory marker failed: googleapi: Error 404: No such object: rclone-test-werugiq8benu/dst/, notFound
2025/03/15 07:45:50 DEBUG : dst/: Removing directory marker
    run.go:125: removing dir "dst" failed - try 3/3: removing directory marker failed: googleapi: Error 404: No such object: rclone-test-werugiq8benu/dst/, notFound
    run.go:128: removing dir "dst" failed: removing directory marker failed: googleapi: Error 404: No such object: rclone-test-werugiq8benu/dst/, notFound
2025/03/15 07:45:51 DEBUG : CompareDest/: Removing directory marker
    fstest.go:292: Sleeping for 1s for list eventual consistency: 1/3
    fstest.go:292: Sleeping for 2s for list eventual consistency: 2/3
    fstest.go:292: Sleeping for 4s for list eventual consistency: 3/3
    fstest.go:321: 
        	Error Trace:	/home/rclone/go/src/github.com/rclone/rclone/fstest/fstest.go:321
        	            				/home/rclone/go/src/github.com/rclone/rclone/fstest/fstest.go:332
        	            				/home/rclone/go/src/github.com/rclone/rclone/fstest/run.go:173
        	            				/home/rclone/go/src/github.com/rclone/rclone/fstest/run.go:388
        	            				/home/rclone/go/pkg/mod/golang.org/toolchain@v0.0.1-go1.23.0.linux-amd64/src/testing/testing.go:1176
        	            				/home/rclone/go/pkg/mod/golang.org/toolchain@v0.0.1-go1.23.0.linux-amd64/src/testing/testing.go:1354
        	            				/home/rclone/go/pkg/mod/golang.org/toolchain@v0.0.1-go1.23.0.linux-amd64/src/testing/testing.go:1684
        	Error:      	Not equal: 
        	            	expected: []string{}
        	            	actual  : []string{"dst", "rclone-sync-test", "rclone-sync-test-ignore-file", "rclone-sync-test-include", "rclone-sync-test-include/layer2"}
        	            	
        	            	Diff:
        	            	--- Expected
        	            	+++ Actual
        	            	@@ -1,2 +1,7 @@
        	            	-([]string) {
        	            	+([]string) (len=5) {
        	            	+ (string) (len=3) "dst",
        	            	+ (string) (len=16) "rclone-sync-test",
        	            	+ (string) (len=28) "rclone-sync-test-ignore-file",
        	            	+ (string) (len=24) "rclone-sync-test-include",
        	            	+ (string) (len=31) "rclone-sync-test-include/layer2"
        	            	 }
        	Test:       	TestSyncCompareDest
        	Messages:   	directories
--- FAIL: TestSyncCompareDest (30.47s)
=== RUN   TestSyncMultipleCompareDest
    run.go:180: Remote "GCS bucket rclone-test-werugiq8benu", Local "Local file system at /tmp/rclone2533315254", Modify Window "1ns"
2025/03/15 07:45:58 DEBUG : pre-dest1/: Creating directory marker
2025/03/15 07:45:59 DEBUG : pre-dest2/: Creating directory marker
2025/03/15 07:45:59 DEBUG : Creating backend with remote "TestGoogleCloudStorage,directory_markers:rclone-test-werugiq8benu/dest"
2025/03/15 07:45:59 DEBUG : TestGoogleCloudStorage: detected overridden config - adding "{juk_h}" suffix to name
2025/03/15 07:46:00 DEBUG : Creating backend with remote "TestGoogleCloudStorage,directory_markers:rclone-test-werugiq8benu/pre-dest1"
2025/03/15 07:46:00 DEBUG : TestGoogleCloudStorage: detected overridden config - adding "{juk_h}" suffix to name
2025/03/15 07:46:00 DEBUG : fs cache: renaming cache item "TestGoogleCloudStorage,directory_markers:rclone-test-werugiq8benu/pre-dest1" to be canonical "TestGoogleCloudStorage{juk_h}:rclone-test-werugiq8benu/pre-dest1"
2025/03/15 07:46:00 DEBUG : Creating backend with remote "TestGoogleCloudStorage,directory_markers:rclone-test-werugiq8benu/pre-dest2"
2025/03/15 07:46:00 DEBUG : TestGoogleCloudStorage: detected overridden config - adding "{juk_h}" suffix to name
2025/03/15 07:46:01 DEBUG : fs cache: renaming cache item "TestGoogleCloudStorage,directory_markers:rclone-test-werugiq8benu/pre-dest2" to be canonical "TestGoogleCloudStorage{juk_h}:rclone-test-werugiq8benu/pre-dest2"
2025/03/15 07:46:01 DEBUG : 1: Size and modification time the same (differ by 0s, within tolerance 1ns)
2025/03/15 07:46:01 DEBUG : 1: Destination found in --compare-dest, skipping
2025/03/15 07:46:02 DEBUG : 2: Size and modification time the same (differ by 0s, within tolerance 1ns)
2025/03/15 07:46:02 DEBUG : 2: Destination found in --compare-dest, skipping
2025/03/15 07:46:02 DEBUG : 3: Need to transfer - File not found at Destination
2025/03/15 07:46:02 DEBUG : GCS bucket rclone-test-werugiq8benu path dest: Waiting for checks to finish
2025/03/15 07:46:02 DEBUG : GCS bucket rclone-test-werugiq8benu path dest: Waiting for transfers to finish
2025/03/15 07:46:03 DEBUG : /: Creating directory marker
2025/03/15 07:46:03 DEBUG : 3: md5 = eccbc87e4b5ce2fe28308fd9f2a7baf3 OK
2025/03/15 07:46:03 INFO  : 3: Copied (new)
2025/03/15 07:46:03 DEBUG : Waiting for deletions to finish
2025/03/15 07:46:03 DEBUG : rclone-sync-test-include/layer2/: Removing directory marker
    run.go:125: removing dir "rclone-sync-test-include/layer2" failed - try 1/3: removing directory marker failed: googleapi: Error 404: No such object: rclone-test-werugiq8benu/rclone-sync-test-include/layer2/, notFound
2025/03/15 07:46:05 DEBUG : rclone-sync-test-include/layer2/: Removing directory marker
    run.go:125: removing dir "rclone-sync-test-include/layer2" failed - try 2/3: removing directory marker failed: googleapi: Error 404: No such object: rclone-test-werugiq8benu/rclone-sync-test-include/layer2/, notFound
2025/03/15 07:46:06 DEBUG : rclone-sync-test-include/layer2/: Removing directory marker
    run.go:125: removing dir "rclone-sync-test-include/layer2" failed - try 3/3: removing directory marker failed: googleapi: Error 404: No such object: rclone-test-werugiq8benu/rclone-sync-test-include/layer2/, notFound
    run.go:128: removing dir "rclone-sync-test-include/layer2" failed: removing directory marker failed: googleapi: Error 404: No such object: rclone-test-werugiq8benu/rclone-sync-test-include/layer2/, notFound
2025/03/15 07:46:07 DEBUG : rclone-sync-test-include/: Removing directory marker
    run.go:125: removing dir "rclone-sync-test-include" failed - try 1/3: removing directory marker failed: googleapi: Error 404: No such object: rclone-test-werugiq8benu/rclone-sync-test-include/, notFound
2025/03/15 07:46:08 DEBUG : rclone-sync-test-include/: Removing directory marker
    run.go:125: removing dir "rclone-sync-test-include" failed - try 2/3: removing directory marker failed: googleapi: Error 404: No such object: rclone-test-werugiq8benu/rclone-sync-test-include/, notFound
2025/03/15 07:46:09 DEBUG : rclone-sync-test-include/: Removing directory marker
    run.go:125: removing dir "rclone-sync-test-include" failed - try 3/3: removing directory marker failed: googleapi: Error 404: No such object: rclone-test-werugiq8benu/rclone-sync-test-include/, notFound
    run.go:128: removing dir "rclone-sync-test-include" failed: removing directory marker failed: googleapi: Error 404: No such object: rclone-test-werugiq8benu/rclone-sync-test-include/, notFound
2025/03/15 07:46:10 DEBUG : rclone-sync-test-ignore-file/: Removing directory marker
    run.go:125: removing dir "rclone-sync-test-ignore-file" failed - try 1/3: removing directory marker failed: googleapi: Error 404: No such object: rclone-test-werugiq8benu/rclone-sync-test-ignore-file/, notFound
2025/03/15 07:46:11 DEBUG : rclone-sync-test-ignore-file/: Removing directory marker
    run.go:125: removing dir "rclone-sync-test-ignore-file" failed - try 2/3: removing directory marker failed: googleapi: Error 404: No such object: rclone-test-werugiq8benu/rclone-sync-test-ignore-file/, notFound
2025/03/15 07:46:12 DEBUG : rclone-sync-test-ignore-file/: Removing directory marker
    run.go:125: removing dir "rclone-sync-test-ignore-file" failed - try 3/3: removing directory marker failed: googleapi: Error 404: No such object: rclone-test-werugiq8benu/rclone-sync-test-ignore-file/, notFound
    run.go:128: removing dir "rclone-sync-test-ignore-file" failed: removing directory marker failed: googleapi: Error 404: No such object: rclone-test-werugiq8benu/rclone-sync-test-ignore-file/, notFound
2025/03/15 07:46:13 DEBUG : rclone-sync-test/: Removing directory marker
    run.go:125: removing dir "rclone-sync-test" failed - try 1/3: removing directory marker failed: googleapi: Error 404: No such object: rclone-test-werugiq8benu/rclone-sync-test/, notFound
2025/03/15 07:46:14 DEBUG : rclone-sync-test/: Removing directory marker
    run.go:125: removing dir "rclone-sync-test" failed - try 2/3: removing directory marker failed: googleapi: Error 404: No such object: rclone-test-werugiq8benu/rclone-sync-test/, notFound
2025/03/15 07:46:15 DEBUG : rclone-sync-test/: Removing directory marker
    run.go:125: removing dir "rclone-sync-test" failed - try 3/3: removing directory marker failed: googleapi: Error 404: No such object: rclone-test-werugiq8benu/rclone-sync-test/, notFound
    run.go:128: removing dir "rclone-sync-test" failed: removing directory marker failed: googleapi: Error 404: No such object: rclone-test-werugiq8benu/rclone-sync-test/, notFound
2025/03/15 07:46:16 DEBUG : pre-dest2/: Removing directory marker
2025/03/15 07:46:16 DEBUG : pre-dest1/: Removing directory marker
2025/03/15 07:46:16 DEBUG : dst/: Removing directory marker
    run.go:125: removing dir "dst" failed - try 1/3: removing directory marker failed: googleapi: Error 404: No such object: rclone-test-werugiq8benu/dst/, notFound
2025/03/15 07:46:17 DEBUG : dst/: Removing directory marker
    run.go:125: removing dir "dst" failed - try 2/3: removing directory marker failed: googleapi: Error 404: No such object: rclone-test-werugiq8benu/dst/, notFound
2025/03/15 07:46:18 DEBUG : dst/: Removing directory marker
    run.go:125: removing dir "dst" failed - try 3/3: removing directory marker failed: googleapi: Error 404: No such object: rclone-test-werugiq8benu/dst/, notFound
    run.go:128: removing dir "dst" failed: removing directory marker failed: googleapi: Error 404: No such object: rclone-test-werugiq8benu/dst/, notFound
2025/03/15 07:46:19 DEBUG : dest/: Removing directory marker
    run.go:125: removing dir "dest" failed - try 1/3: removing directory marker failed: googleapi: Error 404: No such object: rclone-test-werugiq8benu/dest/, notFound
2025/03/15 07:46:20 DEBUG : dest/: Removing directory marker
    run.go:125: removing dir "dest" failed - try 2/3: removing directory marker failed: googleapi: Error 404: No such object: rclone-test-werugiq8benu/dest/, notFound
2025/03/15 07:46:21 DEBUG : dest/: Removing directory marker
    run.go:125: removing dir "dest" failed - try 3/3: removing directory marker failed: googleapi: Error 404: No such object: rclone-test-werugiq8benu/dest/, notFound
    run.go:128: removing dir "dest" failed: removing directory marker failed: googleapi: Error 404: No such object: rclone-test-werugiq8benu/dest/, notFound
    fstest.go:292: Sleeping for 1s for list eventual consistency: 1/3
    fstest.go:292: Sleeping for 2s for list eventual consistency: 2/3
    fstest.go:292: Sleeping for 4s for list eventual consistency: 3/3
    fstest.go:321: 
        	Error Trace:	/home/rclone/go/src/github.com/rclone/rclone/fstest/fstest.go:321
        	            				/home/rclone/go/src/github.com/rclone/rclone/fstest/fstest.go:332
        	            				/home/rclone/go/src/github.com/rclone/rclone/fstest/run.go:173
        	            				/home/rclone/go/src/github.com/rclone/rclone/fstest/run.go:388
        	            				/home/rclone/go/pkg/mod/golang.org/toolchain@v0.0.1-go1.23.0.linux-amd64/src/testing/testing.go:1176
        	            				/home/rclone/go/pkg/mod/golang.org/toolchain@v0.0.1-go1.23.0.linux-amd64/src/testing/testing.go:1354
        	            				/home/rclone/go/pkg/mod/golang.org/toolchain@v0.0.1-go1.23.0.linux-amd64/src/testing/testing.go:1684
        	            				/home/rclone/go/pkg/mod/golang.org/toolchain@v0.0.1-go1.23.0.linux-amd64/src/runtime/panic.go:785
        	            				/home/rclone/go/pkg/mod/golang.org/toolchain@v0.0.1-go1.23.0.linux-amd64/src/runtime/panic.go:155
        	            				/home/rclone/go/src/github.com/rclone/rclone/backend/googlecloudstorage/googlecloudstorage.go:717
        	            				/home/rclone/go/src/github.com/rclone/rclone/backend/googlecloudstorage/googlecloudstorage.go:850
        	            				/home/rclone/go/src/github.com/rclone/rclone/backend/googlecloudstorage/googlecloudstorage.go:877
        	            				/home/rclone/go/src/github.com/rclone/rclone/fs/walk/walk.go:298
        	            				/home/rclone/go/src/github.com/rclone/rclone/fs/walk/walk.go:162
        	            				/home/rclone/go/src/github.com/rclone/rclone/fs/walk/walk.go:631
        	            				/home/rclone/go/src/github.com/rclone/rclone/fstest/fstest.go:274
        	            				/home/rclone/go/src/github.com/rclone/rclone/fstest/fstest.go:332
        	            				/home/rclone/go/src/github.com/rclone/rclone/fstest/fstest.go:344
        	            				/home/rclone/go/src/github.com/rclone/rclone/fs/sync/sync_test.go:2224
        	Error:      	Not equal: 
        	            	expected: []string{}
        	            	actual  : []string{"dest", "dst", "rclone-sync-test", "rclone-sync-test-ignore-file", "rclone-sync-test-include", "rclone-sync-test-include/layer2"}
        	            	
        	            	Diff:
        	            	--- Expected
        	            	+++ Actual
        	            	@@ -1,2 +1,8 @@
        	            	-([]string) {
        	            	+([]string) (len=6) {
        	            	+ (string) (len=4) "dest",
        	            	+ (string) (len=3) "dst",
        	            	+ (string) (len=16) "rclone-sync-test",
        	            	+ (string) (len=28) "rclone-sync-test-ignore-file",
        	            	+ (string) (len=24) "rclone-sync-test-include",
        	            	+ (string) (len=31) "rclone-sync-test-include/layer2"
        	            	 }
        	Test:       	TestSyncMultipleCompareDest
        	Messages:   	directories
--- FAIL: TestSyncMultipleCompareDest (31.51s)
panic: runtime error: slice bounds out of range [5:4] [recovered]
	panic: runtime error: slice bounds out of range [5:4]

goroutine 1838 [running]:
testing.tRunner.func1.2({0x240ff40, 0xc0005f30e0})
	/home/rclone/go/pkg/mod/golang.org/toolchain@v0.0.1-go1.23.0.linux-amd64/src/testing/testing.go:1632 +0x230
testing.tRunner.func1()
	/home/rclone/go/pkg/mod/golang.org/toolchain@v0.0.1-go1.23.0.linux-amd64/src/testing/testing.go:1635 +0x35e
panic({0x240ff40?, 0xc0005f30e0?})
	/home/rclone/go/pkg/mod/golang.org/toolchain@v0.0.1-go1.23.0.linux-amd64/src/runtime/panic.go:785 +0x132
github.com/rclone/rclone/backend/googlecloudstorage.(*Fs).list(0xc00038ab40, {0x29e8440, 0x3d1a900}, {0xc00096a3e9, 0x18}, {0xc00096a402, 0x4}, {0xc00096a402, 0x4}, 0x0, ...)
	/home/rclone/go/src/github.com/rclone/rclone/backend/googlecloudstorage/googlecloudstorage.go:717 +0xffe
github.com/rclone/rclone/backend/googlecloudstorage.(*Fs).ListR.func1({0xc00096a3e9?, 0x0?}, {0xc00096a402?, 0x47233d?}, {0xc00096a402?, 0x18?}, 0x18?)
	/home/rclone/go/src/github.com/rclone/rclone/backend/googlecloudstorage/googlecloudstorage.go:850 +0x95
github.com/rclone/rclone/backend/googlecloudstorage.(*Fs).ListR(0xc00038ab40, {0x29e8440, 0x3d1a900}, {0x0?, 0x24da380?}, 0xc0005103c0)
	/home/rclone/go/src/github.com/rclone/rclone/backend/googlecloudstorage/googlecloudstorage.go:877 +0x12a
github.com/rclone/rclone/fs/walk.listR({0x29e8440, 0x3d1a900}, {0x29fce00, 0xc00038ab40}, {0x0, 0x0}, 0x1, 0x3, 0xc000a760c0, 0xc000a76420, ...)
	/home/rclone/go/src/github.com/rclone/rclone/fs/walk/walk.go:298 +0x2a3
github.com/rclone/rclone/fs/walk.ListR({0x29e8440, 0x3d1a900}, {0x29fce00, 0xc00038ab40}, {0x0, 0x0}, 0x1, 0xffffffffffffffff, 0x3, 0xc000a760c0)
	/home/rclone/go/src/github.com/rclone/rclone/fs/walk/walk.go:162 +0x1d5
github.com/rclone/rclone/fs/walk.GetAll({0x29e8440, 0x3d1a900}, {0x29fce00, 0xc00038ab40}, {0x0, 0x0}, 0x1, 0xffffffffffffffff)
	/home/rclone/go/src/github.com/rclone/rclone/fs/walk/walk.go:631 +0x105
github.com/rclone/rclone/fstest.CheckListingWithRoot(0xc0000fe000, {0x29fce00, 0xc00038ab40}, {0x0, 0x0}, {0xc0007e62c0, 0x1, 0x1}, {0x0, 0x0, ...}, ...)
	/home/rclone/go/src/github.com/rclone/rclone/fstest/fstest.go:274 +0x3d6
github.com/rclone/rclone/fstest.CheckListingWithPrecision(...)
	/home/rclone/go/src/github.com/rclone/rclone/fstest/fstest.go:332
github.com/rclone/rclone/fstest.CheckItemsWithPrecision(...)
	/home/rclone/go/src/github.com/rclone/rclone/fstest/fstest.go:344
github.com/rclone/rclone/fs/sync.TestSyncMultipleCompareDest(0xc0000fe000)
	/home/rclone/go/src/github.com/rclone/rclone/fs/sync/sync_test.go:2224 +0xa0b
testing.tRunner(0xc0000fe000, 0x270da00)
	/home/rclone/go/pkg/mod/golang.org/toolchain@v0.0.1-go1.23.0.linux-amd64/src/testing/testing.go:1690 +0xf4
created by testing.(*T).Run in goroutine 1
	/home/rclone/go/pkg/mod/golang.org/toolchain@v0.0.1-go1.23.0.linux-amd64/src/testing/testing.go:1743 +0x390
"./sync.test -test.v -test.timeout 1h0m0s -remote 'TestGoogleCloudStorage,directory_markers:' -verbose -test.run '^(TestSyncCompareDest|TestSyncMultipleCompareDest|TestSyncOverlapWithFilter)$'" - Finished ERROR in 7m35.581195554s (try 4/5): exit status 2: Failed [TestSyncOverlapWithFilter TestSyncCompareDest TestSyncMultipleCompareDest]