"./bisync.test -test.v -test.timeout 1h0m0s -remote TestFTPProftpd: -verbose" - Starting (try 1/5)
2025/03/10 08:02:40 DEBUG : Creating backend with remote "TestFTPProftpd:rclone-test-fisawib2baba"
2025/03/10 08:02:40 DEBUG : Using config file from "/home/rclone/.rclone.conf"
2025/03/10 08:02:40 DEBUG : Setting type="ftp" for "TestFTPProftpd" from environment variable RCLONE_CONFIG_TESTFTPPROFTPD_TYPE
2025/03/10 08:02:40 DEBUG : Setting host="172.17.0.7" for "TestFTPProftpd" from environment variable RCLONE_CONFIG_TESTFTPPROFTPD_HOST
2025/03/10 08:02:40 DEBUG : Setting user="rclone" for "TestFTPProftpd" from environment variable RCLONE_CONFIG_TESTFTPPROFTPD_USER
2025/03/10 08:02:40 DEBUG : Setting pass="bs4dtJ-UhrkEMgPbFRZce7u-bc0-y4MG7RBUStGI7KGnLw" for "TestFTPProftpd" from environment variable RCLONE_CONFIG_TESTFTPPROFTPD_PASS
2025/03/10 08:02:40 DEBUG : Setting encoding="Asterisk,Ctl,Dot,Slash" for "TestFTPProftpd" from environment variable RCLONE_CONFIG_TESTFTPPROFTPD_ENCODING
2025/03/10 08:02:40 DEBUG : TestFTPProftpd: detected overridden config - adding "{7UpF6}" suffix to name
2025/03/10 08:02:40 DEBUG : Setting host="172.17.0.7" for "TestFTPProftpd" from environment variable RCLONE_CONFIG_TESTFTPPROFTPD_HOST
2025/03/10 08:02:40 DEBUG : Setting user="rclone" for "TestFTPProftpd" from environment variable RCLONE_CONFIG_TESTFTPPROFTPD_USER
2025/03/10 08:02:40 DEBUG : Setting pass="bs4dtJ-UhrkEMgPbFRZce7u-bc0-y4MG7RBUStGI7KGnLw" for "TestFTPProftpd" from environment variable RCLONE_CONFIG_TESTFTPPROFTPD_PASS
2025/03/10 08:02:40 DEBUG : Setting encoding="Asterisk,Ctl,Dot,Slash" for "TestFTPProftpd" from environment variable RCLONE_CONFIG_TESTFTPPROFTPD_ENCODING
2025/03/10 08:02:40 DEBUG : ftp://172.17.0.7:21/rclone-test-fisawib2baba: Connecting to FTP server
2025/03/10 08:02:40 DEBUG : ftp://172.17.0.7:21/rclone-test-fisawib2baba: dial("tcp","172.17.0.7:21")
2025/03/10 08:02:40 DEBUG : ftp://172.17.0.7:21/rclone-test-fisawib2baba: > dial: conn=*fshttp.timeoutConn, err=<nil>
2025/03/10 08:02:40 DEBUG : Creating backend with remote "/tmp/rclone2217805515"
=== RUN   TestBisyncRemoteLocal
2025/03/10 08:02:40 DEBUG : Creating backend with remote "TestFTPProftpd:rclone-test-diyireg8sena"
2025/03/10 08:02:40 DEBUG : Setting type="ftp" for "TestFTPProftpd" from environment variable RCLONE_CONFIG_TESTFTPPROFTPD_TYPE
2025/03/10 08:02:40 DEBUG : Setting host="172.17.0.7" for "TestFTPProftpd" from environment variable RCLONE_CONFIG_TESTFTPPROFTPD_HOST
2025/03/10 08:02:40 DEBUG : Setting user="rclone" for "TestFTPProftpd" from environment variable RCLONE_CONFIG_TESTFTPPROFTPD_USER
2025/03/10 08:02:40 DEBUG : Setting pass="bs4dtJ-UhrkEMgPbFRZce7u-bc0-y4MG7RBUStGI7KGnLw" for "TestFTPProftpd" from environment variable RCLONE_CONFIG_TESTFTPPROFTPD_PASS
2025/03/10 08:02:40 DEBUG : Setting encoding="Asterisk,Ctl,Dot,Slash" for "TestFTPProftpd" from environment variable RCLONE_CONFIG_TESTFTPPROFTPD_ENCODING
2025/03/10 08:02:40 DEBUG : TestFTPProftpd: detected overridden config - adding "{7UpF6}" suffix to name
2025/03/10 08:02:40 DEBUG : Setting host="172.17.0.7" for "TestFTPProftpd" from environment variable RCLONE_CONFIG_TESTFTPPROFTPD_HOST
2025/03/10 08:02:40 DEBUG : Setting user="rclone" for "TestFTPProftpd" from environment variable RCLONE_CONFIG_TESTFTPPROFTPD_USER
2025/03/10 08:02:40 DEBUG : Setting pass="bs4dtJ-UhrkEMgPbFRZce7u-bc0-y4MG7RBUStGI7KGnLw" for "TestFTPProftpd" from environment variable RCLONE_CONFIG_TESTFTPPROFTPD_PASS
2025/03/10 08:02:40 DEBUG : Setting encoding="Asterisk,Ctl,Dot,Slash" for "TestFTPProftpd" from environment variable RCLONE_CONFIG_TESTFTPPROFTPD_ENCODING
2025/03/10 08:02:40 DEBUG : ftp://172.17.0.7:21/rclone-test-diyireg8sena: Connecting to FTP server
2025/03/10 08:02:40 DEBUG : ftp://172.17.0.7:21/rclone-test-diyireg8sena: dial("tcp","172.17.0.7:21")
2025/03/10 08:02:40 DEBUG : ftp://172.17.0.7:21/rclone-test-diyireg8sena: > dial: conn=*fshttp.timeoutConn, err=<nil>
2025/03/10 08:02:40 NOTICE: remote: TestFTPProftpd:rclone-test-diyireg8sena
=== RUN   TestBisyncRemoteLocal/all_changed
2025/03/10 08:02:40 DEBUG : Creating backend with remote "TestFTPProftpd:rclone-test-diyireg8sena/080240vo"
2025/03/10 08:02:40 DEBUG : Using config file from "/home/rclone/.rclone.conf"
2025/03/10 08:02:40 DEBUG : Setting type="ftp" for "TestFTPProftpd" from environment variable RCLONE_CONFIG_TESTFTPPROFTPD_TYPE
2025/03/10 08:02:40 DEBUG : Setting host="172.17.0.7" for "TestFTPProftpd" from environment variable RCLONE_CONFIG_TESTFTPPROFTPD_HOST
2025/03/10 08:02:40 DEBUG : Setting user="rclone" for "TestFTPProftpd" from environment variable RCLONE_CONFIG_TESTFTPPROFTPD_USER
2025/03/10 08:02:40 DEBUG : Setting pass="bs4dtJ-UhrkEMgPbFRZce7u-bc0-y4MG7RBUStGI7KGnLw" for "TestFTPProftpd" from environment variable RCLONE_CONFIG_TESTFTPPROFTPD_PASS
2025/03/10 08:02:40 DEBUG : Setting encoding="Asterisk,Ctl,Dot,Slash" for "TestFTPProftpd" from environment variable RCLONE_CONFIG_TESTFTPPROFTPD_ENCODING
2025/03/10 08:02:40 DEBUG : TestFTPProftpd: detected overridden config - adding "{7UpF6}" suffix to name
2025/03/10 08:02:40 DEBUG : Setting host="172.17.0.7" for "TestFTPProftpd" from environment variable RCLONE_CONFIG_TESTFTPPROFTPD_HOST
2025/03/10 08:02:40 DEBUG : Setting user="rclone" for "TestFTPProftpd" from environment variable RCLONE_CONFIG_TESTFTPPROFTPD_USER
2025/03/10 08:02:40 DEBUG : Setting pass="bs4dtJ-UhrkEMgPbFRZce7u-bc0-y4MG7RBUStGI7KGnLw" for "TestFTPProftpd" from environment variable RCLONE_CONFIG_TESTFTPPROFTPD_PASS
2025/03/10 08:02:40 DEBUG : Setting encoding="Asterisk,Ctl,Dot,Slash" for "TestFTPProftpd" from environment variable RCLONE_CONFIG_TESTFTPPROFTPD_ENCODING
2025/03/10 08:02:40 DEBUG : ftp://172.17.0.7:21/rclone-test-diyireg8sena/080240vo: Connecting to FTP server
2025/03/10 08:02:40 DEBUG : ftp://172.17.0.7:21/rclone-test-diyireg8sena/080240vo: dial("tcp","172.17.0.7:21")
2025/03/10 08:02:40 DEBUG : ftp://172.17.0.7:21/rclone-test-diyireg8sena/080240vo: > dial: conn=*fshttp.timeoutConn, err=<nil>
2025/03/10 08:02:40 DEBUG : fs cache: renaming cache item "TestFTPProftpd:rclone-test-diyireg8sena/080240vo" to be canonical "TestFTPProftpd{7UpF6}:rclone-test-diyireg8sena/080240vo"
2025/03/10 08:02:40 INFO  : path1: Making directory
2025/03/10 08:02:40 DEBUG : Creating backend with remote "TestFTPProftpd:rclone-test-diyireg8sena/080240vo/all_changed/path1"
2025/03/10 08:02:40 DEBUG : Setting type="ftp" for "TestFTPProftpd" from environment variable RCLONE_CONFIG_TESTFTPPROFTPD_TYPE
2025/03/10 08:02:40 DEBUG : Setting host="172.17.0.7" for "TestFTPProftpd" from environment variable RCLONE_CONFIG_TESTFTPPROFTPD_HOST
2025/03/10 08:02:40 DEBUG : Setting user="rclone" for "TestFTPProftpd" from environment variable RCLONE_CONFIG_TESTFTPPROFTPD_USER
2025/03/10 08:02:40 DEBUG : Setting pass="bs4dtJ-UhrkEMgPbFRZce7u-bc0-y4MG7RBUStGI7KGnLw" for "TestFTPProftpd" from environment variable RCLONE_CONFIG_TESTFTPPROFTPD_PASS
2025/03/10 08:02:40 DEBUG : Setting encoding="Asterisk,Ctl,Dot,Slash" for "TestFTPProftpd" from environment variable RCLONE_CONFIG_TESTFTPPROFTPD_ENCODING
2025/03/10 08:02:40 DEBUG : TestFTPProftpd: detected overridden config - adding "{7UpF6}" suffix to name
2025/03/10 08:02:40 DEBUG : Setting host="172.17.0.7" for "TestFTPProftpd" from environment variable RCLONE_CONFIG_TESTFTPPROFTPD_HOST
2025/03/10 08:02:40 DEBUG : Setting user="rclone" for "TestFTPProftpd" from environment variable RCLONE_CONFIG_TESTFTPPROFTPD_USER
2025/03/10 08:02:40 DEBUG : Setting pass="bs4dtJ-UhrkEMgPbFRZce7u-bc0-y4MG7RBUStGI7KGnLw" for "TestFTPProftpd" from environment variable RCLONE_CONFIG_TESTFTPPROFTPD_PASS
2025/03/10 08:02:40 DEBUG : Setting encoding="Asterisk,Ctl,Dot,Slash" for "TestFTPProftpd" from environment variable RCLONE_CONFIG_TESTFTPPROFTPD_ENCODING
2025/03/10 08:02:40 DEBUG : ftp://172.17.0.7:21/rclone-test-diyireg8sena/080240vo/all_changed/path1: Connecting to FTP server
2025/03/10 08:02:40 DEBUG : ftp://172.17.0.7:21/rclone-test-diyireg8sena/080240vo/all_changed/path1: dial("tcp","172.17.0.7:21")
2025/03/10 08:02:40 DEBUG : ftp://172.17.0.7:21/rclone-test-diyireg8sena/080240vo/all_changed/path1: > dial: conn=*fshttp.timeoutConn, err=<nil>
2025/03/10 08:02:40 DEBUG : fs cache: renaming cache item "TestFTPProftpd:rclone-test-diyireg8sena/080240vo/all_changed/path1" to be canonical "TestFTPProftpd{7UpF6}:rclone-test-diyireg8sena/080240vo/all_changed/path1"
2025/03/10 08:02:40 DEBUG : Creating backend with remote "/tmp/080240vo"
2025/03/10 08:02:40 DEBUG : Creating backend with remote "/tmp/080240vo/all_changed/path2"
2025/03/10 08:02:40 DEBUG : Creating backend with remote "/home/rclone/go/src/github.com/rclone/rclone/cmd/bisync/testdata/test_all_changed/initial"
2025/03/10 08:02:40 DEBUG : Creating backend with remote "/tmp/080240vo/initdir/test_all_changed-bidinup0"
2025/03/10 08:02:40 DEBUG : RCLONE_TEST: Need to transfer - File not found at Destination
2025/03/10 08:02:40 DEBUG : file1.copy1.txt: Need to transfer - File not found at Destination
2025/03/10 08:02:40 DEBUG : file1.copy2.txt: Need to transfer - File not found at Destination
2025/03/10 08:02:40 DEBUG : file1.copy3.txt: Need to transfer - File not found at Destination
2025/03/10 08:02:40 DEBUG : file1.copy4.txt: Need to transfer - File not found at Destination
2025/03/10 08:02:40 DEBUG : file1.copy5.txt: Need to transfer - File not found at Destination
2025/03/10 08:02:40 DEBUG : file1.txt: Need to transfer - File not found at Destination
2025/03/10 08:02:40 DEBUG : subdir: Making directory with metadata
2025/03/10 08:02:40 INFO  : subdir: Made directory with metadata (mtime=2021-11-02T05:00:07Z)
2025/03/10 08:02:40 DEBUG : Added delayed dir = "subdir", newDst=subdir
2025/03/10 08:02:40 DEBUG : subdir/file20.txt: Need to transfer - File not found at Destination
2025/03/10 08:02:40 DEBUG : file1.copy1.txt: md5 = d41d8cd98f00b204e9800998ecf8427e OK
2025/03/10 08:02:40 DEBUG : file1.copy1.txt.5028a97.partial: renamed to: file1.copy1.txt
2025/03/10 08:02:40 INFO  : file1.copy1.txt: Copied (new)
2025/03/10 08:02:40 DEBUG : file1.copy2.txt: md5 = d41d8cd98f00b204e9800998ecf8427e OK
2025/03/10 08:02:40 DEBUG : file1.copy2.txt.5028a97.partial: renamed to: file1.copy2.txt
2025/03/10 08:02:40 INFO  : file1.copy2.txt: Copied (new)
2025/03/10 08:02:40 DEBUG : Local file system at /tmp/080240vo/initdir/test_all_changed-bidinup0: Waiting for checks to finish
2025/03/10 08:02:40 DEBUG : Local file system at /tmp/080240vo/initdir/test_all_changed-bidinup0: Waiting for transfers to finish
2025/03/10 08:02:40 DEBUG : file1.copy3.txt: md5 = d41d8cd98f00b204e9800998ecf8427e OK
2025/03/10 08:02:40 DEBUG : file1.copy3.txt.5028a97.partial: renamed to: file1.copy3.txt
2025/03/10 08:02:40 INFO  : file1.copy3.txt: Copied (new)
2025/03/10 08:02:40 DEBUG : file1.copy5.txt: md5 = d41d8cd98f00b204e9800998ecf8427e OK
2025/03/10 08:02:40 DEBUG : file1.copy5.txt.5028a97.partial: renamed to: file1.copy5.txt
2025/03/10 08:02:40 INFO  : file1.copy5.txt: Copied (new)
2025/03/10 08:02:40 DEBUG : RCLONE_TEST: md5 = 294d25b294ff26a5243dba914ac3fbf7 OK
2025/03/10 08:02:40 DEBUG : RCLONE_TEST.cf9a93ac.partial: renamed to: RCLONE_TEST
2025/03/10 08:02:40 INFO  : RCLONE_TEST: Copied (new)
2025/03/10 08:02:40 DEBUG : file1.copy4.txt: md5 = d41d8cd98f00b204e9800998ecf8427e OK
2025/03/10 08:02:40 DEBUG : file1.copy4.txt.5028a97.partial: renamed to: file1.copy4.txt
2025/03/10 08:02:40 INFO  : file1.copy4.txt: Copied (new)
2025/03/10 08:02:40 DEBUG : subdir/file20.txt: md5 = d41d8cd98f00b204e9800998ecf8427e OK
2025/03/10 08:02:40 DEBUG : file1.txt: md5 = d41d8cd98f00b204e9800998ecf8427e OK
2025/03/10 08:02:40 DEBUG : subdir/file20.txt.5028a97.partial: renamed to: subdir/file20.txt
2025/03/10 08:02:40 INFO  : subdir/file20.txt: Copied (new)
2025/03/10 08:02:40 DEBUG : file1.txt.5028a97.partial: renamed to: file1.txt
2025/03/10 08:02:40 INFO  : file1.txt: Copied (new)
2025/03/10 08:02:40 INFO  : subdir: Set directory modification time (using SetModTime)
2025/03/10 08:02:40 DEBUG : ftp://172.17.0.7:21/rclone-test-diyireg8sena/080240vo/all_changed/path1: dial("tcp","172.17.0.7:61056")
2025/03/10 08:02:40 DEBUG : ftp://172.17.0.7:21/rclone-test-diyireg8sena/080240vo/all_changed/path1: > dial: conn=*fshttp.timeoutConn, err=<nil>
2025/03/10 08:02:40 ERROR : : error listing: directory not found
2025/03/10 08:02:40 ERROR : : error listing: directory not found
2025/03/10 08:02:40 NOTICE: checking initFs Local file system at /tmp/080240vo/initdir/test_all_changed-bidinup0
2025/03/10 08:02:40 DEBUG : ftp://172.17.0.7:21/rclone-test-diyireg8sena/080240vo/all_changed/path1: dial("tcp","172.17.0.7:10264")
2025/03/10 08:02:40 DEBUG : ftp://172.17.0.7:21/rclone-test-diyireg8sena/080240vo/all_changed/path1: > dial: conn=*fshttp.timeoutConn, err=<nil>
2025/03/10 08:02:40 DEBUG : RCLONE_TEST: Need to transfer - File not found at Destination
2025/03/10 08:02:40 DEBUG : file1.copy1.txt: Need to transfer - File not found at Destination
2025/03/10 08:02:40 DEBUG : file1.copy2.txt: Need to transfer - File not found at Destination
2025/03/10 08:02:40 DEBUG : file1.copy3.txt: Need to transfer - File not found at Destination
2025/03/10 08:02:40 DEBUG : file1.copy4.txt: Need to transfer - File not found at Destination
2025/03/10 08:02:40 DEBUG : file1.copy5.txt: Need to transfer - File not found at Destination
2025/03/10 08:02:40 DEBUG : file1.txt: Need to transfer - File not found at Destination
2025/03/10 08:02:40 INFO  : subdir: Making directory
2025/03/10 08:02:40 DEBUG : ftp://172.17.0.7:21/rclone-test-diyireg8sena/080240vo/all_changed/path1: Connecting to FTP server
2025/03/10 08:02:40 DEBUG : ftp://172.17.0.7:21/rclone-test-diyireg8sena/080240vo/all_changed/path1: dial("tcp","172.17.0.7:21")
2025/03/10 08:02:40 DEBUG : ftp://172.17.0.7:21/rclone-test-diyireg8sena/080240vo/all_changed/path1: Connecting to FTP server
2025/03/10 08:02:40 DEBUG : ftp://172.17.0.7:21/rclone-test-diyireg8sena/080240vo/all_changed/path1: > dial: conn=*fshttp.timeoutConn, err=<nil>
2025/03/10 08:02:40 DEBUG : ftp://172.17.0.7:21/rclone-test-diyireg8sena/080240vo/all_changed/path1: Connecting to FTP server
2025/03/10 08:02:40 DEBUG : ftp://172.17.0.7:21/rclone-test-diyireg8sena/080240vo/all_changed/path1: Connecting to FTP server
2025/03/10 08:02:40 DEBUG : subdir/file20.txt: Need to transfer - File not found at Destination
2025/03/10 08:02:40 DEBUG : ftp://172.17.0.7:21/rclone-test-diyireg8sena/080240vo/all_changed/path1: Waiting for checks to finish
2025/03/10 08:02:40 DEBUG : ftp://172.17.0.7:21/rclone-test-diyireg8sena/080240vo/all_changed/path1: Waiting for transfers to finish
2025/03/10 08:02:40 DEBUG : ftp://172.17.0.7:21/rclone-test-diyireg8sena/080240vo/all_changed/path1: dial("tcp","172.17.0.7:7842")
2025/03/10 08:02:40 DEBUG : ftp://172.17.0.7:21/rclone-test-diyireg8sena/080240vo/all_changed/path1: > dial: conn=*fshttp.timeoutConn, err=<nil>
2025/03/10 08:02:40 DEBUG : RCLONE_TEST.cf9a93ac.partial: renamed to: RCLONE_TEST
2025/03/10 08:02:40 INFO  : RCLONE_TEST: Copied (new)
2025/03/10 08:02:40 DEBUG : ftp://172.17.0.7:21/rclone-test-diyireg8sena/080240vo/all_changed/path1: dial("tcp","172.17.0.7:56406")
2025/03/10 08:02:40 DEBUG : ftp://172.17.0.7:21/rclone-test-diyireg8sena/080240vo/all_changed/path1: > dial: conn=*fshttp.timeoutConn, err=<nil>
2025/03/10 08:02:40 DEBUG : ftp://172.17.0.7:21/rclone-test-diyireg8sena/080240vo/all_changed/path1: dial("tcp","172.17.0.7:21")
2025/03/10 08:02:40 DEBUG : ftp://172.17.0.7:21/rclone-test-diyireg8sena/080240vo/all_changed/path1: > dial: conn=*fshttp.timeoutConn, err=<nil>
2025/03/10 08:02:40 DEBUG : file1.copy4.txt.5028a97.partial: renamed to: file1.copy4.txt
2025/03/10 08:02:40 INFO  : file1.copy4.txt: Copied (new)
2025/03/10 08:02:40 DEBUG : ftp://172.17.0.7:21/rclone-test-diyireg8sena/080240vo/all_changed/path1: dial("tcp","172.17.0.7:58897")
2025/03/10 08:02:40 DEBUG : ftp://172.17.0.7:21/rclone-test-diyireg8sena/080240vo/all_changed/path1: > dial: conn=*fshttp.timeoutConn, err=<nil>
2025/03/10 08:02:40 DEBUG : file1.copy5.txt.5028a97.partial: renamed to: file1.copy5.txt
2025/03/10 08:02:40 INFO  : file1.copy5.txt: Copied (new)
2025/03/10 08:02:40 DEBUG : ftp://172.17.0.7:21/rclone-test-diyireg8sena/080240vo/all_changed/path1: dial("tcp","172.17.0.7:18227")
2025/03/10 08:02:40 DEBUG : ftp://172.17.0.7:21/rclone-test-diyireg8sena/080240vo/all_changed/path1: > dial: conn=*fshttp.timeoutConn, err=<nil>
2025/03/10 08:02:40 DEBUG : ftp://172.17.0.7:21/rclone-test-diyireg8sena/080240vo/all_changed/path1: dial("tcp","172.17.0.7:54158")
2025/03/10 08:02:40 DEBUG : ftp://172.17.0.7:21/rclone-test-diyireg8sena/080240vo/all_changed/path1: > dial: conn=*fshttp.timeoutConn, err=<nil>
2025/03/10 08:02:40 DEBUG : file1.txt.5028a97.partial: renamed to: file1.txt
2025/03/10 08:02:40 INFO  : file1.txt: Copied (new)
2025/03/10 08:02:40 DEBUG : ftp://172.17.0.7:21/rclone-test-diyireg8sena/080240vo/all_changed/path1: dial("tcp","172.17.0.7:20702")
2025/03/10 08:02:40 DEBUG : ftp://172.17.0.7:21/rclone-test-diyireg8sena/080240vo/all_changed/path1: > dial: conn=*fshttp.timeoutConn, err=<nil>
2025/03/10 08:02:40 DEBUG : file1.copy1.txt.5028a97.partial: renamed to: file1.copy1.txt
2025/03/10 08:02:40 INFO  : file1.copy1.txt: Copied (new)
2025/03/10 08:02:40 DEBUG : ftp://172.17.0.7:21/rclone-test-diyireg8sena/080240vo/all_changed/path1: dial("tcp","172.17.0.7:21")
2025/03/10 08:02:40 DEBUG : ftp://172.17.0.7:21/rclone-test-diyireg8sena/080240vo/all_changed/path1: > dial: conn=*fshttp.timeoutConn, err=<nil>
2025/03/10 08:02:40 DEBUG : subdir/file20.txt.5028a97.partial: renamed to: subdir/file20.txt
2025/03/10 08:02:40 INFO  : subdir/file20.txt: Copied (new)
2025/03/10 08:02:40 DEBUG : ftp://172.17.0.7:21/rclone-test-diyireg8sena/080240vo/all_changed/path1: dial("tcp","172.17.0.7:32775")
2025/03/10 08:02:40 DEBUG : ftp://172.17.0.7:21/rclone-test-diyireg8sena/080240vo/all_changed/path1: > dial: conn=*fshttp.timeoutConn, err=<nil>
2025/03/10 08:02:40 DEBUG : file1.copy2.txt.5028a97.partial: renamed to: file1.copy2.txt
2025/03/10 08:02:40 INFO  : file1.copy2.txt: Copied (new)
2025/03/10 08:02:40 DEBUG : ftp://172.17.0.7:21/rclone-test-diyireg8sena/080240vo/all_changed/path1: dial("tcp","172.17.0.7:21")
2025/03/10 08:02:40 DEBUG : ftp://172.17.0.7:21/rclone-test-diyireg8sena/080240vo/all_changed/path1: > dial: conn=*fshttp.timeoutConn, err=<nil>
2025/03/10 08:02:40 DEBUG : ftp://172.17.0.7:21/rclone-test-diyireg8sena/080240vo/all_changed/path1: dial("tcp","172.17.0.7:18737")
2025/03/10 08:02:40 DEBUG : ftp://172.17.0.7:21/rclone-test-diyireg8sena/080240vo/all_changed/path1: > dial: conn=*fshttp.timeoutConn, err=<nil>
2025/03/10 08:02:40 DEBUG : file1.copy3.txt.5028a97.partial: renamed to: file1.copy3.txt
2025/03/10 08:02:40 INFO  : file1.copy3.txt: Copied (new)
2025/03/10 08:02:40 NOTICE: checking Path1 ftp://172.17.0.7:21/rclone-test-diyireg8sena/080240vo/all_changed/path1
2025/03/10 08:02:40 DEBUG : ftp://172.17.0.7:21/rclone-test-diyireg8sena/080240vo/all_changed/path1: dial("tcp","172.17.0.7:6054")
2025/03/10 08:02:40 DEBUG : ftp://172.17.0.7:21/rclone-test-diyireg8sena/080240vo/all_changed/path1: > dial: conn=*fshttp.timeoutConn, err=<nil>
2025/03/10 08:02:40 DEBUG : ftp://172.17.0.7:21/rclone-test-diyireg8sena/080240vo/all_changed/path1: dial("tcp","172.17.0.7:23842")
2025/03/10 08:02:40 DEBUG : ftp://172.17.0.7:21/rclone-test-diyireg8sena/080240vo/all_changed/path1: > dial: conn=*fshttp.timeoutConn, err=<nil>
2025/03/10 08:02:40 DEBUG : RCLONE_TEST: Need to transfer - File not found at Destination
2025/03/10 08:02:40 DEBUG : file1.copy1.txt: Need to transfer - File not found at Destination
2025/03/10 08:02:40 DEBUG : file1.copy2.txt: Need to transfer - File not found at Destination
2025/03/10 08:02:40 DEBUG : file1.copy3.txt: Need to transfer - File not found at Destination
2025/03/10 08:02:40 DEBUG : file1.copy4.txt: Need to transfer - File not found at Destination
2025/03/10 08:02:40 DEBUG : file1.copy5.txt: Need to transfer - File not found at Destination
2025/03/10 08:02:40 DEBUG : file1.txt: Need to transfer - File not found at Destination
2025/03/10 08:02:40 DEBUG : subdir: Making directory with metadata
2025/03/10 08:02:40 INFO  : subdir: Made directory with metadata (mtime=2021-11-02T05:00:07Z)
2025/03/10 08:02:40 DEBUG : Added delayed dir = "subdir", newDst=subdir
2025/03/10 08:02:40 DEBUG : subdir/file20.txt: Need to transfer - File not found at Destination
2025/03/10 08:02:40 DEBUG : RCLONE_TEST: md5 = 294d25b294ff26a5243dba914ac3fbf7 OK
2025/03/10 08:02:40 DEBUG : RCLONE_TEST.cf9a93ac.partial: renamed to: RCLONE_TEST
2025/03/10 08:02:40 DEBUG : Local file system at /tmp/080240vo/all_changed/path2: Waiting for checks to finish
2025/03/10 08:02:40 INFO  : RCLONE_TEST: Copied (new)
2025/03/10 08:02:40 DEBUG : file1.copy1.txt: md5 = d41d8cd98f00b204e9800998ecf8427e OK
2025/03/10 08:02:40 DEBUG : file1.copy1.txt.5028a97.partial: renamed to: file1.copy1.txt
2025/03/10 08:02:40 INFO  : file1.copy1.txt: Copied (new)
2025/03/10 08:02:40 DEBUG : file1.copy2.txt: md5 = d41d8cd98f00b204e9800998ecf8427e OK
2025/03/10 08:02:40 DEBUG : file1.copy2.txt.5028a97.partial: renamed to: file1.copy2.txt
2025/03/10 08:02:40 INFO  : file1.copy2.txt: Copied (new)
2025/03/10 08:02:40 DEBUG : file1.copy4.txt: md5 = d41d8cd98f00b204e9800998ecf8427e OK
2025/03/10 08:02:40 DEBUG : file1.copy4.txt.5028a97.partial: renamed to: file1.copy4.txt
2025/03/10 08:02:40 INFO  : file1.copy4.txt: Copied (new)
2025/03/10 08:02:40 DEBUG : file1.copy3.txt: md5 = d41d8cd98f00b204e9800998ecf8427e OK
2025/03/10 08:02:40 DEBUG : Local file system at /tmp/080240vo/all_changed/path2: Waiting for transfers to finish
2025/03/10 08:02:40 DEBUG : file1.copy3.txt.5028a97.partial: renamed to: file1.copy3.txt
2025/03/10 08:02:40 INFO  : file1.copy3.txt: Copied (new)
2025/03/10 08:02:40 DEBUG : file1.copy5.txt: md5 = d41d8cd98f00b204e9800998ecf8427e OK
2025/03/10 08:02:40 DEBUG : file1.copy5.txt.5028a97.partial: renamed to: file1.copy5.txt
2025/03/10 08:02:40 INFO  : file1.copy5.txt: Copied (new)
2025/03/10 08:02:40 DEBUG : subdir/file20.txt: md5 = d41d8cd98f00b204e9800998ecf8427e OK
2025/03/10 08:02:40 DEBUG : subdir/file20.txt.5028a97.partial: renamed to: subdir/file20.txt
2025/03/10 08:02:40 INFO  : subdir/file20.txt: Copied (new)
2025/03/10 08:02:40 DEBUG : file1.txt: md5 = d41d8cd98f00b204e9800998ecf8427e OK
2025/03/10 08:02:40 DEBUG : file1.txt.5028a97.partial: renamed to: file1.txt
2025/03/10 08:02:40 INFO  : file1.txt: Copied (new)
2025/03/10 08:02:40 INFO  : subdir: Set directory modification time (using SetModTime)
2025/03/10 08:02:40 NOTICE: checking path2 Local file system at /tmp/080240vo/all_changed/path2
2025/03/10 08:02:40 NOTICE: (01)  : test all-changed
2025/03/10 08:02:40 NOTICE: (02)  : test initial bisync
2025/03/10 08:02:40 NOTICE: (03)  : bisync resync
2025/03/10 08:02:40 INFO  : subdir: Set directory modification time (using SetModTime)
2025/03/10 08:02:40 INFO  : Setting --ignore-listing-checksum as neither --checksum nor --compare checksum are set.
2025/03/10 08:02:40 INFO  : Bisyncing with Comparison Settings: 
{
	"Modtime": true,
	"Size": true,
	"Checksum": false,
	"HashType1": 0,
	"HashType2": 0,
	"NoSlowHash": false,
	"SlowHashSyncOnly": false,
	"SlowHashDetected": true,
	"DownloadHash": false
}
2025/03/10 08:02:40 INFO  : Synching Path1 "TestFTPProftpd{7UpF6}:rclone-test-diyireg8sena/080240vo/all_changed/path1/" with Path2 "/tmp/080240vo/all_changed/path2/"
2025/03/10 08:02:40 INFO  : Copying Path2 files to Path1
2025/03/10 08:02:40 INFO  : - Path2    Resync is copying files to         - Path1
2025/03/10 08:02:40 INFO  : - Path1    Resync is copying files to         - Path2
2025/03/10 08:02:40 INFO  : subdir: Set directory modification time (using SetModTime)
2025/03/10 08:02:40 INFO  : Resync updating listings
2025/03/10 08:02:40 INFO  : Validating listings for Path1 "TestFTPProftpd{7UpF6}:rclone-test-diyireg8sena/080240vo/all_changed/path1/" vs Path2 "/tmp/080240vo/all_changed/path2/"
2025/03/10 08:02:40 INFO  : Bisync successful
2025/03/10 08:02:40 NOTICE: (04)  : test change timestamp on all files except RCLONE_TEST
2025/03/10 08:02:40 NOTICE: (05)  : touch-glob 2005-01-02 TestFTPProftpd,encoding='Asterisk,Ctl,Dot,Slash',host='172.17.0.7',pass='bs4dtJ-UhrkEMgPbFRZce7u-bc0-y4MG7RBUStGI7KGnLw',user='rclone':rclone-test-diyireg8sena/080240vo/all_changed/path1/ file*
2025/03/10 08:02:40 NOTICE: (06)  : touch-glob 2005-01-02 TestFTPProftpd,encoding='Asterisk,Ctl,Dot,Slash',host='172.17.0.7',pass='bs4dtJ-UhrkEMgPbFRZce7u-bc0-y4MG7RBUStGI7KGnLw',user='rclone':rclone-test-diyireg8sena/080240vo/all_changed/path1/subdir file*
2025/03/10 08:02:40 NOTICE: (07)  : test sync should pass
2025/03/10 08:02:40 NOTICE: (08)  : bisync
2025/03/10 08:02:40 INFO  : subdir: Set directory modification time (using SetModTime)
2025/03/10 08:02:40 INFO  : Setting --ignore-listing-checksum as neither --checksum nor --compare checksum are set.
2025/03/10 08:02:40 INFO  : Bisyncing with Comparison Settings: 
{
	"Modtime": true,
	"Size": true,
	"Checksum": false,
	"HashType1": 0,
	"HashType2": 0,
	"NoSlowHash": false,
	"SlowHashSyncOnly": false,
	"SlowHashDetected": true,
	"DownloadHash": false
}
2025/03/10 08:02:40 INFO  : Synching Path1 "TestFTPProftpd{7UpF6}:rclone-test-diyireg8sena/080240vo/all_changed/path1/" with Path2 "/tmp/080240vo/all_changed/path2/"
2025/03/10 08:02:40 INFO  : Building Path1 and Path2 listings
2025/03/10 08:02:40 INFO  : Path1 checking for diffs
2025/03/10 08:02:40 INFO  : - Path1    File changed: time (newer) - file1.copy1.txt
2025/03/10 08:02:40 INFO  : - Path1    File changed: time (newer) - file1.copy2.txt
2025/03/10 08:02:40 INFO  : - Path1    File changed: time (newer) - file1.copy3.txt
2025/03/10 08:02:40 INFO  : - Path1    File changed: time (newer) - file1.copy4.txt
2025/03/10 08:02:40 INFO  : - Path1    File changed: time (newer) - file1.copy5.txt
2025/03/10 08:02:40 INFO  : - Path1    File changed: time (newer) - file1.txt
2025/03/10 08:02:40 INFO  : - Path1    File changed: time (newer) - subdir/file20.txt
2025/03/10 08:02:40 INFO  : Path1:    7 changes:    0 new,    7 modified,    0 deleted
2025/03/10 08:02:40 INFO  : (Modified:    7 newer,    0 older)
2025/03/10 08:02:40 INFO  : Path2 checking for diffs
2025/03/10 08:02:40 INFO  : Applying changes
2025/03/10 08:02:40 INFO  : - Path1    Queue copy to Path2       - /tmp/080240vo/all_changed/path2/file1.copy1.txt
2025/03/10 08:02:40 INFO  : - Path1    Queue copy to Path2       - /tmp/080240vo/all_changed/path2/file1.copy2.txt
2025/03/10 08:02:40 INFO  : - Path1    Queue copy to Path2       - /tmp/080240vo/all_changed/path2/file1.copy3.txt
2025/03/10 08:02:40 INFO  : - Path1    Queue copy to Path2       - /tmp/080240vo/all_changed/path2/file1.copy4.txt
2025/03/10 08:02:40 INFO  : - Path1    Queue copy to Path2       - /tmp/080240vo/all_changed/path2/file1.copy5.txt
2025/03/10 08:02:40 INFO  : - Path1    Queue copy to Path2       - /tmp/080240vo/all_changed/path2/file1.txt
2025/03/10 08:02:40 INFO  : - Path1    Queue copy to Path2       - /tmp/080240vo/all_changed/path2/subdir/file20.txt
2025/03/10 08:02:40 INFO  : - Path1    Do queued copies to                - Path2
2025/03/10 08:02:40 INFO  : subdir: Set directory modification time (using SetModTime)
2025/03/10 08:02:40 INFO  : file1.copy4.txt: Copied (replaced existing)
2025/03/10 08:02:40 INFO  : file1.copy3.txt: Copied (replaced existing)
2025/03/10 08:02:40 INFO  : file1.copy2.txt: Copied (replaced existing)
2025/03/10 08:02:40 INFO  : file1.copy5.txt: Copied (replaced existing)
2025/03/10 08:02:40 INFO  : file1.txt: Copied (replaced existing)
2025/03/10 08:02:40 INFO  : file1.copy1.txt: Copied (replaced existing)
2025/03/10 08:02:40 INFO  : subdir/file20.txt: Copied (replaced existing)
2025/03/10 08:02:40 INFO  : subdir: Set directory modification time (using SetModTime)
2025/03/10 08:02:40 INFO  : Updating listings
2025/03/10 08:02:40 INFO  : Validating listings for Path1 "TestFTPProftpd{7UpF6}:rclone-test-diyireg8sena/080240vo/all_changed/path1/" vs Path2 "/tmp/080240vo/all_changed/path2/"
2025/03/10 08:02:40 INFO  : Bisync successful
2025/03/10 08:02:40 NOTICE: (09)  : test change timestamp on all files including RCLONE_TEST
2025/03/10 08:02:40 NOTICE: (10)  : touch-glob 2004-01-02 TestFTPProftpd,encoding='Asterisk,Ctl,Dot,Slash',host='172.17.0.7',pass='bs4dtJ-UhrkEMgPbFRZce7u-bc0-y4MG7RBUStGI7KGnLw',user='rclone':rclone-test-diyireg8sena/080240vo/all_changed/path1/ *
2025/03/10 08:02:40 NOTICE: (11)  : touch-glob 2004-01-02 TestFTPProftpd,encoding='Asterisk,Ctl,Dot,Slash',host='172.17.0.7',pass='bs4dtJ-UhrkEMgPbFRZce7u-bc0-y4MG7RBUStGI7KGnLw',user='rclone':rclone-test-diyireg8sena/080240vo/all_changed/path1/subdir *
2025/03/10 08:02:40 NOTICE: (12)  : test sync should fail
2025/03/10 08:02:40 NOTICE: (13)  : bisync
2025/03/10 08:02:40 INFO  : subdir: Set directory modification time (using SetModTime)
2025/03/10 08:02:40 INFO  : Setting --ignore-listing-checksum as neither --checksum nor --compare checksum are set.
2025/03/10 08:02:40 INFO  : Bisyncing with Comparison Settings: 
{
	"Modtime": true,
	"Size": true,
	"Checksum": false,
	"HashType1": 0,
	"HashType2": 0,
	"NoSlowHash": false,
	"SlowHashSyncOnly": false,
	"SlowHashDetected": true,
	"DownloadHash": false
}
2025/03/10 08:02:40 INFO  : Synching Path1 "TestFTPProftpd{7UpF6}:rclone-test-diyireg8sena/080240vo/all_changed/path1/" with Path2 "/tmp/080240vo/all_changed/path2/"
2025/03/10 08:02:40 INFO  : Building Path1 and Path2 listings
2025/03/10 08:02:40 INFO  : Path1 checking for diffs
2025/03/10 08:02:40 INFO  : - Path1    File changed: time (newer) - RCLONE_TEST
2025/03/10 08:02:40 INFO  : - Path1    File changed: time (older) - file1.copy1.txt
2025/03/10 08:02:40 INFO  : - Path1    File changed: time (older) - file1.copy2.txt
2025/03/10 08:02:40 INFO  : - Path1    File changed: time (older) - file1.copy3.txt
2025/03/10 08:02:40 INFO  : - Path1    File changed: time (older) - file1.copy4.txt
2025/03/10 08:02:40 INFO  : - Path1    File changed: time (older) - file1.copy5.txt
2025/03/10 08:02:40 INFO  : - Path1    File changed: time (older) - file1.txt
2025/03/10 08:02:40 INFO  : - Path1    File changed: time (older) - subdir/file20.txt
2025/03/10 08:02:40 INFO  : Path1:    8 changes:    0 new,    8 modified,    0 deleted
2025/03/10 08:02:40 INFO  : (Modified:    1 newer,    7 older)
2025/03/10 08:02:40 INFO  : Path2 checking for diffs
2025/03/10 08:02:40 ERROR : Safety abort: all files were changed on Path1 "TestFTPProftpd{7UpF6}:rclone-test-diyireg8sena/080240vo/all_changed/path1/". Run with --force if desired.
2025/03/10 08:02:40 NOTICE: Bisync aborted. Please try again.
2025/03/10 08:02:40 NOTICE: Bisync error: all files were changed
2025/03/10 08:02:40 NOTICE: (14)  : test sync with force should pass
2025/03/10 08:02:40 NOTICE: (15)  : bisync force
2025/03/10 08:02:40 INFO  : subdir: Set directory modification time (using SetModTime)
2025/03/10 08:02:40 INFO  : Setting --ignore-listing-checksum as neither --checksum nor --compare checksum are set.
2025/03/10 08:02:40 INFO  : Bisyncing with Comparison Settings: 
{
	"Modtime": true,
	"Size": true,
	"Checksum": false,
	"HashType1": 0,
	"HashType2": 0,
	"NoSlowHash": false,
	"SlowHashSyncOnly": false,
	"SlowHashDetected": true,
	"DownloadHash": false
}
2025/03/10 08:02:40 INFO  : Synching Path1 "TestFTPProftpd{7UpF6}:rclone-test-diyireg8sena/080240vo/all_changed/path1/" with Path2 "/tmp/080240vo/all_changed/path2/"
2025/03/10 08:02:40 INFO  : Building Path1 and Path2 listings
2025/03/10 08:02:40 INFO  : Path1 checking for diffs
2025/03/10 08:02:40 INFO  : - Path1    File changed: time (newer) - RCLONE_TEST
2025/03/10 08:02:40 INFO  : - Path1    File changed: time (older) - file1.copy1.txt
2025/03/10 08:02:40 INFO  : - Path1    File changed: time (older) - file1.copy2.txt
2025/03/10 08:02:40 INFO  : - Path1    File changed: time (older) - file1.copy3.txt
2025/03/10 08:02:40 INFO  : - Path1    File changed: time (older) - file1.copy4.txt
2025/03/10 08:02:40 INFO  : - Path1    File changed: time (older) - file1.copy5.txt
2025/03/10 08:02:40 INFO  : - Path1    File changed: time (older) - file1.txt
2025/03/10 08:02:40 INFO  : - Path1    File changed: time (older) - subdir/file20.txt
2025/03/10 08:02:40 INFO  : Path1:    8 changes:    0 new,    8 modified,    0 deleted
2025/03/10 08:02:40 INFO  : (Modified:    1 newer,    7 older)
2025/03/10 08:02:40 INFO  : Path2 checking for diffs
2025/03/10 08:02:40 INFO  : Applying changes
2025/03/10 08:02:40 INFO  : - Path1    Queue copy to Path2       - /tmp/080240vo/all_changed/path2/RCLONE_TEST
2025/03/10 08:02:40 INFO  : - Path1    Queue copy to Path2       - /tmp/080240vo/all_changed/path2/file1.copy1.txt
2025/03/10 08:02:40 INFO  : - Path1    Queue copy to Path2       - /tmp/080240vo/all_changed/path2/file1.copy2.txt
2025/03/10 08:02:40 INFO  : - Path1    Queue copy to Path2       - /tmp/080240vo/all_changed/path2/file1.copy3.txt
2025/03/10 08:02:40 INFO  : - Path1    Queue copy to Path2       - /tmp/080240vo/all_changed/path2/file1.copy4.txt
2025/03/10 08:02:40 INFO  : - Path1    Queue copy to Path2       - /tmp/080240vo/all_changed/path2/file1.copy5.txt
2025/03/10 08:02:40 INFO  : - Path1    Queue copy to Path2       - /tmp/080240vo/all_changed/path2/file1.txt
2025/03/10 08:02:40 INFO  : - Path1    Queue copy to Path2       - /tmp/080240vo/all_changed/path2/subdir/file20.txt
2025/03/10 08:02:40 INFO  : - Path1    Do queued copies to                - Path2
2025/03/10 08:02:40 INFO  : subdir: Set directory modification time (using SetModTime)
2025/03/10 08:02:40 INFO  : file1.copy4.txt: Copied (replaced existing)
2025/03/10 08:02:40 INFO  : RCLONE_TEST: Copied (replaced existing)
2025/03/10 08:02:40 INFO  : file1.copy1.txt: Copied (replaced existing)
2025/03/10 08:02:40 INFO  : file1.copy2.txt: Copied (replaced existing)
2025/03/10 08:02:40 INFO  : file1.copy5.txt: Copied (replaced existing)
2025/03/10 08:02:40 INFO  : file1.copy3.txt: Copied (replaced existing)
2025/03/10 08:02:40 INFO  : file1.txt: Copied (replaced existing)
2025/03/10 08:02:40 INFO  : subdir/file20.txt: Copied (replaced existing)
2025/03/10 08:02:40 INFO  : subdir: Set directory modification time (using SetModTime)
2025/03/10 08:02:40 INFO  : Updating listings
2025/03/10 08:02:40 INFO  : Validating listings for Path1 "TestFTPProftpd{7UpF6}:rclone-test-diyireg8sena/080240vo/all_changed/path1/" vs Path2 "/tmp/080240vo/all_changed/path2/"
2025/03/10 08:02:40 INFO  : Bisync successful
    bisync_test.go:560: TEST all_changed PASSED
=== RUN   TestBisyncRemoteLocal/backupdir
2025/03/10 08:02:40 DEBUG : fs cache: switching user supplied name "TestFTPProftpd:rclone-test-diyireg8sena/080240vo" for canonical name "TestFTPProftpd{7UpF6}:rclone-test-diyireg8sena/080240vo"
2025/03/10 08:02:40 INFO  : path1: Making directory
2025/03/10 08:02:40 DEBUG : Creating backend with remote "TestFTPProftpd:rclone-test-diyireg8sena/080240vo/backupdir/path1"
2025/03/10 08:02:40 DEBUG : Setting type="ftp" for "TestFTPProftpd" from environment variable RCLONE_CONFIG_TESTFTPPROFTPD_TYPE
2025/03/10 08:02:40 DEBUG : Setting host="172.17.0.7" for "TestFTPProftpd" from environment variable RCLONE_CONFIG_TESTFTPPROFTPD_HOST
2025/03/10 08:02:40 DEBUG : Setting user="rclone" for "TestFTPProftpd" from environment variable RCLONE_CONFIG_TESTFTPPROFTPD_USER
2025/03/10 08:02:40 DEBUG : Setting pass="bs4dtJ-UhrkEMgPbFRZce7u-bc0-y4MG7RBUStGI7KGnLw" for "TestFTPProftpd" from environment variable RCLONE_CONFIG_TESTFTPPROFTPD_PASS
2025/03/10 08:02:40 DEBUG : Setting encoding="Asterisk,Ctl,Dot,Slash" for "TestFTPProftpd" from environment variable RCLONE_CONFIG_TESTFTPPROFTPD_ENCODING
2025/03/10 08:02:40 DEBUG : TestFTPProftpd: detected overridden config - adding "{7UpF6}" suffix to name
2025/03/10 08:02:40 DEBUG : Setting host="172.17.0.7" for "TestFTPProftpd" from environment variable RCLONE_CONFIG_TESTFTPPROFTPD_HOST
2025/03/10 08:02:40 DEBUG : Setting user="rclone" for "TestFTPProftpd" from environment variable RCLONE_CONFIG_TESTFTPPROFTPD_USER
2025/03/10 08:02:40 DEBUG : Setting pass="bs4dtJ-UhrkEMgPbFRZce7u-bc0-y4MG7RBUStGI7KGnLw" for "TestFTPProftpd" from environment variable RCLONE_CONFIG_TESTFTPPROFTPD_PASS
2025/03/10 08:02:40 DEBUG : Setting encoding="Asterisk,Ctl,Dot,Slash" for "TestFTPProftpd" from environment variable RCLONE_CONFIG_TESTFTPPROFTPD_ENCODING
2025/03/10 08:02:40 DEBUG : ftp://172.17.0.7:21/rclone-test-diyireg8sena/080240vo/backupdir/path1: Connecting to FTP server
2025/03/10 08:02:40 DEBUG : ftp://172.17.0.7:21/rclone-test-diyireg8sena/080240vo/backupdir/path1: dial("tcp","172.17.0.7:21")
2025/03/10 08:02:40 DEBUG : ftp://172.17.0.7:21/rclone-test-diyireg8sena/080240vo/backupdir/path1: > dial: conn=*fshttp.timeoutConn, err=<nil>
2025/03/10 08:02:40 DEBUG : fs cache: renaming cache item "TestFTPProftpd:rclone-test-diyireg8sena/080240vo/backupdir/path1" to be canonical "TestFTPProftpd{7UpF6}:rclone-test-diyireg8sena/080240vo/backupdir/path1"
2025/03/10 08:02:40 DEBUG : Creating backend with remote "/tmp/080240vo/backupdir/path2"
2025/03/10 08:02:40 DEBUG : Creating backend with remote "/home/rclone/go/src/github.com/rclone/rclone/cmd/bisync/testdata/test_backupdir/initial"
2025/03/10 08:02:40 DEBUG : Creating backend with remote "/tmp/080240vo/initdir/test_backupdir-yobomot4"
2025/03/10 08:02:40 DEBUG : RCLONE_TEST: Need to transfer - File not found at Destination
2025/03/10 08:02:40 DEBUG : file1.txt: Need to transfer - File not found at Destination
2025/03/10 08:02:40 DEBUG : file2.txt: Need to transfer - File not found at Destination
2025/03/10 08:02:40 DEBUG : file3.txt: Need to transfer - File not found at Destination
2025/03/10 08:02:40 DEBUG : file4.txt: Need to transfer - File not found at Destination
2025/03/10 08:02:40 DEBUG : file5.txt: Need to transfer - File not found at Destination
2025/03/10 08:02:40 DEBUG : file6.txt: Need to transfer - File not found at Destination
2025/03/10 08:02:40 DEBUG : file7.txt: Need to transfer - File not found at Destination
2025/03/10 08:02:40 DEBUG : file8.txt: Need to transfer - File not found at Destination
2025/03/10 08:02:40 DEBUG : Local file system at /tmp/080240vo/initdir/test_backupdir-yobomot4: Waiting for checks to finish
2025/03/10 08:02:40 DEBUG : Local file system at /tmp/080240vo/initdir/test_backupdir-yobomot4: Waiting for transfers to finish
2025/03/10 08:02:40 DEBUG : file1.txt: md5 = d41d8cd98f00b204e9800998ecf8427e OK
2025/03/10 08:02:40 DEBUG : file1.txt.5028a97.partial: renamed to: file1.txt
2025/03/10 08:02:40 INFO  : file1.txt: Copied (new)
2025/03/10 08:02:40 DEBUG : file2.txt: md5 = d41d8cd98f00b204e9800998ecf8427e OK
2025/03/10 08:02:40 DEBUG : file3.txt: md5 = d41d8cd98f00b204e9800998ecf8427e OK
2025/03/10 08:02:40 DEBUG : file2.txt.5028a97.partial: renamed to: file2.txt
2025/03/10 08:02:40 INFO  : file2.txt: Copied (new)
2025/03/10 08:02:40 DEBUG : file3.txt.5028a97.partial: renamed to: file3.txt
2025/03/10 08:02:40 INFO  : file3.txt: Copied (new)
2025/03/10 08:02:40 DEBUG : file4.txt: md5 = d41d8cd98f00b204e9800998ecf8427e OK
2025/03/10 08:02:40 DEBUG : file4.txt.5028a97.partial: renamed to: file4.txt
2025/03/10 08:02:40 INFO  : file4.txt: Copied (new)
2025/03/10 08:02:40 DEBUG : file5.txt: md5 = d41d8cd98f00b204e9800998ecf8427e OK
2025/03/10 08:02:40 DEBUG : file5.txt.5028a97.partial: renamed to: file5.txt
2025/03/10 08:02:40 INFO  : file5.txt: Copied (new)
2025/03/10 08:02:40 DEBUG : file6.txt: md5 = d41d8cd98f00b204e9800998ecf8427e OK
2025/03/10 08:02:40 DEBUG : file7.txt: md5 = d41d8cd98f00b204e9800998ecf8427e OK
2025/03/10 08:02:40 DEBUG : file6.txt.5028a97.partial: renamed to: file6.txt
2025/03/10 08:02:40 INFO  : file6.txt: Copied (new)
2025/03/10 08:02:40 DEBUG : file7.txt.5028a97.partial: renamed to: file7.txt
2025/03/10 08:02:40 INFO  : file7.txt: Copied (new)
2025/03/10 08:02:40 DEBUG : RCLONE_TEST: md5 = 294d25b294ff26a5243dba914ac3fbf7 OK
2025/03/10 08:02:40 DEBUG : RCLONE_TEST.cf9a93ac.partial: renamed to: RCLONE_TEST
2025/03/10 08:02:40 INFO  : RCLONE_TEST: Copied (new)
2025/03/10 08:02:40 DEBUG : file8.txt: md5 = d41d8cd98f00b204e9800998ecf8427e OK
2025/03/10 08:02:40 DEBUG : file8.txt.5028a97.partial: renamed to: file8.txt
2025/03/10 08:02:40 INFO  : file8.txt: Copied (new)
2025/03/10 08:02:40 DEBUG : Creating backend with remote "/home/rclone/go/src/github.com/rclone/rclone/cmd/bisync/testdata/test_backupdir/modfiles"
2025/03/10 08:02:40 DEBUG : Creating backend with remote "/tmp/080240vo/datadir/test_backupdir-mikobob7"
2025/03/10 08:02:40 DEBUG : file1.txt: Need to transfer - File not found at Destination
2025/03/10 08:02:40 DEBUG : file10.txt: Need to transfer - File not found at Destination
2025/03/10 08:02:40 DEBUG : file11.txt: Need to transfer - File not found at Destination
2025/03/10 08:02:40 DEBUG : file2.txt: Need to transfer - File not found at Destination
2025/03/10 08:02:40 DEBUG : file5L.txt: Need to transfer - File not found at Destination
2025/03/10 08:02:40 DEBUG : file5R.txt: Need to transfer - File not found at Destination
2025/03/10 08:02:40 DEBUG : file6.txt: Need to transfer - File not found at Destination
2025/03/10 08:02:40 DEBUG : file7.txt: Need to transfer - File not found at Destination
2025/03/10 08:02:40 DEBUG : Local file system at /tmp/080240vo/datadir/test_backupdir-mikobob7: Waiting for checks to finish
2025/03/10 08:02:40 DEBUG : Local file system at /tmp/080240vo/datadir/test_backupdir-mikobob7: Waiting for transfers to finish
2025/03/10 08:02:40 DEBUG : file10.txt: md5 = 7fe98ed88552b828777d8630900346b8 OK
2025/03/10 08:02:40 DEBUG : file2.txt: md5 = fb3ecfb2800400fb01b0bfd39903e9fb OK
2025/03/10 08:02:40 DEBUG : file10.txt.925c801f.partial: renamed to: file10.txt
2025/03/10 08:02:40 INFO  : file10.txt: Copied (new)
2025/03/10 08:02:40 DEBUG : file2.txt.f8ac1735.partial: renamed to: file2.txt
2025/03/10 08:02:40 INFO  : file2.txt: Copied (new)
2025/03/10 08:02:40 DEBUG : file11.txt: md5 = 7fe98ed88552b828777d8630900346b8 OK
2025/03/10 08:02:40 DEBUG : file1.txt: md5 = 7fe98ed88552b828777d8630900346b8 OK
2025/03/10 08:02:40 DEBUG : file1.txt.925c801f.partial: renamed to: file1.txt
2025/03/10 08:02:40 INFO  : file1.txt: Copied (new)
2025/03/10 08:02:40 DEBUG : file11.txt.925c801f.partial: renamed to: file11.txt
2025/03/10 08:02:40 INFO  : file11.txt: Copied (new)
2025/03/10 08:02:40 DEBUG : file5R.txt: md5 = 979a803b15d27df0c31ad7d29006d10b OK
2025/03/10 08:02:40 DEBUG : file5L.txt: md5 = 0860a03592626642f8fd6c8bfb447d2a OK
2025/03/10 08:02:40 DEBUG : file5R.txt.aa998d0a.partial: renamed to: file5R.txt
2025/03/10 08:02:40 INFO  : file5R.txt: Copied (new)
2025/03/10 08:02:40 DEBUG : file6.txt: md5 = 7fe98ed88552b828777d8630900346b8 OK
2025/03/10 08:02:40 DEBUG : file5L.txt.c32cc336.partial: renamed to: file5L.txt
2025/03/10 08:02:40 INFO  : file5L.txt: Copied (new)
2025/03/10 08:02:40 DEBUG : file6.txt.925c801f.partial: renamed to: file6.txt
2025/03/10 08:02:40 INFO  : file6.txt: Copied (new)
2025/03/10 08:02:40 DEBUG : file7.txt: md5 = 7fe98ed88552b828777d8630900346b8 OK
2025/03/10 08:02:40 DEBUG : file7.txt.925c801f.partial: renamed to: file7.txt
2025/03/10 08:02:40 INFO  : file7.txt: Copied (new)
2025/03/10 08:02:40 DEBUG : ftp://172.17.0.7:21/rclone-test-diyireg8sena/080240vo/backupdir/path1: dial("tcp","172.17.0.7:54098")
2025/03/10 08:02:40 DEBUG : ftp://172.17.0.7:21/rclone-test-diyireg8sena/080240vo/backupdir/path1: > dial: conn=*fshttp.timeoutConn, err=<nil>
2025/03/10 08:02:40 ERROR : : error listing: directory not found
2025/03/10 08:02:40 ERROR : : error listing: directory not found
2025/03/10 08:02:40 NOTICE: checking initFs Local file system at /tmp/080240vo/initdir/test_backupdir-yobomot4
2025/03/10 08:02:40 DEBUG : ftp://172.17.0.7:21/rclone-test-diyireg8sena/080240vo/backupdir/path1: dial("tcp","172.17.0.7:17973")
2025/03/10 08:02:40 DEBUG : ftp://172.17.0.7:21/rclone-test-diyireg8sena/080240vo/backupdir/path1: > dial: conn=*fshttp.timeoutConn, err=<nil>
2025/03/10 08:02:40 DEBUG : RCLONE_TEST: Need to transfer - File not found at Destination
2025/03/10 08:02:40 DEBUG : file1.txt: Need to transfer - File not found at Destination
2025/03/10 08:02:40 DEBUG : file2.txt: Need to transfer - File not found at Destination
2025/03/10 08:02:40 DEBUG : file3.txt: Need to transfer - File not found at Destination
2025/03/10 08:02:40 DEBUG : file4.txt: Need to transfer - File not found at Destination
2025/03/10 08:02:40 DEBUG : file5.txt: Need to transfer - File not found at Destination
2025/03/10 08:02:40 DEBUG : file6.txt: Need to transfer - File not found at Destination
2025/03/10 08:02:40 DEBUG : file7.txt: Need to transfer - File not found at Destination
2025/03/10 08:02:40 DEBUG : file8.txt: Need to transfer - File not found at Destination
2025/03/10 08:02:40 DEBUG : ftp://172.17.0.7:21/rclone-test-diyireg8sena/080240vo/backupdir/path1: Waiting for checks to finish
2025/03/10 08:02:40 DEBUG : ftp://172.17.0.7:21/rclone-test-diyireg8sena/080240vo/backupdir/path1: Connecting to FTP server
2025/03/10 08:02:40 DEBUG : ftp://172.17.0.7:21/rclone-test-diyireg8sena/080240vo/backupdir/path1: dial("tcp","172.17.0.7:21")
2025/03/10 08:02:40 DEBUG : ftp://172.17.0.7:21/rclone-test-diyireg8sena/080240vo/backupdir/path1: > dial: conn=*fshttp.timeoutConn, err=<nil>
2025/03/10 08:02:40 DEBUG : ftp://172.17.0.7:21/rclone-test-diyireg8sena/080240vo/backupdir/path1: Connecting to FTP server
2025/03/10 08:02:40 DEBUG : ftp://172.17.0.7:21/rclone-test-diyireg8sena/080240vo/backupdir/path1: Waiting for transfers to finish
2025/03/10 08:02:40 DEBUG : ftp://172.17.0.7:21/rclone-test-diyireg8sena/080240vo/backupdir/path1: Connecting to FTP server
2025/03/10 08:02:40 DEBUG : ftp://172.17.0.7:21/rclone-test-diyireg8sena/080240vo/backupdir/path1: dial("tcp","172.17.0.7:20484")
2025/03/10 08:02:40 DEBUG : ftp://172.17.0.7:21/rclone-test-diyireg8sena/080240vo/backupdir/path1: > dial: conn=*fshttp.timeoutConn, err=<nil>
2025/03/10 08:02:40 DEBUG : RCLONE_TEST.cf9a93ac.partial: renamed to: RCLONE_TEST
2025/03/10 08:02:40 INFO  : RCLONE_TEST: Copied (new)
2025/03/10 08:02:40 DEBUG : ftp://172.17.0.7:21/rclone-test-diyireg8sena/080240vo/backupdir/path1: dial("tcp","172.17.0.7:46447")
2025/03/10 08:02:40 DEBUG : ftp://172.17.0.7:21/rclone-test-diyireg8sena/080240vo/backupdir/path1: > dial: conn=*fshttp.timeoutConn, err=<nil>
2025/03/10 08:02:40 DEBUG : ftp://172.17.0.7:21/rclone-test-diyireg8sena/080240vo/backupdir/path1: dial("tcp","172.17.0.7:52278")
2025/03/10 08:02:40 DEBUG : ftp://172.17.0.7:21/rclone-test-diyireg8sena/080240vo/backupdir/path1: > dial: conn=*fshttp.timeoutConn, err=<nil>
2025/03/10 08:02:40 DEBUG : file1.txt.5028a97.partial: renamed to: file1.txt
2025/03/10 08:02:40 INFO  : file1.txt: Copied (new)
2025/03/10 08:02:40 DEBUG : file4.txt.5028a97.partial: renamed to: file4.txt
2025/03/10 08:02:40 INFO  : file4.txt: Copied (new)
2025/03/10 08:02:40 DEBUG : ftp://172.17.0.7:21/rclone-test-diyireg8sena/080240vo/backupdir/path1: dial("tcp","172.17.0.7:34560")
2025/03/10 08:02:40 DEBUG : ftp://172.17.0.7:21/rclone-test-diyireg8sena/080240vo/backupdir/path1: > dial: conn=*fshttp.timeoutConn, err=<nil>
2025/03/10 08:02:40 DEBUG : ftp://172.17.0.7:21/rclone-test-diyireg8sena/080240vo/backupdir/path1: dial("tcp","172.17.0.7:11115")
2025/03/10 08:02:40 DEBUG : ftp://172.17.0.7:21/rclone-test-diyireg8sena/080240vo/backupdir/path1: > dial: conn=*fshttp.timeoutConn, err=<nil>
2025/03/10 08:02:40 DEBUG : file5.txt.5028a97.partial: renamed to: file5.txt
2025/03/10 08:02:40 INFO  : file5.txt: Copied (new)
2025/03/10 08:02:40 DEBUG : file6.txt.5028a97.partial: renamed to: file6.txt
2025/03/10 08:02:40 INFO  : file6.txt: Copied (new)
2025/03/10 08:02:40 DEBUG : ftp://172.17.0.7:21/rclone-test-diyireg8sena/080240vo/backupdir/path1: dial("tcp","172.17.0.7:1649")
2025/03/10 08:02:40 DEBUG : ftp://172.17.0.7:21/rclone-test-diyireg8sena/080240vo/backupdir/path1: > dial: conn=*fshttp.timeoutConn, err=<nil>
2025/03/10 08:02:40 DEBUG : ftp://172.17.0.7:21/rclone-test-diyireg8sena/080240vo/backupdir/path1: dial("tcp","172.17.0.7:32570")
2025/03/10 08:02:40 DEBUG : ftp://172.17.0.7:21/rclone-test-diyireg8sena/080240vo/backupdir/path1: > dial: conn=*fshttp.timeoutConn, err=<nil>
2025/03/10 08:02:40 DEBUG : ftp://172.17.0.7:21/rclone-test-diyireg8sena/080240vo/backupdir/path1: dial("tcp","172.17.0.7:21")
2025/03/10 08:02:40 DEBUG : ftp://172.17.0.7:21/rclone-test-diyireg8sena/080240vo/backupdir/path1: > dial: conn=*fshttp.timeoutConn, err=<nil>
2025/03/10 08:02:40 DEBUG : file7.txt.5028a97.partial: renamed to: file7.txt
2025/03/10 08:02:40 INFO  : file7.txt: Copied (new)
2025/03/10 08:02:40 DEBUG : file8.txt.5028a97.partial: renamed to: file8.txt
2025/03/10 08:02:40 INFO  : file8.txt: Copied (new)
2025/03/10 08:02:41 DEBUG : ftp://172.17.0.7:21/rclone-test-diyireg8sena/080240vo/backupdir/path1: dial("tcp","172.17.0.7:28094")
2025/03/10 08:02:41 DEBUG : ftp://172.17.0.7:21/rclone-test-diyireg8sena/080240vo/backupdir/path1: > dial: conn=*fshttp.timeoutConn, err=<nil>
2025/03/10 08:02:41 DEBUG : file2.txt.5028a97.partial: renamed to: file2.txt
2025/03/10 08:02:41 INFO  : file2.txt: Copied (new)
2025/03/10 08:02:41 DEBUG : ftp://172.17.0.7:21/rclone-test-diyireg8sena/080240vo/backupdir/path1: dial("tcp","172.17.0.7:21")
2025/03/10 08:02:41 DEBUG : ftp://172.17.0.7:21/rclone-test-diyireg8sena/080240vo/backupdir/path1: > dial: conn=*fshttp.timeoutConn, err=<nil>
2025/03/10 08:02:41 DEBUG : ftp://172.17.0.7:21/rclone-test-diyireg8sena/080240vo/backupdir/path1: dial("tcp","172.17.0.7:43687")
2025/03/10 08:02:41 DEBUG : ftp://172.17.0.7:21/rclone-test-diyireg8sena/080240vo/backupdir/path1: > dial: conn=*fshttp.timeoutConn, err=<nil>
2025/03/10 08:02:41 DEBUG : file3.txt.5028a97.partial: renamed to: file3.txt
2025/03/10 08:02:41 INFO  : file3.txt: Copied (new)
2025/03/10 08:02:41 NOTICE: checking Path1 ftp://172.17.0.7:21/rclone-test-diyireg8sena/080240vo/backupdir/path1
2025/03/10 08:02:41 DEBUG : ftp://172.17.0.7:21/rclone-test-diyireg8sena/080240vo/backupdir/path1: dial("tcp","172.17.0.7:17143")
2025/03/10 08:02:41 DEBUG : ftp://172.17.0.7:21/rclone-test-diyireg8sena/080240vo/backupdir/path1: > dial: conn=*fshttp.timeoutConn, err=<nil>
2025/03/10 08:02:41 DEBUG : RCLONE_TEST: Need to transfer - File not found at Destination
2025/03/10 08:02:41 DEBUG : file1.txt: Need to transfer - File not found at Destination
2025/03/10 08:02:41 DEBUG : file2.txt: Need to transfer - File not found at Destination
2025/03/10 08:02:41 DEBUG : file3.txt: Need to transfer - File not found at Destination
2025/03/10 08:02:41 DEBUG : file4.txt: Need to transfer - File not found at Destination
2025/03/10 08:02:41 DEBUG : file5.txt: Need to transfer - File not found at Destination
2025/03/10 08:02:41 DEBUG : file6.txt: Need to transfer - File not found at Destination
2025/03/10 08:02:41 DEBUG : file7.txt: Need to transfer - File not found at Destination
2025/03/10 08:02:41 DEBUG : file8.txt: Need to transfer - File not found at Destination
2025/03/10 08:02:41 DEBUG : Local file system at /tmp/080240vo/backupdir/path2: Waiting for checks to finish
2025/03/10 08:02:41 DEBUG : Local file system at /tmp/080240vo/backupdir/path2: Waiting for transfers to finish
2025/03/10 08:02:41 DEBUG : file1.txt: md5 = d41d8cd98f00b204e9800998ecf8427e OK
2025/03/10 08:02:41 DEBUG : file2.txt: md5 = d41d8cd98f00b204e9800998ecf8427e OK
2025/03/10 08:02:41 DEBUG : file3.txt: md5 = d41d8cd98f00b204e9800998ecf8427e OK
2025/03/10 08:02:41 DEBUG : file1.txt.5028a97.partial: renamed to: file1.txt
2025/03/10 08:02:41 INFO  : file1.txt: Copied (new)
2025/03/10 08:02:41 DEBUG : RCLONE_TEST: md5 = 294d25b294ff26a5243dba914ac3fbf7 OK
2025/03/10 08:02:41 DEBUG : file2.txt.5028a97.partial: renamed to: file2.txt
2025/03/10 08:02:41 INFO  : file2.txt: Copied (new)
2025/03/10 08:02:41 DEBUG : RCLONE_TEST.cf9a93ac.partial: renamed to: RCLONE_TEST
2025/03/10 08:02:41 DEBUG : file3.txt.5028a97.partial: renamed to: file3.txt
2025/03/10 08:02:41 INFO  : RCLONE_TEST: Copied (new)
2025/03/10 08:02:41 INFO  : file3.txt: Copied (new)
2025/03/10 08:02:41 DEBUG : file4.txt: md5 = d41d8cd98f00b204e9800998ecf8427e OK
2025/03/10 08:02:41 DEBUG : file4.txt.5028a97.partial: renamed to: file4.txt
2025/03/10 08:02:41 INFO  : file4.txt: Copied (new)
2025/03/10 08:02:41 DEBUG : file7.txt: md5 = d41d8cd98f00b204e9800998ecf8427e OK
2025/03/10 08:02:41 DEBUG : file8.txt: md5 = d41d8cd98f00b204e9800998ecf8427e OK
2025/03/10 08:02:41 DEBUG : file7.txt.5028a97.partial: renamed to: file7.txt
2025/03/10 08:02:41 INFO  : file7.txt: Copied (new)
2025/03/10 08:02:41 DEBUG : file8.txt.5028a97.partial: renamed to: file8.txt
2025/03/10 08:02:41 INFO  : file8.txt: Copied (new)
2025/03/10 08:02:41 DEBUG : file6.txt: md5 = d41d8cd98f00b204e9800998ecf8427e OK
2025/03/10 08:02:41 DEBUG : file6.txt.5028a97.partial: renamed to: file6.txt
2025/03/10 08:02:41 INFO  : file6.txt: Copied (new)
2025/03/10 08:02:41 DEBUG : file5.txt: md5 = d41d8cd98f00b204e9800998ecf8427e OK
2025/03/10 08:02:41 DEBUG : file5.txt.5028a97.partial: renamed to: file5.txt
2025/03/10 08:02:41 INFO  : file5.txt: Copied (new)
2025/03/10 08:02:41 NOTICE: checking path2 Local file system at /tmp/080240vo/backupdir/path2
2025/03/10 08:02:41 NOTICE: (01)  : test backupdir
2025/03/10 08:02:41 NOTICE: (02)  : test initial bisync
2025/03/10 08:02:41 NOTICE: (03)  : bisync resync backupdir1=/tmp/080240vo/workdir/backupdirs/backupdir1 backupdir2=/tmp/080240vo/workdir/backupdirs/backupdir2
    bisync_test.go:934: backupdir test currently only works on local (it uses the workdir)
=== RUN   TestBisyncRemoteLocal/basic
2025/03/10 08:02:41 DEBUG : fs cache: switching user supplied name "TestFTPProftpd:rclone-test-diyireg8sena/080240vo" for canonical name "TestFTPProftpd{7UpF6}:rclone-test-diyireg8sena/080240vo"
2025/03/10 08:02:41 INFO  : path1: Making directory
2025/03/10 08:02:41 DEBUG : Creating backend with remote "TestFTPProftpd:rclone-test-diyireg8sena/080240vo/basic/path1"
2025/03/10 08:02:41 DEBUG : Setting type="ftp" for "TestFTPProftpd" from environment variable RCLONE_CONFIG_TESTFTPPROFTPD_TYPE
2025/03/10 08:02:41 DEBUG : Setting host="172.17.0.7" for "TestFTPProftpd" from environment variable RCLONE_CONFIG_TESTFTPPROFTPD_HOST
2025/03/10 08:02:41 DEBUG : Setting user="rclone" for "TestFTPProftpd" from environment variable RCLONE_CONFIG_TESTFTPPROFTPD_USER
2025/03/10 08:02:41 DEBUG : Setting pass="bs4dtJ-UhrkEMgPbFRZce7u-bc0-y4MG7RBUStGI7KGnLw" for "TestFTPProftpd" from environment variable RCLONE_CONFIG_TESTFTPPROFTPD_PASS
2025/03/10 08:02:41 DEBUG : Setting encoding="Asterisk,Ctl,Dot,Slash" for "TestFTPProftpd" from environment variable RCLONE_CONFIG_TESTFTPPROFTPD_ENCODING
2025/03/10 08:02:41 DEBUG : TestFTPProftpd: detected overridden config - adding "{7UpF6}" suffix to name
2025/03/10 08:02:41 DEBUG : Setting host="172.17.0.7" for "TestFTPProftpd" from environment variable RCLONE_CONFIG_TESTFTPPROFTPD_HOST
2025/03/10 08:02:41 DEBUG : Setting user="rclone" for "TestFTPProftpd" from environment variable RCLONE_CONFIG_TESTFTPPROFTPD_USER
2025/03/10 08:02:41 DEBUG : Setting pass="bs4dtJ-UhrkEMgPbFRZce7u-bc0-y4MG7RBUStGI7KGnLw" for "TestFTPProftpd" from environment variable RCLONE_CONFIG_TESTFTPPROFTPD_PASS
2025/03/10 08:02:41 DEBUG : Setting encoding="Asterisk,Ctl,Dot,Slash" for "TestFTPProftpd" from environment variable RCLONE_CONFIG_TESTFTPPROFTPD_ENCODING
2025/03/10 08:02:41 DEBUG : ftp://172.17.0.7:21/rclone-test-diyireg8sena/080240vo/basic/path1: Connecting to FTP server
2025/03/10 08:02:41 DEBUG : ftp://172.17.0.7:21/rclone-test-diyireg8sena/080240vo/basic/path1: dial("tcp","172.17.0.7:21")
2025/03/10 08:02:41 DEBUG : ftp://172.17.0.7:21/rclone-test-diyireg8sena/080240vo/basic/path1: > dial: conn=*fshttp.timeoutConn, err=<nil>
2025/03/10 08:02:41 DEBUG : fs cache: renaming cache item "TestFTPProftpd:rclone-test-diyireg8sena/080240vo/basic/path1" to be canonical "TestFTPProftpd{7UpF6}:rclone-test-diyireg8sena/080240vo/basic/path1"
2025/03/10 08:02:41 DEBUG : Creating backend with remote "/tmp/080240vo/basic/path2"
2025/03/10 08:02:41 DEBUG : Creating backend with remote "/home/rclone/go/src/github.com/rclone/rclone/cmd/bisync/testdata/test_basic/initial"
2025/03/10 08:02:41 DEBUG : Creating backend with remote "/tmp/080240vo/initdir/test_basic-gawaqev7"
2025/03/10 08:02:41 DEBUG : RCLONE_TEST: Need to transfer - File not found at Destination
2025/03/10 08:02:41 DEBUG : file1.copy1.txt: Need to transfer - File not found at Destination
2025/03/10 08:02:41 DEBUG : file1.copy2.txt: Need to transfer - File not found at Destination
2025/03/10 08:02:41 DEBUG : file1.copy3.txt: Need to transfer - File not found at Destination
2025/03/10 08:02:41 DEBUG : file1.copy4.txt: Need to transfer - File not found at Destination
2025/03/10 08:02:41 DEBUG : file1.copy2.txt: md5 = d41d8cd98f00b204e9800998ecf8427e OK
2025/03/10 08:02:41 DEBUG : file1.copy2.txt.5028a97.partial: renamed to: file1.copy2.txt
2025/03/10 08:02:41 INFO  : file1.copy2.txt: Copied (new)
2025/03/10 08:02:41 DEBUG : file1.copy5.txt: Need to transfer - File not found at Destination
2025/03/10 08:02:41 DEBUG : file1.txt: Need to transfer - File not found at Destination
2025/03/10 08:02:41 DEBUG : subdir: Making directory with metadata
2025/03/10 08:02:41 DEBUG : file1.copy3.txt: md5 = d41d8cd98f00b204e9800998ecf8427e OK
2025/03/10 08:02:41 INFO  : subdir: Made directory with metadata (mtime=2021-11-02T05:00:07Z)
2025/03/10 08:02:41 DEBUG : Added delayed dir = "subdir", newDst=subdir
2025/03/10 08:02:41 DEBUG : file1.copy3.txt.5028a97.partial: renamed to: file1.copy3.txt
2025/03/10 08:02:41 INFO  : file1.copy3.txt: Copied (new)
2025/03/10 08:02:41 DEBUG : subdir/file20.txt: Need to transfer - File not found at Destination
2025/03/10 08:02:41 DEBUG : Local file system at /tmp/080240vo/initdir/test_basic-gawaqev7: Waiting for checks to finish
2025/03/10 08:02:41 DEBUG : file1.copy1.txt: md5 = d41d8cd98f00b204e9800998ecf8427e OK
2025/03/10 08:02:41 DEBUG : file1.copy1.txt.5028a97.partial: renamed to: file1.copy1.txt
2025/03/10 08:02:41 INFO  : file1.copy1.txt: Copied (new)
2025/03/10 08:02:41 DEBUG : file1.copy4.txt: md5 = d41d8cd98f00b204e9800998ecf8427e OK
2025/03/10 08:02:41 DEBUG : RCLONE_TEST: md5 = 294d25b294ff26a5243dba914ac3fbf7 OK
2025/03/10 08:02:41 DEBUG : file1.copy4.txt.5028a97.partial: renamed to: file1.copy4.txt
2025/03/10 08:02:41 INFO  : file1.copy4.txt: Copied (new)
2025/03/10 08:02:41 DEBUG : RCLONE_TEST.cf9a93ac.partial: renamed to: RCLONE_TEST
2025/03/10 08:02:41 INFO  : RCLONE_TEST: Copied (new)
2025/03/10 08:02:41 DEBUG : Local file system at /tmp/080240vo/initdir/test_basic-gawaqev7: Waiting for transfers to finish
2025/03/10 08:02:41 DEBUG : file1.copy5.txt: md5 = d41d8cd98f00b204e9800998ecf8427e OK
2025/03/10 08:02:41 DEBUG : file1.copy5.txt.5028a97.partial: renamed to: file1.copy5.txt
2025/03/10 08:02:41 INFO  : file1.copy5.txt: Copied (new)
2025/03/10 08:02:41 DEBUG : subdir/file20.txt: md5 = d41d8cd98f00b204e9800998ecf8427e OK
2025/03/10 08:02:41 DEBUG : subdir/file20.txt.5028a97.partial: renamed to: subdir/file20.txt
2025/03/10 08:02:41 INFO  : subdir/file20.txt: Copied (new)
2025/03/10 08:02:41 DEBUG : file1.txt: md5 = d41d8cd98f00b204e9800998ecf8427e OK
2025/03/10 08:02:41 DEBUG : file1.txt.5028a97.partial: renamed to: file1.txt
2025/03/10 08:02:41 INFO  : file1.txt: Copied (new)
2025/03/10 08:02:41 INFO  : subdir: Set directory modification time (using SetModTime)
2025/03/10 08:02:41 DEBUG : Creating backend with remote "/home/rclone/go/src/github.com/rclone/rclone/cmd/bisync/testdata/test_basic/modfiles"
2025/03/10 08:02:41 DEBUG : Creating backend with remote "/tmp/080240vo/datadir/test_basic-xamelum1"
2025/03/10 08:02:41 DEBUG : file1.txt: Need to transfer - File not found at Destination
2025/03/10 08:02:41 DEBUG : Local file system at /tmp/080240vo/datadir/test_basic-xamelum1: Waiting for checks to finish
2025/03/10 08:02:41 DEBUG : Local file system at /tmp/080240vo/datadir/test_basic-xamelum1: Waiting for transfers to finish
2025/03/10 08:02:41 DEBUG : file1.txt: md5 = 7fe98ed88552b828777d8630900346b8 OK
2025/03/10 08:02:41 DEBUG : file1.txt.925c801f.partial: renamed to: file1.txt
2025/03/10 08:02:41 INFO  : file1.txt: Copied (new)
2025/03/10 08:02:41 DEBUG : ftp://172.17.0.7:21/rclone-test-diyireg8sena/080240vo/basic/path1: dial("tcp","172.17.0.7:28899")
2025/03/10 08:02:41 DEBUG : ftp://172.17.0.7:21/rclone-test-diyireg8sena/080240vo/basic/path1: > dial: conn=*fshttp.timeoutConn, err=<nil>
2025/03/10 08:02:41 ERROR : : error listing: directory not found
2025/03/10 08:02:41 ERROR : : error listing: directory not found
2025/03/10 08:02:41 NOTICE: checking initFs Local file system at /tmp/080240vo/initdir/test_basic-gawaqev7
2025/03/10 08:02:41 DEBUG : ftp://172.17.0.7:21/rclone-test-diyireg8sena/080240vo/basic/path1: dial("tcp","172.17.0.7:56458")
2025/03/10 08:02:41 DEBUG : ftp://172.17.0.7:21/rclone-test-diyireg8sena/080240vo/basic/path1: > dial: conn=*fshttp.timeoutConn, err=<nil>
2025/03/10 08:02:41 DEBUG : RCLONE_TEST: Need to transfer - File not found at Destination
2025/03/10 08:02:41 DEBUG : file1.copy1.txt: Need to transfer - File not found at Destination
2025/03/10 08:02:41 DEBUG : file1.copy2.txt: Need to transfer - File not found at Destination
2025/03/10 08:02:41 DEBUG : file1.copy3.txt: Need to transfer - File not found at Destination
2025/03/10 08:02:41 DEBUG : file1.copy4.txt: Need to transfer - File not found at Destination
2025/03/10 08:02:41 DEBUG : file1.copy5.txt: Need to transfer - File not found at Destination
2025/03/10 08:02:41 DEBUG : file1.txt: Need to transfer - File not found at Destination
2025/03/10 08:02:41 INFO  : subdir: Making directory
2025/03/10 08:02:41 DEBUG : ftp://172.17.0.7:21/rclone-test-diyireg8sena/080240vo/basic/path1: Connecting to FTP server
2025/03/10 08:02:41 DEBUG : ftp://172.17.0.7:21/rclone-test-diyireg8sena/080240vo/basic/path1: dial("tcp","172.17.0.7:21")
2025/03/10 08:02:41 DEBUG : ftp://172.17.0.7:21/rclone-test-diyireg8sena/080240vo/basic/path1: Connecting to FTP server
2025/03/10 08:02:41 DEBUG : ftp://172.17.0.7:21/rclone-test-diyireg8sena/080240vo/basic/path1: Connecting to FTP server
2025/03/10 08:02:41 DEBUG : ftp://172.17.0.7:21/rclone-test-diyireg8sena/080240vo/basic/path1: Connecting to FTP server
2025/03/10 08:02:41 DEBUG : ftp://172.17.0.7:21/rclone-test-diyireg8sena/080240vo/basic/path1: > dial: conn=*fshttp.timeoutConn, err=<nil>
2025/03/10 08:02:41 DEBUG : subdir/file20.txt: Need to transfer - File not found at Destination
2025/03/10 08:02:41 DEBUG : ftp://172.17.0.7:21/rclone-test-diyireg8sena/080240vo/basic/path1: Waiting for checks to finish
2025/03/10 08:02:41 DEBUG : ftp://172.17.0.7:21/rclone-test-diyireg8sena/080240vo/basic/path1: Waiting for transfers to finish
2025/03/10 08:02:41 DEBUG : ftp://172.17.0.7:21/rclone-test-diyireg8sena/080240vo/basic/path1: dial("tcp","172.17.0.7:8077")
2025/03/10 08:02:41 DEBUG : ftp://172.17.0.7:21/rclone-test-diyireg8sena/080240vo/basic/path1: > dial: conn=*fshttp.timeoutConn, err=<nil>
2025/03/10 08:02:41 DEBUG : RCLONE_TEST.cf9a93ac.partial: renamed to: RCLONE_TEST
2025/03/10 08:02:41 INFO  : RCLONE_TEST: Copied (new)
2025/03/10 08:02:41 DEBUG : ftp://172.17.0.7:21/rclone-test-diyireg8sena/080240vo/basic/path1: dial("tcp","172.17.0.7:19508")
2025/03/10 08:02:41 DEBUG : ftp://172.17.0.7:21/rclone-test-diyireg8sena/080240vo/basic/path1: > dial: conn=*fshttp.timeoutConn, err=<nil>
2025/03/10 08:02:41 DEBUG : file1.copy4.txt.5028a97.partial: renamed to: file1.copy4.txt
2025/03/10 08:02:41 INFO  : file1.copy4.txt: Copied (new)
2025/03/10 08:02:41 DEBUG : ftp://172.17.0.7:21/rclone-test-diyireg8sena/080240vo/basic/path1: dial("tcp","172.17.0.7:21")
2025/03/10 08:02:41 DEBUG : ftp://172.17.0.7:21/rclone-test-diyireg8sena/080240vo/basic/path1: > dial: conn=*fshttp.timeoutConn, err=<nil>
2025/03/10 08:02:41 DEBUG : ftp://172.17.0.7:21/rclone-test-diyireg8sena/080240vo/basic/path1: dial("tcp","172.17.0.7:31747")
2025/03/10 08:02:41 DEBUG : ftp://172.17.0.7:21/rclone-test-diyireg8sena/080240vo/basic/path1: > dial: conn=*fshttp.timeoutConn, err=<nil>
2025/03/10 08:02:41 DEBUG : file1.copy5.txt.5028a97.partial: renamed to: file1.copy5.txt
2025/03/10 08:02:41 INFO  : file1.copy5.txt: Copied (new)
2025/03/10 08:02:41 DEBUG : ftp://172.17.0.7:21/rclone-test-diyireg8sena/080240vo/basic/path1: dial("tcp","172.17.0.7:5203")
2025/03/10 08:02:41 DEBUG : ftp://172.17.0.7:21/rclone-test-diyireg8sena/080240vo/basic/path1: > dial: conn=*fshttp.timeoutConn, err=<nil>
2025/03/10 08:02:41 DEBUG : file1.txt.5028a97.partial: renamed to: file1.txt
2025/03/10 08:02:41 INFO  : file1.txt: Copied (new)
2025/03/10 08:02:41 DEBUG : ftp://172.17.0.7:21/rclone-test-diyireg8sena/080240vo/basic/path1: dial("tcp","172.17.0.7:51216")
2025/03/10 08:02:41 DEBUG : ftp://172.17.0.7:21/rclone-test-diyireg8sena/080240vo/basic/path1: > dial: conn=*fshttp.timeoutConn, err=<nil>
2025/03/10 08:02:41 DEBUG : ftp://172.17.0.7:21/rclone-test-diyireg8sena/080240vo/basic/path1: dial("tcp","172.17.0.7:36131")
2025/03/10 08:02:41 DEBUG : ftp://172.17.0.7:21/rclone-test-diyireg8sena/080240vo/basic/path1: > dial: conn=*fshttp.timeoutConn, err=<nil>
2025/03/10 08:02:41 DEBUG : subdir/file20.txt.5028a97.partial: renamed to: subdir/file20.txt
2025/03/10 08:02:41 INFO  : subdir/file20.txt: Copied (new)
2025/03/10 08:02:41 DEBUG : file1.copy2.txt.5028a97.partial: renamed to: file1.copy2.txt
2025/03/10 08:02:41 INFO  : file1.copy2.txt: Copied (new)
2025/03/10 08:02:41 DEBUG : ftp://172.17.0.7:21/rclone-test-diyireg8sena/080240vo/basic/path1: dial("tcp","172.17.0.7:21")
2025/03/10 08:02:41 DEBUG : ftp://172.17.0.7:21/rclone-test-diyireg8sena/080240vo/basic/path1: > dial: conn=*fshttp.timeoutConn, err=<nil>
2025/03/10 08:02:41 DEBUG : ftp://172.17.0.7:21/rclone-test-diyireg8sena/080240vo/basic/path1: dial("tcp","172.17.0.7:29786")
2025/03/10 08:02:41 DEBUG : ftp://172.17.0.7:21/rclone-test-diyireg8sena/080240vo/basic/path1: > dial: conn=*fshttp.timeoutConn, err=<nil>
2025/03/10 08:02:41 DEBUG : file1.copy1.txt.5028a97.partial: renamed to: file1.copy1.txt
2025/03/10 08:02:41 INFO  : file1.copy1.txt: Copied (new)
2025/03/10 08:02:41 DEBUG : ftp://172.17.0.7:21/rclone-test-diyireg8sena/080240vo/basic/path1: dial("tcp","172.17.0.7:21")
2025/03/10 08:02:41 DEBUG : ftp://172.17.0.7:21/rclone-test-diyireg8sena/080240vo/basic/path1: > dial: conn=*fshttp.timeoutConn, err=<nil>
2025/03/10 08:02:41 DEBUG : ftp://172.17.0.7:21/rclone-test-diyireg8sena/080240vo/basic/path1: dial("tcp","172.17.0.7:47663")
2025/03/10 08:02:41 DEBUG : ftp://172.17.0.7:21/rclone-test-diyireg8sena/080240vo/basic/path1: > dial: conn=*fshttp.timeoutConn, err=<nil>
2025/03/10 08:02:41 DEBUG : file1.copy3.txt.5028a97.partial: renamed to: file1.copy3.txt
2025/03/10 08:02:41 INFO  : file1.copy3.txt: Copied (new)
2025/03/10 08:02:41 NOTICE: checking Path1 ftp://172.17.0.7:21/rclone-test-diyireg8sena/080240vo/basic/path1
2025/03/10 08:02:41 DEBUG : ftp://172.17.0.7:21/rclone-test-diyireg8sena/080240vo/basic/path1: dial("tcp","172.17.0.7:54980")
2025/03/10 08:02:41 DEBUG : ftp://172.17.0.7:21/rclone-test-diyireg8sena/080240vo/basic/path1: > dial: conn=*fshttp.timeoutConn, err=<nil>
2025/03/10 08:02:41 DEBUG : ftp://172.17.0.7:21/rclone-test-diyireg8sena/080240vo/basic/path1: dial("tcp","172.17.0.7:31589")
2025/03/10 08:02:41 DEBUG : ftp://172.17.0.7:21/rclone-test-diyireg8sena/080240vo/basic/path1: > dial: conn=*fshttp.timeoutConn, err=<nil>
2025/03/10 08:02:41 DEBUG : RCLONE_TEST: Need to transfer - File not found at Destination
2025/03/10 08:02:41 DEBUG : file1.copy1.txt: Need to transfer - File not found at Destination
2025/03/10 08:02:41 DEBUG : file1.copy2.txt: Need to transfer - File not found at Destination
2025/03/10 08:02:41 DEBUG : file1.copy3.txt: Need to transfer - File not found at Destination
2025/03/10 08:02:41 DEBUG : file1.copy4.txt: Need to transfer - File not found at Destination
2025/03/10 08:02:41 DEBUG : file1.copy5.txt: Need to transfer - File not found at Destination
2025/03/10 08:02:41 DEBUG : file1.txt: Need to transfer - File not found at Destination
2025/03/10 08:02:41 DEBUG : subdir: Making directory with metadata
2025/03/10 08:02:41 DEBUG : file1.copy2.txt: md5 = d41d8cd98f00b204e9800998ecf8427e OK
2025/03/10 08:02:41 DEBUG : file1.copy3.txt: md5 = d41d8cd98f00b204e9800998ecf8427e OK
2025/03/10 08:02:41 INFO  : subdir: Made directory with metadata (mtime=2021-11-02T05:00:07Z)
2025/03/10 08:02:41 DEBUG : file1.copy2.txt.5028a97.partial: renamed to: file1.copy2.txt
2025/03/10 08:02:41 DEBUG : Added delayed dir = "subdir", newDst=subdir
2025/03/10 08:02:41 INFO  : file1.copy2.txt: Copied (new)
2025/03/10 08:02:41 DEBUG : file1.copy3.txt.5028a97.partial: renamed to: file1.copy3.txt
2025/03/10 08:02:41 INFO  : file1.copy3.txt: Copied (new)
2025/03/10 08:02:41 DEBUG : file1.copy1.txt: md5 = d41d8cd98f00b204e9800998ecf8427e OK
2025/03/10 08:02:41 DEBUG : subdir/file20.txt: Need to transfer - File not found at Destination
2025/03/10 08:02:41 DEBUG : file1.copy1.txt.5028a97.partial: renamed to: file1.copy1.txt
2025/03/10 08:02:41 INFO  : file1.copy1.txt: Copied (new)
2025/03/10 08:02:41 DEBUG : file1.copy4.txt: md5 = d41d8cd98f00b204e9800998ecf8427e OK
2025/03/10 08:02:41 DEBUG : file1.copy4.txt.5028a97.partial: renamed to: file1.copy4.txt
2025/03/10 08:02:41 DEBUG : Local file system at /tmp/080240vo/basic/path2: Waiting for checks to finish
2025/03/10 08:02:41 INFO  : file1.copy4.txt: Copied (new)
2025/03/10 08:02:41 DEBUG : Local file system at /tmp/080240vo/basic/path2: Waiting for transfers to finish
2025/03/10 08:02:41 DEBUG : file1.copy5.txt: md5 = d41d8cd98f00b204e9800998ecf8427e OK
2025/03/10 08:02:41 DEBUG : file1.copy5.txt.5028a97.partial: renamed to: file1.copy5.txt
2025/03/10 08:02:41 INFO  : file1.copy5.txt: Copied (new)
2025/03/10 08:02:41 DEBUG : file1.txt: md5 = d41d8cd98f00b204e9800998ecf8427e OK
2025/03/10 08:02:41 DEBUG : subdir/file20.txt: md5 = d41d8cd98f00b204e9800998ecf8427e OK
2025/03/10 08:02:41 DEBUG : file1.txt.5028a97.partial: renamed to: file1.txt
2025/03/10 08:02:41 INFO  : file1.txt: Copied (new)
2025/03/10 08:02:41 DEBUG : subdir/file20.txt.5028a97.partial: renamed to: subdir/file20.txt
2025/03/10 08:02:41 INFO  : subdir/file20.txt: Copied (new)
2025/03/10 08:02:41 DEBUG : RCLONE_TEST: md5 = 294d25b294ff26a5243dba914ac3fbf7 OK
2025/03/10 08:02:41 DEBUG : RCLONE_TEST.cf9a93ac.partial: renamed to: RCLONE_TEST
2025/03/10 08:02:41 INFO  : RCLONE_TEST: Copied (new)
2025/03/10 08:02:41 INFO  : subdir: Set directory modification time (using SetModTime)
2025/03/10 08:02:41 NOTICE: checking path2 Local file system at /tmp/080240vo/basic/path2
2025/03/10 08:02:41 NOTICE: (01)  : test basic
2025/03/10 08:02:41 NOTICE: (02)  : test initial bisync
2025/03/10 08:02:41 NOTICE: (03)  : bisync resync
2025/03/10 08:02:41 INFO  : subdir: Set directory modification time (using SetModTime)
2025/03/10 08:02:41 INFO  : Setting --ignore-listing-checksum as neither --checksum nor --compare checksum are set.
2025/03/10 08:02:41 INFO  : Bisyncing with Comparison Settings: 
{
	"Modtime": true,
	"Size": true,
	"Checksum": false,
	"HashType1": 0,
	"HashType2": 0,
	"NoSlowHash": false,
	"SlowHashSyncOnly": false,
	"SlowHashDetected": true,
	"DownloadHash": false
}
2025/03/10 08:02:41 INFO  : Synching Path1 "TestFTPProftpd{7UpF6}:rclone-test-diyireg8sena/080240vo/basic/path1/" with Path2 "/tmp/080240vo/basic/path2/"
2025/03/10 08:02:41 INFO  : Copying Path2 files to Path1
2025/03/10 08:02:41 INFO  : - Path2    Resync is copying files to         - Path1
2025/03/10 08:02:41 INFO  : - Path1    Resync is copying files to         - Path2
2025/03/10 08:02:41 INFO  : subdir: Set directory modification time (using SetModTime)
2025/03/10 08:02:41 INFO  : Resync updating listings
2025/03/10 08:02:41 INFO  : Validating listings for Path1 "TestFTPProftpd{7UpF6}:rclone-test-diyireg8sena/080240vo/basic/path1/" vs Path2 "/tmp/080240vo/basic/path2/"
2025/03/10 08:02:41 INFO  : Bisync successful
2025/03/10 08:02:41 NOTICE: (04)  : test place newer files on both paths
2025/03/10 08:02:41 NOTICE: (05)  : touch-copy 2001-01-02 /tmp/080240vo/datadir/test_basic-xamelum1/file1.txt /tmp/080240vo/basic/path2/
2025/03/10 08:02:41 INFO  : file1.txt: Copied (replaced existing)
2025/03/10 08:02:41 NOTICE: (06)  : copy-as /tmp/080240vo/datadir/test_basic-xamelum1/file1.txt TestFTPProftpd,encoding='Asterisk,Ctl,Dot,Slash',host='172.17.0.7',pass='bs4dtJ-UhrkEMgPbFRZce7u-bc0-y4MG7RBUStGI7KGnLw',user='rclone':rclone-test-diyireg8sena/080240vo/basic/path1/subdir file20.txt
2025/03/10 08:02:41 INFO  : file1.txt: Copied (replaced existing) to: file20.txt
2025/03/10 08:02:41 NOTICE: (07)  : test bisync run
2025/03/10 08:02:41 NOTICE: (08)  : bisync
2025/03/10 08:02:41 INFO  : subdir: Set directory modification time (using SetModTime)
2025/03/10 08:02:41 INFO  : Setting --ignore-listing-checksum as neither --checksum nor --compare checksum are set.
2025/03/10 08:02:41 INFO  : Bisyncing with Comparison Settings: 
{
	"Modtime": true,
	"Size": true,
	"Checksum": false,
	"HashType1": 0,
	"HashType2": 0,
	"NoSlowHash": false,
	"SlowHashSyncOnly": false,
	"SlowHashDetected": true,
	"DownloadHash": false
}
2025/03/10 08:02:41 INFO  : Synching Path1 "TestFTPProftpd{7UpF6}:rclone-test-diyireg8sena/080240vo/basic/path1/" with Path2 "/tmp/080240vo/basic/path2/"
2025/03/10 08:02:41 INFO  : Building Path1 and Path2 listings
2025/03/10 08:02:41 INFO  : Path1 checking for diffs
2025/03/10 08:02:41 INFO  : - Path1    File changed: size (larger), time (newer) - subdir/file20.txt
2025/03/10 08:02:41 INFO  : Path1:    1 changes:    0 new,    1 modified,    0 deleted
2025/03/10 08:02:41 INFO  : (Modified:    1 newer,    0 older,    1 larger,    0 smaller)
2025/03/10 08:02:41 INFO  : Path2 checking for diffs
2025/03/10 08:02:41 INFO  : - Path2    File changed: size (larger), time (newer) - file1.txt
2025/03/10 08:02:41 INFO  : Path2:    1 changes:    0 new,    1 modified,    0 deleted
2025/03/10 08:02:41 INFO  : (Modified:    1 newer,    0 older,    1 larger,    0 smaller)
2025/03/10 08:02:41 INFO  : Applying changes
2025/03/10 08:02:41 INFO  : - Path1    Queue copy to Path2       - /tmp/080240vo/basic/path2/subdir/file20.txt
2025/03/10 08:02:41 INFO  : - Path2    Queue copy to Path1       - TestFTPProftpd{7UpF6}:rclone-test-diyireg8sena/080240vo/basic/path1/file1.txt
2025/03/10 08:02:41 INFO  : - Path2    Do queued copies to                - Path1
2025/03/10 08:02:41 INFO  : file1.txt: Copied (replaced existing)
2025/03/10 08:02:41 INFO  : - Path1    Do queued copies to                - Path2
2025/03/10 08:02:41 INFO  : subdir: Set directory modification time (using SetModTime)
2025/03/10 08:02:41 INFO  : subdir/file20.txt: Copied (replaced existing)
2025/03/10 08:02:41 INFO  : subdir: Set directory modification time (using SetModTime)
2025/03/10 08:02:41 INFO  : Updating listings
2025/03/10 08:02:41 INFO  : Validating listings for Path1 "TestFTPProftpd{7UpF6}:rclone-test-diyireg8sena/080240vo/basic/path1/" vs Path2 "/tmp/080240vo/basic/path2/"
2025/03/10 08:02:41 INFO  : Bisync successful
    bisync_test.go:560: TEST basic PASSED
=== RUN   TestBisyncRemoteLocal/changes
2025/03/10 08:02:41 DEBUG : fs cache: switching user supplied name "TestFTPProftpd:rclone-test-diyireg8sena/080240vo" for canonical name "TestFTPProftpd{7UpF6}:rclone-test-diyireg8sena/080240vo"
2025/03/10 08:02:41 INFO  : path1: Making directory
2025/03/10 08:02:41 DEBUG : Creating backend with remote "TestFTPProftpd:rclone-test-diyireg8sena/080240vo/changes/path1"
2025/03/10 08:02:41 DEBUG : Setting type="ftp" for "TestFTPProftpd" from environment variable RCLONE_CONFIG_TESTFTPPROFTPD_TYPE
2025/03/10 08:02:41 DEBUG : Setting host="172.17.0.7" for "TestFTPProftpd" from environment variable RCLONE_CONFIG_TESTFTPPROFTPD_HOST
2025/03/10 08:02:41 DEBUG : Setting user="rclone" for "TestFTPProftpd" from environment variable RCLONE_CONFIG_TESTFTPPROFTPD_USER
2025/03/10 08:02:41 DEBUG : Setting pass="bs4dtJ-UhrkEMgPbFRZce7u-bc0-y4MG7RBUStGI7KGnLw" for "TestFTPProftpd" from environment variable RCLONE_CONFIG_TESTFTPPROFTPD_PASS
2025/03/10 08:02:41 DEBUG : Setting encoding="Asterisk,Ctl,Dot,Slash" for "TestFTPProftpd" from environment variable RCLONE_CONFIG_TESTFTPPROFTPD_ENCODING
2025/03/10 08:02:41 DEBUG : TestFTPProftpd: detected overridden config - adding "{7UpF6}" suffix to name
2025/03/10 08:02:41 DEBUG : Setting host="172.17.0.7" for "TestFTPProftpd" from environment variable RCLONE_CONFIG_TESTFTPPROFTPD_HOST
2025/03/10 08:02:41 DEBUG : Setting user="rclone" for "TestFTPProftpd" from environment variable RCLONE_CONFIG_TESTFTPPROFTPD_USER
2025/03/10 08:02:41 DEBUG : Setting pass="bs4dtJ-UhrkEMgPbFRZce7u-bc0-y4MG7RBUStGI7KGnLw" for "TestFTPProftpd" from environment variable RCLONE_CONFIG_TESTFTPPROFTPD_PASS
2025/03/10 08:02:41 DEBUG : Setting encoding="Asterisk,Ctl,Dot,Slash" for "TestFTPProftpd" from environment variable RCLONE_CONFIG_TESTFTPPROFTPD_ENCODING
2025/03/10 08:02:41 DEBUG : ftp://172.17.0.7:21/rclone-test-diyireg8sena/080240vo/changes/path1: Connecting to FTP server
2025/03/10 08:02:41 DEBUG : ftp://172.17.0.7:21/rclone-test-diyireg8sena/080240vo/changes/path1: dial("tcp","172.17.0.7:21")
2025/03/10 08:02:41 DEBUG : ftp://172.17.0.7:21/rclone-test-diyireg8sena/080240vo/changes/path1: > dial: conn=*fshttp.timeoutConn, err=<nil>
2025/03/10 08:02:41 DEBUG : fs cache: renaming cache item "TestFTPProftpd:rclone-test-diyireg8sena/080240vo/changes/path1" to be canonical "TestFTPProftpd{7UpF6}:rclone-test-diyireg8sena/080240vo/changes/path1"
2025/03/10 08:02:41 DEBUG : Creating backend with remote "/tmp/080240vo/changes/path2"
2025/03/10 08:02:41 DEBUG : Creating backend with remote "/home/rclone/go/src/github.com/rclone/rclone/cmd/bisync/testdata/test_changes/initial"
2025/03/10 08:02:41 DEBUG : Creating backend with remote "/tmp/080240vo/initdir/test_changes-metuwaj1"
2025/03/10 08:02:41 DEBUG : RCLONE_TEST: Need to transfer - File not found at Destination
2025/03/10 08:02:41 DEBUG : file1.txt: Need to transfer - File not found at Destination
2025/03/10 08:02:41 DEBUG : file2.txt: Need to transfer - File not found at Destination
2025/03/10 08:02:41 DEBUG : file3.txt: Need to transfer - File not found at Destination
2025/03/10 08:02:41 DEBUG : file4.txt: Need to transfer - File not found at Destination
2025/03/10 08:02:41 DEBUG : file5.txt: Need to transfer - File not found at Destination
2025/03/10 08:02:41 DEBUG : file6.txt: Need to transfer - File not found at Destination
2025/03/10 08:02:41 DEBUG : file7.txt: Need to transfer - File not found at Destination
2025/03/10 08:02:41 DEBUG : file8.txt: Need to transfer - File not found at Destination
2025/03/10 08:02:41 DEBUG : Local file system at /tmp/080240vo/initdir/test_changes-metuwaj1: Waiting for checks to finish
2025/03/10 08:02:41 DEBUG : Local file system at /tmp/080240vo/initdir/test_changes-metuwaj1: Waiting for transfers to finish
2025/03/10 08:02:41 DEBUG : file2.txt: md5 = d41d8cd98f00b204e9800998ecf8427e OK
2025/03/10 08:02:41 DEBUG : file2.txt.5028a97.partial: renamed to: file2.txt
2025/03/10 08:02:41 INFO  : file2.txt: Copied (new)
2025/03/10 08:02:41 DEBUG : file3.txt: md5 = d41d8cd98f00b204e9800998ecf8427e OK
2025/03/10 08:02:41 DEBUG : file3.txt.5028a97.partial: renamed to: file3.txt
2025/03/10 08:02:41 INFO  : file3.txt: Copied (new)
2025/03/10 08:02:41 DEBUG : file1.txt: md5 = d41d8cd98f00b204e9800998ecf8427e OK
2025/03/10 08:02:41 DEBUG : file1.txt.5028a97.partial: renamed to: file1.txt
2025/03/10 08:02:41 INFO  : file1.txt: Copied (new)
2025/03/10 08:02:41 DEBUG : file5.txt: md5 = d41d8cd98f00b204e9800998ecf8427e OK
2025/03/10 08:02:41 DEBUG : file6.txt: md5 = d41d8cd98f00b204e9800998ecf8427e OK
2025/03/10 08:02:41 DEBUG : file5.txt.5028a97.partial: renamed to: file5.txt
2025/03/10 08:02:41 DEBUG : file4.txt: md5 = d41d8cd98f00b204e9800998ecf8427e OK
2025/03/10 08:02:41 INFO  : file5.txt: Copied (new)
2025/03/10 08:02:41 DEBUG : file4.txt.5028a97.partial: renamed to: file4.txt
2025/03/10 08:02:41 INFO  : file4.txt: Copied (new)
2025/03/10 08:02:41 DEBUG : file7.txt: md5 = d41d8cd98f00b204e9800998ecf8427e OK
2025/03/10 08:02:41 DEBUG : file8.txt: md5 = d41d8cd98f00b204e9800998ecf8427e OK
2025/03/10 08:02:41 DEBUG : file7.txt.5028a97.partial: renamed to: file7.txt
2025/03/10 08:02:41 INFO  : file7.txt: Copied (new)
2025/03/10 08:02:41 DEBUG : file8.txt.5028a97.partial: renamed to: file8.txt
2025/03/10 08:02:41 INFO  : file8.txt: Copied (new)
2025/03/10 08:02:41 DEBUG : RCLONE_TEST: md5 = 294d25b294ff26a5243dba914ac3fbf7 OK
2025/03/10 08:02:41 DEBUG : RCLONE_TEST.cf9a93ac.partial: renamed to: RCLONE_TEST
2025/03/10 08:02:41 INFO  : RCLONE_TEST: Copied (new)
2025/03/10 08:02:41 DEBUG : file6.txt.5028a97.partial: renamed to: file6.txt
2025/03/10 08:02:41 INFO  : file6.txt: Copied (new)
2025/03/10 08:02:41 DEBUG : Creating backend with remote "/home/rclone/go/src/github.com/rclone/rclone/cmd/bisync/testdata/test_changes/modfiles"
2025/03/10 08:02:41 DEBUG : Creating backend with remote "/tmp/080240vo/datadir/test_changes-finitug1"
2025/03/10 08:02:41 DEBUG : file1.txt: Need to transfer - File not found at Destination
2025/03/10 08:02:41 DEBUG : file10.txt: Need to transfer - File not found at Destination
2025/03/10 08:02:41 DEBUG : file11.txt: Need to transfer - File not found at Destination
2025/03/10 08:02:41 DEBUG : file2.txt: Need to transfer - File not found at Destination
2025/03/10 08:02:41 DEBUG : file5L.txt: Need to transfer - File not found at Destination
2025/03/10 08:02:41 DEBUG : file5R.txt: Need to transfer - File not found at Destination
2025/03/10 08:02:41 DEBUG : file6.txt: Need to transfer - File not found at Destination
2025/03/10 08:02:41 DEBUG : file7.txt: Need to transfer - File not found at Destination
2025/03/10 08:02:41 DEBUG : Local file system at /tmp/080240vo/datadir/test_changes-finitug1: Waiting for checks to finish
2025/03/10 08:02:41 DEBUG : Local file system at /tmp/080240vo/datadir/test_changes-finitug1: Waiting for transfers to finish
2025/03/10 08:02:41 DEBUG : file1.txt: md5 = 7fe98ed88552b828777d8630900346b8 OK
2025/03/10 08:02:41 DEBUG : file10.txt: md5 = 7fe98ed88552b828777d8630900346b8 OK
2025/03/10 08:02:41 DEBUG : file1.txt.925c801f.partial: renamed to: file1.txt
2025/03/10 08:02:41 DEBUG : file10.txt.925c801f.partial: renamed to: file10.txt
2025/03/10 08:02:41 INFO  : file1.txt: Copied (new)
2025/03/10 08:02:41 INFO  : file10.txt: Copied (new)
2025/03/10 08:02:41 DEBUG : file11.txt: md5 = 7fe98ed88552b828777d8630900346b8 OK
2025/03/10 08:02:41 DEBUG : file11.txt.925c801f.partial: renamed to: file11.txt
2025/03/10 08:02:41 INFO  : file11.txt: Copied (new)
2025/03/10 08:02:41 DEBUG : file2.txt: md5 = fb3ecfb2800400fb01b0bfd39903e9fb OK
2025/03/10 08:02:41 DEBUG : file2.txt.f8ac1735.partial: renamed to: file2.txt
2025/03/10 08:02:41 INFO  : file2.txt: Copied (new)
2025/03/10 08:02:41 DEBUG : file5R.txt: md5 = 979a803b15d27df0c31ad7d29006d10b OK
2025/03/10 08:02:41 DEBUG : file5R.txt.aa998d0a.partial: renamed to: file5R.txt
2025/03/10 08:02:41 INFO  : file5R.txt: Copied (new)
2025/03/10 08:02:41 DEBUG : file5L.txt: md5 = 0860a03592626642f8fd6c8bfb447d2a OK
2025/03/10 08:02:41 DEBUG : file5L.txt.c32cc336.partial: renamed to: file5L.txt
2025/03/10 08:02:41 INFO  : file5L.txt: Copied (new)
2025/03/10 08:02:41 DEBUG : file6.txt: md5 = 7fe98ed88552b828777d8630900346b8 OK
2025/03/10 08:02:41 DEBUG : file6.txt.925c801f.partial: renamed to: file6.txt
2025/03/10 08:02:41 INFO  : file6.txt: Copied (new)
2025/03/10 08:02:41 DEBUG : file7.txt: md5 = 7fe98ed88552b828777d8630900346b8 OK
2025/03/10 08:02:41 DEBUG : file7.txt.925c801f.partial: renamed to: file7.txt
2025/03/10 08:02:41 INFO  : file7.txt: Copied (new)
2025/03/10 08:02:41 DEBUG : ftp://172.17.0.7:21/rclone-test-diyireg8sena/080240vo/changes/path1: dial("tcp","172.17.0.7:53614")
2025/03/10 08:02:41 DEBUG : ftp://172.17.0.7:21/rclone-test-diyireg8sena/080240vo/changes/path1: > dial: conn=*fshttp.timeoutConn, err=<nil>
2025/03/10 08:02:41 ERROR : : error listing: directory not found
2025/03/10 08:02:41 ERROR : : error listing: directory not found
2025/03/10 08:02:41 NOTICE: checking initFs Local file system at /tmp/080240vo/initdir/test_changes-metuwaj1
2025/03/10 08:02:41 DEBUG : ftp://172.17.0.7:21/rclone-test-diyireg8sena/080240vo/changes/path1: dial("tcp","172.17.0.7:17586")
2025/03/10 08:02:41 DEBUG : ftp://172.17.0.7:21/rclone-test-diyireg8sena/080240vo/changes/path1: > dial: conn=*fshttp.timeoutConn, err=<nil>
2025/03/10 08:02:41 DEBUG : RCLONE_TEST: Need to transfer - File not found at Destination
2025/03/10 08:02:41 DEBUG : file1.txt: Need to transfer - File not found at Destination
2025/03/10 08:02:41 DEBUG : file2.txt: Need to transfer - File not found at Destination
2025/03/10 08:02:41 DEBUG : file3.txt: Need to transfer - File not found at Destination
2025/03/10 08:02:41 DEBUG : file4.txt: Need to transfer - File not found at Destination
2025/03/10 08:02:41 DEBUG : file5.txt: Need to transfer - File not found at Destination
2025/03/10 08:02:41 DEBUG : file6.txt: Need to transfer - File not found at Destination
2025/03/10 08:02:41 DEBUG : file7.txt: Need to transfer - File not found at Destination
2025/03/10 08:02:41 DEBUG : file8.txt: Need to transfer - File not found at Destination
2025/03/10 08:02:41 DEBUG : ftp://172.17.0.7:21/rclone-test-diyireg8sena/080240vo/changes/path1: Waiting for checks to finish
2025/03/10 08:02:41 DEBUG : ftp://172.17.0.7:21/rclone-test-diyireg8sena/080240vo/changes/path1: Connecting to FTP server
2025/03/10 08:02:41 DEBUG : ftp://172.17.0.7:21/rclone-test-diyireg8sena/080240vo/changes/path1: dial("tcp","172.17.0.7:21")
2025/03/10 08:02:41 DEBUG : ftp://172.17.0.7:21/rclone-test-diyireg8sena/080240vo/changes/path1: Connecting to FTP server
2025/03/10 08:02:41 DEBUG : ftp://172.17.0.7:21/rclone-test-diyireg8sena/080240vo/changes/path1: Waiting for transfers to finish
2025/03/10 08:02:41 DEBUG : ftp://172.17.0.7:21/rclone-test-diyireg8sena/080240vo/changes/path1: Connecting to FTP server
2025/03/10 08:02:41 DEBUG : ftp://172.17.0.7:21/rclone-test-diyireg8sena/080240vo/changes/path1: > dial: conn=*fshttp.timeoutConn, err=<nil>
2025/03/10 08:02:41 DEBUG : ftp://172.17.0.7:21/rclone-test-diyireg8sena/080240vo/changes/path1: dial("tcp","172.17.0.7:41640")
2025/03/10 08:02:41 DEBUG : ftp://172.17.0.7:21/rclone-test-diyireg8sena/080240vo/changes/path1: > dial: conn=*fshttp.timeoutConn, err=<nil>
2025/03/10 08:02:41 DEBUG : file1.txt.5028a97.partial: renamed to: file1.txt
2025/03/10 08:02:41 INFO  : file1.txt: Copied (new)
2025/03/10 08:02:41 DEBUG : ftp://172.17.0.7:21/rclone-test-diyireg8sena/080240vo/changes/path1: dial("tcp","172.17.0.7:52021")
2025/03/10 08:02:41 DEBUG : ftp://172.17.0.7:21/rclone-test-diyireg8sena/080240vo/changes/path1: > dial: conn=*fshttp.timeoutConn, err=<nil>
2025/03/10 08:02:41 DEBUG : file4.txt.5028a97.partial: renamed to: file4.txt
2025/03/10 08:02:41 INFO  : file4.txt: Copied (new)
2025/03/10 08:02:41 DEBUG : ftp://172.17.0.7:21/rclone-test-diyireg8sena/080240vo/changes/path1: dial("tcp","172.17.0.7:39758")
2025/03/10 08:02:41 DEBUG : ftp://172.17.0.7:21/rclone-test-diyireg8sena/080240vo/changes/path1: > dial: conn=*fshttp.timeoutConn, err=<nil>
2025/03/10 08:02:41 DEBUG : ftp://172.17.0.7:21/rclone-test-diyireg8sena/080240vo/changes/path1: dial("tcp","172.17.0.7:64891")
2025/03/10 08:02:41 DEBUG : ftp://172.17.0.7:21/rclone-test-diyireg8sena/080240vo/changes/path1: > dial: conn=*fshttp.timeoutConn, err=<nil>
2025/03/10 08:02:41 DEBUG : file5.txt.5028a97.partial: renamed to: file5.txt
2025/03/10 08:02:41 INFO  : file5.txt: Copied (new)
2025/03/10 08:02:41 DEBUG : ftp://172.17.0.7:21/rclone-test-diyireg8sena/080240vo/changes/path1: dial("tcp","172.17.0.7:25590")
2025/03/10 08:02:41 DEBUG : ftp://172.17.0.7:21/rclone-test-diyireg8sena/080240vo/changes/path1: > dial: conn=*fshttp.timeoutConn, err=<nil>
2025/03/10 08:02:41 DEBUG : RCLONE_TEST.cf9a93ac.partial: renamed to: RCLONE_TEST
2025/03/10 08:02:41 INFO  : RCLONE_TEST: Copied (new)
2025/03/10 08:02:41 DEBUG : ftp://172.17.0.7:21/rclone-test-diyireg8sena/080240vo/changes/path1: dial("tcp","172.17.0.7:62364")
2025/03/10 08:02:41 DEBUG : ftp://172.17.0.7:21/rclone-test-diyireg8sena/080240vo/changes/path1: > dial: conn=*fshttp.timeoutConn, err=<nil>
2025/03/10 08:02:41 DEBUG : file6.txt.5028a97.partial: renamed to: file6.txt
2025/03/10 08:02:41 INFO  : file6.txt: Copied (new)
2025/03/10 08:02:41 DEBUG : ftp://172.17.0.7:21/rclone-test-diyireg8sena/080240vo/changes/path1: dial("tcp","172.17.0.7:21")
2025/03/10 08:02:41 DEBUG : ftp://172.17.0.7:21/rclone-test-diyireg8sena/080240vo/changes/path1: > dial: conn=*fshttp.timeoutConn, err=<nil>
2025/03/10 08:02:41 DEBUG : ftp://172.17.0.7:21/rclone-test-diyireg8sena/080240vo/changes/path1: dial("tcp","172.17.0.7:47564")
2025/03/10 08:02:41 DEBUG : ftp://172.17.0.7:21/rclone-test-diyireg8sena/080240vo/changes/path1: > dial: conn=*fshttp.timeoutConn, err=<nil>
2025/03/10 08:02:41 DEBUG : file7.txt.5028a97.partial: renamed to: file7.txt
2025/03/10 08:02:41 INFO  : file7.txt: Copied (new)
2025/03/10 08:02:41 DEBUG : file8.txt.5028a97.partial: renamed to: file8.txt
2025/03/10 08:02:41 INFO  : file8.txt: Copied (new)
2025/03/10 08:02:41 DEBUG : ftp://172.17.0.7:21/rclone-test-diyireg8sena/080240vo/changes/path1: dial("tcp","172.17.0.7:45829")
2025/03/10 08:02:41 DEBUG : ftp://172.17.0.7:21/rclone-test-diyireg8sena/080240vo/changes/path1: > dial: conn=*fshttp.timeoutConn, err=<nil>
2025/03/10 08:02:41 DEBUG : file3.txt.5028a97.partial: renamed to: file3.txt
2025/03/10 08:02:41 INFO  : file3.txt: Copied (new)
2025/03/10 08:02:41 DEBUG : ftp://172.17.0.7:21/rclone-test-diyireg8sena/080240vo/changes/path1: dial("tcp","172.17.0.7:21")
2025/03/10 08:02:41 DEBUG : ftp://172.17.0.7:21/rclone-test-diyireg8sena/080240vo/changes/path1: > dial: conn=*fshttp.timeoutConn, err=<nil>
2025/03/10 08:02:41 DEBUG : ftp://172.17.0.7:21/rclone-test-diyireg8sena/080240vo/changes/path1: dial("tcp","172.17.0.7:57807")
2025/03/10 08:02:41 DEBUG : ftp://172.17.0.7:21/rclone-test-diyireg8sena/080240vo/changes/path1: > dial: conn=*fshttp.timeoutConn, err=<nil>
2025/03/10 08:02:41 DEBUG : file2.txt.5028a97.partial: renamed to: file2.txt
2025/03/10 08:02:41 INFO  : file2.txt: Copied (new)
2025/03/10 08:02:41 NOTICE: checking Path1 ftp://172.17.0.7:21/rclone-test-diyireg8sena/080240vo/changes/path1
2025/03/10 08:02:41 DEBUG : ftp://172.17.0.7:21/rclone-test-diyireg8sena/080240vo/changes/path1: dial("tcp","172.17.0.7:56376")
2025/03/10 08:02:41 DEBUG : ftp://172.17.0.7:21/rclone-test-diyireg8sena/080240vo/changes/path1: > dial: conn=*fshttp.timeoutConn, err=<nil>
2025/03/10 08:02:41 DEBUG : RCLONE_TEST: Need to transfer - File not found at Destination
2025/03/10 08:02:41 DEBUG : file1.txt: Need to transfer - File not found at Destination
2025/03/10 08:02:41 DEBUG : file2.txt: Need to transfer - File not found at Destination
2025/03/10 08:02:41 DEBUG : file3.txt: Need to transfer - File not found at Destination
2025/03/10 08:02:41 DEBUG : file4.txt: Need to transfer - File not found at Destination
2025/03/10 08:02:41 DEBUG : file5.txt: Need to transfer - File not found at Destination
2025/03/10 08:02:41 DEBUG : file6.txt: Need to transfer - File not found at Destination
2025/03/10 08:02:41 DEBUG : file7.txt: Need to transfer - File not found at Destination
2025/03/10 08:02:41 DEBUG : file8.txt: Need to transfer - File not found at Destination
2025/03/10 08:02:41 DEBUG : Local file system at /tmp/080240vo/changes/path2: Waiting for checks to finish
2025/03/10 08:02:41 DEBUG : Local file system at /tmp/080240vo/changes/path2: Waiting for transfers to finish
2025/03/10 08:02:41 DEBUG : RCLONE_TEST: md5 = 294d25b294ff26a5243dba914ac3fbf7 OK
2025/03/10 08:02:41 DEBUG : RCLONE_TEST.cf9a93ac.partial: renamed to: RCLONE_TEST
2025/03/10 08:02:41 INFO  : RCLONE_TEST: Copied (new)
2025/03/10 08:02:41 DEBUG : file1.txt: md5 = d41d8cd98f00b204e9800998ecf8427e OK
2025/03/10 08:02:41 DEBUG : file1.txt.5028a97.partial: renamed to: file1.txt
2025/03/10 08:02:41 INFO  : file1.txt: Copied (new)
2025/03/10 08:02:41 DEBUG : file3.txt: md5 = d41d8cd98f00b204e9800998ecf8427e OK
2025/03/10 08:02:41 DEBUG : file3.txt.5028a97.partial: renamed to: file3.txt
2025/03/10 08:02:41 INFO  : file3.txt: Copied (new)
2025/03/10 08:02:41 DEBUG : file4.txt: md5 = d41d8cd98f00b204e9800998ecf8427e OK
2025/03/10 08:02:41 DEBUG : file4.txt.5028a97.partial: renamed to: file4.txt
2025/03/10 08:02:41 INFO  : file4.txt: Copied (new)
2025/03/10 08:02:41 DEBUG : file5.txt: md5 = d41d8cd98f00b204e9800998ecf8427e OK
2025/03/10 08:02:41 DEBUG : file5.txt.5028a97.partial: renamed to: file5.txt
2025/03/10 08:02:41 INFO  : file5.txt: Copied (new)
2025/03/10 08:02:41 DEBUG : file6.txt: md5 = d41d8cd98f00b204e9800998ecf8427e OK
2025/03/10 08:02:41 DEBUG : file6.txt.5028a97.partial: renamed to: file6.txt
2025/03/10 08:02:41 INFO  : file6.txt: Copied (new)
2025/03/10 08:02:41 DEBUG : file7.txt: md5 = d41d8cd98f00b204e9800998ecf8427e OK
2025/03/10 08:02:41 DEBUG : file7.txt.5028a97.partial: renamed to: file7.txt
2025/03/10 08:02:41 INFO  : file7.txt: Copied (new)
2025/03/10 08:02:41 DEBUG : file2.txt: md5 = d41d8cd98f00b204e9800998ecf8427e OK
2025/03/10 08:02:41 DEBUG : file2.txt.5028a97.partial: renamed to: file2.txt
2025/03/10 08:02:41 INFO  : file2.txt: Copied (new)
2025/03/10 08:02:41 DEBUG : file8.txt: md5 = d41d8cd98f00b204e9800998ecf8427e OK
2025/03/10 08:02:41 DEBUG : file8.txt.5028a97.partial: renamed to: file8.txt
2025/03/10 08:02:41 INFO  : file8.txt: Copied (new)
2025/03/10 08:02:41 NOTICE: checking path2 Local file system at /tmp/080240vo/changes/path2
2025/03/10 08:02:41 NOTICE: (01)  : test changes
2025/03/10 08:02:41 NOTICE: (02)  : test initial bisync
2025/03/10 08:02:41 NOTICE: (03)  : bisync resync
2025/03/10 08:02:41 INFO  : Setting --ignore-listing-checksum as neither --checksum nor --compare checksum are set.
2025/03/10 08:02:41 INFO  : Bisyncing with Comparison Settings: 
{
	"Modtime": true,
	"Size": true,
	"Checksum": false,
	"HashType1": 0,
	"HashType2": 0,
	"NoSlowHash": false,
	"SlowHashSyncOnly": false,
	"SlowHashDetected": true,
	"DownloadHash": false
}
2025/03/10 08:02:41 INFO  : Synching Path1 "TestFTPProftpd{7UpF6}:rclone-test-diyireg8sena/080240vo/changes/path1/" with Path2 "/tmp/080240vo/changes/path2/"
2025/03/10 08:02:41 INFO  : Copying Path2 files to Path1
2025/03/10 08:02:41 INFO  : - Path2    Resync is copying files to         - Path1
2025/03/10 08:02:41 INFO  : - Path1    Resync is copying files to         - Path2
2025/03/10 08:02:41 INFO  : Resync updating listings
2025/03/10 08:02:41 INFO  : Validating listings for Path1 "TestFTPProftpd{7UpF6}:rclone-test-diyireg8sena/080240vo/changes/path1/" vs Path2 "/tmp/080240vo/changes/path2/"
2025/03/10 08:02:41 INFO  : Bisync successful
2025/03/10 08:02:41 NOTICE: (04)  : test make modifications on both paths
2025/03/10 08:02:41 NOTICE: (05)  : test new on path2 - file10
2025/03/10 08:02:41 NOTICE: (06)  : touch-copy 2001-01-02 /tmp/080240vo/datadir/test_changes-finitug1/file10.txt /tmp/080240vo/changes/path2/
2025/03/10 08:02:41 INFO  : file10.txt: Copied (new)
2025/03/10 08:02:41 NOTICE: (07)  : test newer on path2 - file1
2025/03/10 08:02:41 NOTICE: (08)  : touch-copy 2001-01-02 /tmp/080240vo/datadir/test_changes-finitug1/file1.txt /tmp/080240vo/changes/path2/
2025/03/10 08:02:41 INFO  : file1.txt: Copied (replaced existing)
2025/03/10 08:02:41 NOTICE: (09)  : test new on path1 - file11
2025/03/10 08:02:41 NOTICE: (10)  : touch-copy 2001-01-02 /tmp/080240vo/datadir/test_changes-finitug1/file11.txt TestFTPProftpd,encoding='Asterisk,Ctl,Dot,Slash',host='172.17.0.7',pass='bs4dtJ-UhrkEMgPbFRZce7u-bc0-y4MG7RBUStGI7KGnLw',user='rclone':rclone-test-diyireg8sena/080240vo/changes/path1/
    bisync_test.go:495: 
        	Error Trace:	/home/rclone/go/src/github.com/rclone/rclone/cmd/bisync/bisync_test.go:495
        	            				/home/rclone/go/src/github.com/rclone/rclone/cmd/bisync/bisync_test.go:358
        	Error:      	test step failed
        	Test:       	TestBisyncRemoteLocal/changes
        	Messages:   	step 10 failed: NewFs: failed to make FTP connection to "172.17.0.7:21": EOF
=== RUN   TestBisyncRemoteLocal/check_access
2025/03/10 08:02:45 DEBUG : fs cache: switching user supplied name "TestFTPProftpd:rclone-test-diyireg8sena/080240vo" for canonical name "TestFTPProftpd{7UpF6}:rclone-test-diyireg8sena/080240vo"
2025/03/10 08:02:45 INFO  : path1: Making directory
2025/03/10 08:02:45 DEBUG : Creating backend with remote "TestFTPProftpd:rclone-test-diyireg8sena/080240vo/check_access/path1"
2025/03/10 08:02:45 DEBUG : Setting type="ftp" for "TestFTPProftpd" from environment variable RCLONE_CONFIG_TESTFTPPROFTPD_TYPE
2025/03/10 08:02:45 DEBUG : Setting host="172.17.0.7" for "TestFTPProftpd" from environment variable RCLONE_CONFIG_TESTFTPPROFTPD_HOST
2025/03/10 08:02:45 DEBUG : Setting user="rclone" for "TestFTPProftpd" from environment variable RCLONE_CONFIG_TESTFTPPROFTPD_USER
2025/03/10 08:02:45 DEBUG : Setting pass="bs4dtJ-UhrkEMgPbFRZce7u-bc0-y4MG7RBUStGI7KGnLw" for "TestFTPProftpd" from environment variable RCLONE_CONFIG_TESTFTPPROFTPD_PASS
2025/03/10 08:02:45 DEBUG : Setting encoding="Asterisk,Ctl,Dot,Slash" for "TestFTPProftpd" from environment variable RCLONE_CONFIG_TESTFTPPROFTPD_ENCODING
2025/03/10 08:02:45 DEBUG : TestFTPProftpd: detected overridden config - adding "{7UpF6}" suffix to name
2025/03/10 08:02:45 DEBUG : Setting host="172.17.0.7" for "TestFTPProftpd" from environment variable RCLONE_CONFIG_TESTFTPPROFTPD_HOST
2025/03/10 08:02:45 DEBUG : Setting user="rclone" for "TestFTPProftpd" from environment variable RCLONE_CONFIG_TESTFTPPROFTPD_USER
2025/03/10 08:02:45 DEBUG : Setting pass="bs4dtJ-UhrkEMgPbFRZce7u-bc0-y4MG7RBUStGI7KGnLw" for "TestFTPProftpd" from environment variable RCLONE_CONFIG_TESTFTPPROFTPD_PASS
2025/03/10 08:02:45 DEBUG : Setting encoding="Asterisk,Ctl,Dot,Slash" for "TestFTPProftpd" from environment variable RCLONE_CONFIG_TESTFTPPROFTPD_ENCODING
2025/03/10 08:02:45 DEBUG : ftp://172.17.0.7:21/rclone-test-diyireg8sena/080240vo/check_access/path1: Connecting to FTP server
2025/03/10 08:02:45 DEBUG : ftp://172.17.0.7:21/rclone-test-diyireg8sena/080240vo/check_access/path1: dial("tcp","172.17.0.7:21")
2025/03/10 08:02:45 DEBUG : ftp://172.17.0.7:21/rclone-test-diyireg8sena/080240vo/check_access/path1: > dial: conn=*fshttp.timeoutConn, err=<nil>
2025/03/10 08:02:45 DEBUG : pacer: low level retry 1/10 (error EOF)
2025/03/10 08:02:45 DEBUG : pacer: Rate limited, increasing sleep to 20ms
2025/03/10 08:02:45 DEBUG : ftp://172.17.0.7:21/rclone-test-diyireg8sena/080240vo/check_access/path1: dial("tcp","172.17.0.7:21")
2025/03/10 08:02:45 DEBUG : ftp://172.17.0.7:21/rclone-test-diyireg8sena/080240vo/check_access/path1: > dial: conn=*fshttp.timeoutConn, err=<nil>
2025/03/10 08:02:45 DEBUG : pacer: low level retry 2/10 (error EOF)
2025/03/10 08:02:45 DEBUG : pacer: Rate limited, increasing sleep to 40ms
2025/03/10 08:02:45 DEBUG : ftp://172.17.0.7:21/rclone-test-diyireg8sena/080240vo/check_access/path1: dial("tcp","172.17.0.7:21")
2025/03/10 08:02:45 DEBUG : ftp://172.17.0.7:21/rclone-test-diyireg8sena/080240vo/check_access/path1: > dial: conn=*fshttp.timeoutConn, err=<nil>
2025/03/10 08:02:45 DEBUG : pacer: low level retry 3/10 (error EOF)
2025/03/10 08:02:45 DEBUG : pacer: Rate limited, increasing sleep to 80ms
2025/03/10 08:02:45 DEBUG : ftp://172.17.0.7:21/rclone-test-diyireg8sena/080240vo/check_access/path1: dial("tcp","172.17.0.7:21")
2025/03/10 08:02:45 DEBUG : ftp://172.17.0.7:21/rclone-test-diyireg8sena/080240vo/check_access/path1: > dial: conn=*fshttp.timeoutConn, err=<nil>
2025/03/10 08:02:45 DEBUG : pacer: low level retry 4/10 (error EOF)
2025/03/10 08:02:45 DEBUG : pacer: Rate limited, increasing sleep to 160ms
2025/03/10 08:02:45 DEBUG : ftp://172.17.0.7:21/rclone-test-diyireg8sena/080240vo/check_access/path1: dial("tcp","172.17.0.7:21")
2025/03/10 08:02:45 DEBUG : ftp://172.17.0.7:21/rclone-test-diyireg8sena/080240vo/check_access/path1: > dial: conn=*fshttp.timeoutConn, err=<nil>
2025/03/10 08:02:45 DEBUG : pacer: low level retry 5/10 (error EOF)
2025/03/10 08:02:45 DEBUG : pacer: Rate limited, increasing sleep to 320ms
2025/03/10 08:02:46 DEBUG : ftp://172.17.0.7:21/rclone-test-diyireg8sena/080240vo/check_access/path1: dial("tcp","172.17.0.7:21")
2025/03/10 08:02:46 DEBUG : ftp://172.17.0.7:21/rclone-test-diyireg8sena/080240vo/check_access/path1: > dial: conn=*fshttp.timeoutConn, err=<nil>
2025/03/10 08:02:46 DEBUG : pacer: low level retry 6/10 (error EOF)
2025/03/10 08:02:46 DEBUG : pacer: Rate limited, increasing sleep to 640ms
2025/03/10 08:02:46 DEBUG : ftp://172.17.0.7:21/rclone-test-diyireg8sena/080240vo/check_access/path1: dial("tcp","172.17.0.7:21")
2025/03/10 08:02:46 DEBUG : ftp://172.17.0.7:21/rclone-test-diyireg8sena/080240vo/check_access/path1: > dial: conn=*fshttp.timeoutConn, err=<nil>
2025/03/10 08:02:46 DEBUG : pacer: low level retry 7/10 (error EOF)
2025/03/10 08:02:46 DEBUG : pacer: Rate limited, increasing sleep to 1.28s
2025/03/10 08:02:47 DEBUG : ftp://172.17.0.7:21/rclone-test-diyireg8sena/080240vo/check_access/path1: dial("tcp","172.17.0.7:21")
2025/03/10 08:02:47 DEBUG : ftp://172.17.0.7:21/rclone-test-diyireg8sena/080240vo/check_access/path1: > dial: conn=*fshttp.timeoutConn, err=<nil>
2025/03/10 08:02:47 DEBUG : pacer: low level retry 8/10 (error EOF)
2025/03/10 08:02:47 DEBUG : pacer: Rate limited, increasing sleep to 2s
2025/03/10 08:02:48 DEBUG : ftp://172.17.0.7:21/rclone-test-diyireg8sena/080240vo/check_access/path1: dial("tcp","172.17.0.7:21")
2025/03/10 08:02:48 DEBUG : ftp://172.17.0.7:21/rclone-test-diyireg8sena/080240vo/check_access/path1: > dial: conn=*fshttp.timeoutConn, err=<nil>
2025/03/10 08:02:48 DEBUG : pacer: low level retry 9/10 (error EOF)
2025/03/10 08:02:50 DEBUG : ftp://172.17.0.7:21/rclone-test-diyireg8sena/080240vo/check_access/path1: dial("tcp","172.17.0.7:21")
2025/03/10 08:02:50 DEBUG : ftp://172.17.0.7:21/rclone-test-diyireg8sena/080240vo/check_access/path1: > dial: conn=*fshttp.timeoutConn, err=<nil>
2025/03/10 08:02:50 DEBUG : pacer: low level retry 10/10 (error EOF)
    bisync_test.go:1943: 
        	Error Trace:	/home/rclone/go/src/github.com/rclone/rclone/cmd/bisync/bisync_test.go:1943
        	            				/home/rclone/go/src/github.com/rclone/rclone/cmd/bisync/bisync_test.go:594
        	            				/home/rclone/go/src/github.com/rclone/rclone/cmd/bisync/bisync_test.go:385
        	            				/home/rclone/go/src/github.com/rclone/rclone/cmd/bisync/bisync_test.go:358
        	Error:      	Received unexpected error:
        	            	NewFs: failed to make FTP connection to "172.17.0.7:21": EOF
        	Test:       	TestBisyncRemoteLocal/check_access
        	Messages:   	parsing remote/subdir TestFTPProftpd:rclone-test-diyireg8sena/080240vo/path1
--- FAIL: TestBisyncRemoteLocal (9.71s)
    --- PASS: TestBisyncRemoteLocal/all_changed (0.33s)
    --- SKIP: TestBisyncRemoteLocal/backupdir (0.05s)
    --- PASS: TestBisyncRemoteLocal/basic (0.14s)
    --- FAIL: TestBisyncRemoteLocal/changes (4.62s)
    --- FAIL: TestBisyncRemoteLocal/check_access (4.56s)
panic: runtime error: invalid memory address or nil pointer dereference [recovered]
	panic: runtime error: invalid memory address or nil pointer dereference
[signal SIGSEGV: segmentation violation code=0x1 addr=0x28 pc=0xa4a7dc]

goroutine 2718 [running]:
testing.tRunner.func1.2({0x21ee3e0, 0x3d9f6c0})
	/home/rclone/go/pkg/mod/golang.org/toolchain@v0.0.1-go1.23.0.linux-amd64/src/testing/testing.go:1632 +0x230
testing.tRunner.func1()
	/home/rclone/go/pkg/mod/golang.org/toolchain@v0.0.1-go1.23.0.linux-amd64/src/testing/testing.go:1635 +0x35e
panic({0x21ee3e0?, 0x3d9f6c0?})
	/home/rclone/go/pkg/mod/golang.org/toolchain@v0.0.1-go1.23.0.linux-amd64/src/runtime/panic.go:785 +0x132
github.com/rclone/rclone/cmd/bisync/bilib.FsPath({0x0, 0x0})
	/home/rclone/go/src/github.com/rclone/rclone/cmd/bisync/bilib/canonical.go:18 +0x1c
github.com/rclone/rclone/cmd/bisync_test.(*bisyncTest).makeTempRemote(0xc000d08000, {0x2aab1a0, 0x3e4ad20}, {0xc0007ae3f0, 0x27}, {0x2656cad, 0x5})
	/home/rclone/go/src/github.com/rclone/rclone/cmd/bisync/bisync_test.go:595 +0x70d
github.com/rclone/rclone/cmd/bisync_test.(*bisyncTest).runTestCase(0xc000d08000, {0x2aab1a0, 0x3e4ad20}, 0x605?, {0xc000056d25?, 0x5599c0?})
	/home/rclone/go/src/github.com/rclone/rclone/cmd/bisync/bisync_test.go:385 +0xa5
github.com/rclone/rclone/cmd/bisync_test.testBisync.func4(0xc00016a4e0)
	/home/rclone/go/src/github.com/rclone/rclone/cmd/bisync/bisync_test.go:358 +0x234
testing.tRunner(0xc00016a4e0, 0xc00097c0c0)
	/home/rclone/go/pkg/mod/golang.org/toolchain@v0.0.1-go1.23.0.linux-amd64/src/testing/testing.go:1690 +0xf4
created by testing.(*T).Run in goroutine 36
	/home/rclone/go/pkg/mod/golang.org/toolchain@v0.0.1-go1.23.0.linux-amd64/src/testing/testing.go:1743 +0x390
"./bisync.test -test.v -test.timeout 1h0m0s -remote TestFTPProftpd: -verbose" - Finished ERROR in 9.930120693s (try 1/5): exit status 2: Failed [TestBisyncRemoteLocal/changes TestBisyncRemoteLocal/check_access]