"./sync.test -test.v -test.timeout 1h0m0s -remote 'TestGoogleCloudStorage,directory_markers:' -verbose -test.run '^(TestSyncCompareDest|TestSyncMultipleCompareDest|TestSyncOverlapWithFilter)$'" - Starting (try 4/5)
2025/03/06 01:49:16 DEBUG : Creating backend with remote "TestGoogleCloudStorage,directory_markers:rclone-test-doxaduw2yope"
2025/03/06 01:49:16 DEBUG : Using config file from "/home/rclone/.rclone.conf"
2025/03/06 01:49:16 DEBUG : TestGoogleCloudStorage: detected overridden config - adding "{juk_h}" suffix to name
2025/03/06 01:49:16 DEBUG : Creating backend with remote "/tmp/rclone3002156174"
=== RUN   TestSyncOverlapWithFilter
    run.go:180: Remote "GCS bucket rclone-test-doxaduw2yope", Local "Local file system at /tmp/rclone3002156174", Modify Window "1ns"
2025/03/06 01:49:16 DEBUG : Creating backend with remote "TestGoogleCloudStorage,directory_markers:rclone-test-doxaduw2yope/rclone-sync-test"
2025/03/06 01:49:16 DEBUG : TestGoogleCloudStorage: detected overridden config - adding "{juk_h}" suffix to name
2025/03/06 01:49:18 DEBUG : /: Creating directory marker
2025/03/06 01:49:18 DEBUG : Creating backend with remote "TestGoogleCloudStorage,directory_markers:rclone-test-doxaduw2yope/rclone-sync-test-include/layer2"
2025/03/06 01:49:18 DEBUG : TestGoogleCloudStorage: detected overridden config - adding "{juk_h}" suffix to name
2025/03/06 01:49:19 DEBUG : /: Creating directory marker
2025/03/06 01:49:20 DEBUG : Creating backend with remote "TestGoogleCloudStorage,directory_markers:rclone-test-doxaduw2yope/rclone-sync-test-ignore-file"
2025/03/06 01:49:20 DEBUG : TestGoogleCloudStorage: detected overridden config - adding "{juk_h}" suffix to name
2025/03/06 01:49:21 DEBUG : /: Creating directory marker
2025/03/06 01:49:21 DEBUG : rclone-sync-test-ignore-file/: Creating directory marker
2025/03/06 01:49:22 DEBUG : rclone-sync-test-ignore-file: Excluded
2025/03/06 01:49:23 ERROR : : Entry doesn't belong in directory "" (same as directory) - ignoring
2025/03/06 01:49:23 DEBUG : rclone-sync-test: Excluded
2025/03/06 01:49:24 DEBUG : rclone-sync-test-include/layer2: Excluded
2025/03/06 01:49:24 DEBUG : GCS bucket rclone-test-doxaduw2yope path rclone-sync-test: Waiting for checks to finish
2025/03/06 01:49:24 DEBUG : GCS bucket rclone-test-doxaduw2yope path rclone-sync-test: Waiting for transfers to finish
2025/03/06 01:49:24 DEBUG : Waiting for deletions to finish
2025/03/06 01:49:24 INFO  : There was nothing to transfer
2025/03/06 01:49:24 DEBUG : rclone-sync-test-ignore-file: Excluded
2025/03/06 01:49:24 ERROR : : Entry doesn't belong in directory "" (same as directory) - ignoring
2025/03/06 01:49:25 DEBUG : rclone-sync-test: Excluded
2025/03/06 01:49:25 DEBUG : rclone-sync-test-include/layer2: Excluded
2025/03/06 01:49:25 DEBUG : GCS bucket rclone-test-doxaduw2yope: Waiting for checks to finish
2025/03/06 01:49:25 DEBUG : GCS bucket rclone-test-doxaduw2yope: Waiting for transfers to finish
2025/03/06 01:49:25 DEBUG : Waiting for deletions to finish
2025/03/06 01:49:25 INFO  : rclone-sync-test-include: Removing directory
2025/03/06 01:49:25 DEBUG : rclone-sync-test-include/: Removing directory marker
2025/03/06 01:49:25 DEBUG : rclone-sync-test-include: Failed to Rmdir: removing directory marker failed: googleapi: Error 404: No such object: rclone-test-doxaduw2yope/rclone-sync-test-include/, notFound
2025/03/06 01:49:25 DEBUG : GCS bucket rclone-test-doxaduw2yope: failed to delete 1 directories
2025/03/06 01:49:25 INFO  : There was nothing to transfer
    run.go:180: Remote "GCS bucket rclone-test-doxaduw2yope", Local "Local file system at /tmp/rclone3002156174", Modify Window "1ns"
2025/03/06 01:49:26 DEBUG : rclone-sync-test-ignore-file: Excluded
2025/03/06 01:49:26 DEBUG : rclone-sync-test: Excluded
2025/03/06 01:49:27 DEBUG : rclone-sync-test-include/layer2: Excluded
    run.go:180: Remote "GCS bucket rclone-test-doxaduw2yope", Local "Local file system at /tmp/rclone3002156174", Modify Window "1ns"
2025/03/06 01:49:27 DEBUG : rclone-sync-test-ignore-file: Excluded
2025/03/06 01:49:28 DEBUG : rclone-sync-test: Excluded
2025/03/06 01:49:28 DEBUG : rclone-sync-test-include/layer2: Excluded
    run.go:180: Remote "GCS bucket rclone-test-doxaduw2yope", Local "Local file system at /tmp/rclone3002156174", Modify Window "1ns"
2025/03/06 01:49:28 DEBUG : rclone-sync-test-ignore-file: Excluded
2025/03/06 01:49:29 DEBUG : rclone-sync-test: Excluded
2025/03/06 01:49:30 DEBUG : rclone-sync-test-include/layer2: Excluded
    run.go:180: Remote "GCS bucket rclone-test-doxaduw2yope", Local "Local file system at /tmp/rclone3002156174", Modify Window "1ns"
2025/03/06 01:49:30 DEBUG : rclone-sync-test-ignore-file: Excluded
2025/03/06 01:49:30 DEBUG : rclone-sync-test: Excluded
2025/03/06 01:49:31 DEBUG : rclone-sync-test-include/layer2: Excluded
    run.go:180: Remote "GCS bucket rclone-test-doxaduw2yope", Local "Local file system at /tmp/rclone3002156174", Modify Window "1ns"
2025/03/06 01:49:31 DEBUG : rclone-sync-test-ignore-file: Excluded
2025/03/06 01:49:32 DEBUG : rclone-sync-test: Excluded
2025/03/06 01:49:32 DEBUG : rclone-sync-test-include/layer2: Excluded
    run.go:180: Remote "GCS bucket rclone-test-doxaduw2yope", Local "Local file system at /tmp/rclone3002156174", Modify Window "1ns"
2025/03/06 01:49:33 DEBUG : rclone-sync-test-ignore-file: Excluded
2025/03/06 01:49:33 DEBUG : rclone-sync-test: Excluded
2025/03/06 01:49:34 DEBUG : rclone-sync-test-include/layer2: Excluded
2025/03/06 01:49:34 DEBUG : rclone-sync-test-ignore-file: Excluded
2025/03/06 01:49:35 ERROR : : Entry doesn't belong in directory "" (same as directory) - ignoring
2025/03/06 01:49:35 DEBUG : rclone-sync-test: Excluded
2025/03/06 01:49:35 DEBUG : rclone-sync-test-include/layer2: Excluded
2025/03/06 01:49:35 DEBUG : GCS bucket rclone-test-doxaduw2yope path rclone-sync-test-include/layer2: Waiting for checks to finish
2025/03/06 01:49:35 DEBUG : GCS bucket rclone-test-doxaduw2yope path rclone-sync-test-include/layer2: Waiting for transfers to finish
2025/03/06 01:49:35 DEBUG : Waiting for deletions to finish
2025/03/06 01:49:35 INFO  : There was nothing to transfer
    run.go:180: Remote "GCS bucket rclone-test-doxaduw2yope", Local "Local file system at /tmp/rclone3002156174", Modify Window "1ns"
2025/03/06 01:49:35 DEBUG : rclone-sync-test-ignore-file: Excluded
2025/03/06 01:49:36 DEBUG : rclone-sync-test: Excluded
2025/03/06 01:49:36 DEBUG : rclone-sync-test-include/layer2: Excluded
    run.go:180: Remote "GCS bucket rclone-test-doxaduw2yope", Local "Local file system at /tmp/rclone3002156174", Modify Window "1ns"
2025/03/06 01:49:37 DEBUG : rclone-sync-test-ignore-file: Excluded
2025/03/06 01:49:37 DEBUG : rclone-sync-test: Excluded
2025/03/06 01:49:38 DEBUG : rclone-sync-test-include/layer2: Excluded
2025/03/06 01:49:38 DEBUG : rclone-sync-test-ignore-file: Excluded
2025/03/06 01:49:38 ERROR : : Entry doesn't belong in directory "" (same as directory) - ignoring
2025/03/06 01:49:39 DEBUG : rclone-sync-test: Excluded
2025/03/06 01:49:39 DEBUG : rclone-sync-test-include/layer2: Excluded
2025/03/06 01:49:39 DEBUG : GCS bucket rclone-test-doxaduw2yope: Waiting for checks to finish
2025/03/06 01:49:39 DEBUG : GCS bucket rclone-test-doxaduw2yope: Waiting for transfers to finish
2025/03/06 01:49:39 DEBUG : Waiting for deletions to finish
2025/03/06 01:49:39 INFO  : rclone-sync-test-include: Removing directory
2025/03/06 01:49:39 DEBUG : rclone-sync-test-include/: Removing directory marker
2025/03/06 01:49:39 DEBUG : rclone-sync-test-include: Failed to Rmdir: removing directory marker failed: googleapi: Error 404: No such object: rclone-test-doxaduw2yope/rclone-sync-test-include/, notFound
2025/03/06 01:49:39 DEBUG : GCS bucket rclone-test-doxaduw2yope: failed to delete 1 directories
2025/03/06 01:49:39 INFO  : There was nothing to transfer
    run.go:180: Remote "GCS bucket rclone-test-doxaduw2yope", Local "Local file system at /tmp/rclone3002156174", Modify Window "1ns"
2025/03/06 01:49:40 DEBUG : rclone-sync-test-ignore-file: Excluded
2025/03/06 01:49:40 DEBUG : rclone-sync-test: Excluded
2025/03/06 01:49:41 DEBUG : rclone-sync-test-include/layer2: Excluded
    run.go:180: Remote "GCS bucket rclone-test-doxaduw2yope", Local "Local file system at /tmp/rclone3002156174", Modify Window "1ns"
2025/03/06 01:49:41 DEBUG : rclone-sync-test-ignore-file: Excluded
2025/03/06 01:49:42 DEBUG : rclone-sync-test: Excluded
2025/03/06 01:49:42 DEBUG : rclone-sync-test-include/layer2: Excluded
    run.go:180: Remote "GCS bucket rclone-test-doxaduw2yope", Local "Local file system at /tmp/rclone3002156174", Modify Window "1ns"
2025/03/06 01:49:42 DEBUG : rclone-sync-test-ignore-file: Excluded
2025/03/06 01:49:43 DEBUG : rclone-sync-test: Excluded
2025/03/06 01:49:44 DEBUG : rclone-sync-test-include/layer2: Excluded
    run.go:180: Remote "GCS bucket rclone-test-doxaduw2yope", Local "Local file system at /tmp/rclone3002156174", Modify Window "1ns"
2025/03/06 01:49:44 DEBUG : rclone-sync-test-ignore-file: Excluded
2025/03/06 01:49:44 DEBUG : rclone-sync-test: Excluded
2025/03/06 01:49:45 DEBUG : rclone-sync-test-include/layer2: Excluded
2025/03/06 01:49:45 DEBUG : : Excluded
2025/03/06 01:49:45 DEBUG : rclone-sync-test-ignore-file: Excluded
2025/03/06 01:49:46 DEBUG : rclone-sync-test: Excluded
2025/03/06 01:49:47 DEBUG : rclone-sync-test-include/layer2: Excluded
2025/03/06 01:49:47 DEBUG : GCS bucket rclone-test-doxaduw2yope path rclone-sync-test-ignore-file: Waiting for checks to finish
2025/03/06 01:49:47 DEBUG : GCS bucket rclone-test-doxaduw2yope path rclone-sync-test-ignore-file: Waiting for transfers to finish
2025/03/06 01:49:47 DEBUG : Waiting for deletions to finish
2025/03/06 01:49:47 INFO  : There was nothing to transfer
    run.go:180: Remote "GCS bucket rclone-test-doxaduw2yope", Local "Local file system at /tmp/rclone3002156174", Modify Window "1ns"
2025/03/06 01:49:47 DEBUG : rclone-sync-test-ignore-file: Excluded
2025/03/06 01:49:47 DEBUG : rclone-sync-test: Excluded
2025/03/06 01:49:48 DEBUG : rclone-sync-test-include/layer2: Excluded
    run.go:180: Remote "GCS bucket rclone-test-doxaduw2yope", Local "Local file system at /tmp/rclone3002156174", Modify Window "1ns"
2025/03/06 01:49:48 DEBUG : rclone-sync-test-ignore-file: Excluded
2025/03/06 01:49:49 DEBUG : rclone-sync-test: Excluded
2025/03/06 01:49:49 DEBUG : rclone-sync-test-include/layer2: Excluded
    run.go:180: Remote "GCS bucket rclone-test-doxaduw2yope", Local "Local file system at /tmp/rclone3002156174", Modify Window "1ns"
2025/03/06 01:49:49 DEBUG : rclone-sync-test-ignore-file: Excluded
2025/03/06 01:49:50 DEBUG : rclone-sync-test: Excluded
2025/03/06 01:49:50 DEBUG : rclone-sync-test-include/layer2: Excluded
    run.go:180: Remote "GCS bucket rclone-test-doxaduw2yope", Local "Local file system at /tmp/rclone3002156174", Modify Window "1ns"
2025/03/06 01:49:51 DEBUG : rclone-sync-test-ignore-file: Excluded
2025/03/06 01:49:51 DEBUG : rclone-sync-test: Excluded
2025/03/06 01:49:52 DEBUG : rclone-sync-test-include/layer2: Excluded
    run.go:180: Remote "GCS bucket rclone-test-doxaduw2yope", Local "Local file system at /tmp/rclone3002156174", Modify Window "1ns"
2025/03/06 01:49:52 DEBUG : rclone-sync-test-ignore-file: Excluded
2025/03/06 01:49:52 DEBUG : rclone-sync-test: Excluded
2025/03/06 01:49:53 DEBUG : rclone-sync-test-include/layer2: Excluded
2025/03/06 01:49:53 DEBUG : rclone-sync-test-include/layer2/: Removing directory marker
    run.go:125: removing dir "rclone-sync-test-include/layer2" failed - try 1/3: removing directory marker failed: googleapi: Error 404: No such object: rclone-test-doxaduw2yope/rclone-sync-test-include/layer2/, notFound
2025/03/06 01:49:54 DEBUG : rclone-sync-test-include/layer2/: Removing directory marker
    run.go:125: removing dir "rclone-sync-test-include/layer2" failed - try 2/3: removing directory marker failed: googleapi: Error 404: No such object: rclone-test-doxaduw2yope/rclone-sync-test-include/layer2/, notFound
2025/03/06 01:49:55 DEBUG : rclone-sync-test-include/layer2/: Removing directory marker
    run.go:125: removing dir "rclone-sync-test-include/layer2" failed - try 3/3: removing directory marker failed: googleapi: Error 404: No such object: rclone-test-doxaduw2yope/rclone-sync-test-include/layer2/, notFound
    run.go:128: removing dir "rclone-sync-test-include/layer2" failed: removing directory marker failed: googleapi: Error 404: No such object: rclone-test-doxaduw2yope/rclone-sync-test-include/layer2/, notFound
2025/03/06 01:49:56 DEBUG : rclone-sync-test-include/: Removing directory marker
    run.go:125: removing dir "rclone-sync-test-include" failed - try 1/3: removing directory marker failed: googleapi: Error 404: No such object: rclone-test-doxaduw2yope/rclone-sync-test-include/, notFound
2025/03/06 01:49:57 DEBUG : rclone-sync-test-include/: Removing directory marker
    run.go:125: removing dir "rclone-sync-test-include" failed - try 2/3: removing directory marker failed: googleapi: Error 404: No such object: rclone-test-doxaduw2yope/rclone-sync-test-include/, notFound
2025/03/06 01:49:58 DEBUG : rclone-sync-test-include/: Removing directory marker
    run.go:125: removing dir "rclone-sync-test-include" failed - try 3/3: removing directory marker failed: googleapi: Error 404: No such object: rclone-test-doxaduw2yope/rclone-sync-test-include/, notFound
    run.go:128: removing dir "rclone-sync-test-include" failed: removing directory marker failed: googleapi: Error 404: No such object: rclone-test-doxaduw2yope/rclone-sync-test-include/, notFound
2025/03/06 01:49:59 DEBUG : rclone-sync-test-ignore-file/: Removing directory marker
2025/03/06 01:49:59 DEBUG : rclone-sync-test-ignore-file/: Removing directory marker
    run.go:125: removing dir "rclone-sync-test-ignore-file" failed - try 1/3: removing directory marker failed: googleapi: Error 404: No such object: rclone-test-doxaduw2yope/rclone-sync-test-ignore-file/, notFound
2025/03/06 01:50:00 DEBUG : rclone-sync-test-ignore-file/: Removing directory marker
    run.go:125: removing dir "rclone-sync-test-ignore-file" failed - try 2/3: removing directory marker failed: googleapi: Error 404: No such object: rclone-test-doxaduw2yope/rclone-sync-test-ignore-file/, notFound
2025/03/06 01:50:02 DEBUG : rclone-sync-test-ignore-file/: Removing directory marker
    run.go:125: removing dir "rclone-sync-test-ignore-file" failed - try 3/3: removing directory marker failed: googleapi: Error 404: No such object: rclone-test-doxaduw2yope/rclone-sync-test-ignore-file/, notFound
    run.go:128: removing dir "rclone-sync-test-ignore-file" failed: removing directory marker failed: googleapi: Error 404: No such object: rclone-test-doxaduw2yope/rclone-sync-test-ignore-file/, notFound
2025/03/06 01:50:03 DEBUG : rclone-sync-test/: Removing directory marker
    run.go:125: removing dir "rclone-sync-test" failed - try 1/3: removing directory marker failed: googleapi: Error 404: No such object: rclone-test-doxaduw2yope/rclone-sync-test/, notFound
2025/03/06 01:50:04 DEBUG : rclone-sync-test/: Removing directory marker
    run.go:125: removing dir "rclone-sync-test" failed - try 2/3: removing directory marker failed: googleapi: Error 404: No such object: rclone-test-doxaduw2yope/rclone-sync-test/, notFound
2025/03/06 01:50:05 DEBUG : rclone-sync-test/: Removing directory marker
    run.go:125: removing dir "rclone-sync-test" failed - try 3/3: removing directory marker failed: googleapi: Error 404: No such object: rclone-test-doxaduw2yope/rclone-sync-test/, notFound
    run.go:128: removing dir "rclone-sync-test" failed: removing directory marker failed: googleapi: Error 404: No such object: rclone-test-doxaduw2yope/rclone-sync-test/, notFound
    fstest.go:292: Sleeping for 1s for list eventual consistency: 1/3
    fstest.go:292: Sleeping for 2s for list eventual consistency: 2/3
    fstest.go:292: Sleeping for 4s for list eventual consistency: 3/3
    fstest.go:321: 
        	Error Trace:	/home/rclone/go/src/github.com/rclone/rclone/fstest/fstest.go:321
        	            				/home/rclone/go/src/github.com/rclone/rclone/fstest/fstest.go:332
        	            				/home/rclone/go/src/github.com/rclone/rclone/fstest/run.go:173
        	            				/home/rclone/go/src/github.com/rclone/rclone/fstest/run.go:388
        	            				/home/rclone/go/pkg/mod/golang.org/toolchain@v0.0.1-go1.23.0.linux-amd64/src/testing/testing.go:1176
        	            				/home/rclone/go/pkg/mod/golang.org/toolchain@v0.0.1-go1.23.0.linux-amd64/src/testing/testing.go:1354
        	            				/home/rclone/go/pkg/mod/golang.org/toolchain@v0.0.1-go1.23.0.linux-amd64/src/testing/testing.go:1684
        	Error:      	Not equal: 
        	            	expected: []string{}
        	            	actual  : []string{"rclone-sync-test", "rclone-sync-test-ignore-file", "rclone-sync-test-include", "rclone-sync-test-include/layer2"}
        	            	
        	            	Diff:
        	            	--- Expected
        	            	+++ Actual
        	            	@@ -1,2 +1,6 @@
        	            	-([]string) {
        	            	+([]string) (len=4) {
        	            	+ (string) (len=16) "rclone-sync-test",
        	            	+ (string) (len=28) "rclone-sync-test-ignore-file",
        	            	+ (string) (len=24) "rclone-sync-test-include",
        	            	+ (string) (len=31) "rclone-sync-test-include/layer2"
        	            	 }
        	Test:       	TestSyncOverlapWithFilter
        	Messages:   	directories
2025/03/06 01:50:13 DEBUG : rclone-sync-test-include/layer2/: Removing directory marker
    run.go:125: removing dir "rclone-sync-test-include/layer2" failed - try 1/3: removing directory marker failed: googleapi: Error 404: No such object: rclone-test-doxaduw2yope/rclone-sync-test-include/layer2/, notFound
2025/03/06 01:50:14 DEBUG : rclone-sync-test-include/layer2/: Removing directory marker
    run.go:125: removing dir "rclone-sync-test-include/layer2" failed - try 2/3: removing directory marker failed: googleapi: Error 404: No such object: rclone-test-doxaduw2yope/rclone-sync-test-include/layer2/, notFound
2025/03/06 01:50:15 DEBUG : rclone-sync-test-include/layer2/: Removing directory marker
    run.go:125: removing dir "rclone-sync-test-include/layer2" failed - try 3/3: removing directory marker failed: googleapi: Error 404: No such object: rclone-test-doxaduw2yope/rclone-sync-test-include/layer2/, notFound
    run.go:128: removing dir "rclone-sync-test-include/layer2" failed: removing directory marker failed: googleapi: Error 404: No such object: rclone-test-doxaduw2yope/rclone-sync-test-include/layer2/, notFound
2025/03/06 01:50:16 DEBUG : rclone-sync-test-include/: Removing directory marker
    run.go:125: removing dir "rclone-sync-test-include" failed - try 1/3: removing directory marker failed: googleapi: Error 404: No such object: rclone-test-doxaduw2yope/rclone-sync-test-include/, notFound
2025/03/06 01:50:17 DEBUG : rclone-sync-test-include/: Removing directory marker
    run.go:125: removing dir "rclone-sync-test-include" failed - try 2/3: removing directory marker failed: googleapi: Error 404: No such object: rclone-test-doxaduw2yope/rclone-sync-test-include/, notFound
2025/03/06 01:50:18 DEBUG : rclone-sync-test-include/: Removing directory marker
    run.go:125: removing dir "rclone-sync-test-include" failed - try 3/3: removing directory marker failed: googleapi: Error 404: No such object: rclone-test-doxaduw2yope/rclone-sync-test-include/, notFound
    run.go:128: removing dir "rclone-sync-test-include" failed: removing directory marker failed: googleapi: Error 404: No such object: rclone-test-doxaduw2yope/rclone-sync-test-include/, notFound
2025/03/06 01:50:19 DEBUG : rclone-sync-test-ignore-file/: Removing directory marker
    run.go:125: removing dir "rclone-sync-test-ignore-file" failed - try 1/3: removing directory marker failed: googleapi: Error 404: No such object: rclone-test-doxaduw2yope/rclone-sync-test-ignore-file/, notFound
2025/03/06 01:50:20 DEBUG : rclone-sync-test-ignore-file/: Removing directory marker
    run.go:125: removing dir "rclone-sync-test-ignore-file" failed - try 2/3: removing directory marker failed: googleapi: Error 404: No such object: rclone-test-doxaduw2yope/rclone-sync-test-ignore-file/, notFound
2025/03/06 01:50:21 DEBUG : rclone-sync-test-ignore-file/: Removing directory marker
    run.go:125: removing dir "rclone-sync-test-ignore-file" failed - try 3/3: removing directory marker failed: googleapi: Error 404: No such object: rclone-test-doxaduw2yope/rclone-sync-test-ignore-file/, notFound
    run.go:128: removing dir "rclone-sync-test-ignore-file" failed: removing directory marker failed: googleapi: Error 404: No such object: rclone-test-doxaduw2yope/rclone-sync-test-ignore-file/, notFound
2025/03/06 01:50:22 DEBUG : rclone-sync-test/: Removing directory marker
    run.go:125: removing dir "rclone-sync-test" failed - try 1/3: removing directory marker failed: googleapi: Error 404: No such object: rclone-test-doxaduw2yope/rclone-sync-test/, notFound
2025/03/06 01:50:24 DEBUG : rclone-sync-test/: Removing directory marker
    run.go:125: removing dir "rclone-sync-test" failed - try 2/3: removing directory marker failed: googleapi: Error 404: No such object: rclone-test-doxaduw2yope/rclone-sync-test/, notFound
2025/03/06 01:50:25 DEBUG : rclone-sync-test/: Removing directory marker
    run.go:125: removing dir "rclone-sync-test" failed - try 3/3: removing directory marker failed: googleapi: Error 404: No such object: rclone-test-doxaduw2yope/rclone-sync-test/, notFound
    run.go:128: removing dir "rclone-sync-test" failed: removing directory marker failed: googleapi: Error 404: No such object: rclone-test-doxaduw2yope/rclone-sync-test/, notFound
    fstest.go:292: Sleeping for 1s for list eventual consistency: 1/3
    fstest.go:292: Sleeping for 2s for list eventual consistency: 2/3
    fstest.go:292: Sleeping for 4s for list eventual consistency: 3/3
    fstest.go:321: 
        	Error Trace:	/home/rclone/go/src/github.com/rclone/rclone/fstest/fstest.go:321
        	            				/home/rclone/go/src/github.com/rclone/rclone/fstest/fstest.go:332
        	            				/home/rclone/go/src/github.com/rclone/rclone/fstest/run.go:173
        	            				/home/rclone/go/src/github.com/rclone/rclone/fstest/run.go:388
        	            				/home/rclone/go/pkg/mod/golang.org/toolchain@v0.0.1-go1.23.0.linux-amd64/src/testing/testing.go:1176
        	            				/home/rclone/go/pkg/mod/golang.org/toolchain@v0.0.1-go1.23.0.linux-amd64/src/testing/testing.go:1354
        	            				/home/rclone/go/pkg/mod/golang.org/toolchain@v0.0.1-go1.23.0.linux-amd64/src/testing/testing.go:1684
        	Error:      	Not equal: 
        	            	expected: []string{}
        	            	actual  : []string{"rclone-sync-test", "rclone-sync-test-ignore-file", "rclone-sync-test-include", "rclone-sync-test-include/layer2"}
        	            	
        	            	Diff:
        	            	--- Expected
        	            	+++ Actual
        	            	@@ -1,2 +1,6 @@
        	            	-([]string) {
        	            	+([]string) (len=4) {
        	            	+ (string) (len=16) "rclone-sync-test",
        	            	+ (string) (len=28) "rclone-sync-test-ignore-file",
        	            	+ (string) (len=24) "rclone-sync-test-include",
        	            	+ (string) (len=31) "rclone-sync-test-include/layer2"
        	            	 }
        	Test:       	TestSyncOverlapWithFilter
        	Messages:   	directories
2025/03/06 01:50:33 DEBUG : rclone-sync-test-include/layer2/: Removing directory marker
    run.go:125: removing dir "rclone-sync-test-include/layer2" failed - try 1/3: removing directory marker failed: googleapi: Error 404: No such object: rclone-test-doxaduw2yope/rclone-sync-test-include/layer2/, notFound
2025/03/06 01:50:34 DEBUG : rclone-sync-test-include/layer2/: Removing directory marker
    run.go:125: removing dir "rclone-sync-test-include/layer2" failed - try 2/3: removing directory marker failed: googleapi: Error 404: No such object: rclone-test-doxaduw2yope/rclone-sync-test-include/layer2/, notFound
2025/03/06 01:50:35 DEBUG : rclone-sync-test-include/layer2/: Removing directory marker
    run.go:125: removing dir "rclone-sync-test-include/layer2" failed - try 3/3: removing directory marker failed: googleapi: Error 404: No such object: rclone-test-doxaduw2yope/rclone-sync-test-include/layer2/, notFound
    run.go:128: removing dir "rclone-sync-test-include/layer2" failed: removing directory marker failed: googleapi: Error 404: No such object: rclone-test-doxaduw2yope/rclone-sync-test-include/layer2/, notFound
2025/03/06 01:50:36 DEBUG : rclone-sync-test-include/: Removing directory marker
    run.go:125: removing dir "rclone-sync-test-include" failed - try 1/3: removing directory marker failed: googleapi: Error 404: No such object: rclone-test-doxaduw2yope/rclone-sync-test-include/, notFound
2025/03/06 01:50:37 DEBUG : rclone-sync-test-include/: Removing directory marker
    run.go:125: removing dir "rclone-sync-test-include" failed - try 2/3: removing directory marker failed: googleapi: Error 404: No such object: rclone-test-doxaduw2yope/rclone-sync-test-include/, notFound
2025/03/06 01:50:38 DEBUG : rclone-sync-test-include/: Removing directory marker
    run.go:125: removing dir "rclone-sync-test-include" failed - try 3/3: removing directory marker failed: googleapi: Error 404: No such object: rclone-test-doxaduw2yope/rclone-sync-test-include/, notFound
    run.go:128: removing dir "rclone-sync-test-include" failed: removing directory marker failed: googleapi: Error 404: No such object: rclone-test-doxaduw2yope/rclone-sync-test-include/, notFound
2025/03/06 01:50:39 DEBUG : rclone-sync-test-ignore-file/: Removing directory marker
    run.go:125: removing dir "rclone-sync-test-ignore-file" failed - try 1/3: removing directory marker failed: googleapi: Error 404: No such object: rclone-test-doxaduw2yope/rclone-sync-test-ignore-file/, notFound
2025/03/06 01:50:40 DEBUG : rclone-sync-test-ignore-file/: Removing directory marker
    run.go:125: removing dir "rclone-sync-test-ignore-file" failed - try 2/3: removing directory marker failed: googleapi: Error 404: No such object: rclone-test-doxaduw2yope/rclone-sync-test-ignore-file/, notFound
2025/03/06 01:50:41 DEBUG : rclone-sync-test-ignore-file/: Removing directory marker
    run.go:125: removing dir "rclone-sync-test-ignore-file" failed - try 3/3: removing directory marker failed: googleapi: Error 404: No such object: rclone-test-doxaduw2yope/rclone-sync-test-ignore-file/, notFound
    run.go:128: removing dir "rclone-sync-test-ignore-file" failed: removing directory marker failed: googleapi: Error 404: No such object: rclone-test-doxaduw2yope/rclone-sync-test-ignore-file/, notFound
2025/03/06 01:50:42 DEBUG : rclone-sync-test/: Removing directory marker
    run.go:125: removing dir "rclone-sync-test" failed - try 1/3: removing directory marker failed: googleapi: Error 404: No such object: rclone-test-doxaduw2yope/rclone-sync-test/, notFound
2025/03/06 01:50:43 DEBUG : rclone-sync-test/: Removing directory marker
    run.go:125: removing dir "rclone-sync-test" failed - try 2/3: removing directory marker failed: googleapi: Error 404: No such object: rclone-test-doxaduw2yope/rclone-sync-test/, notFound
2025/03/06 01:50:44 DEBUG : rclone-sync-test/: Removing directory marker
    run.go:125: removing dir "rclone-sync-test" failed - try 3/3: removing directory marker failed: googleapi: Error 404: No such object: rclone-test-doxaduw2yope/rclone-sync-test/, notFound
    run.go:128: removing dir "rclone-sync-test" failed: removing directory marker failed: googleapi: Error 404: No such object: rclone-test-doxaduw2yope/rclone-sync-test/, notFound
    fstest.go:292: Sleeping for 1s for list eventual consistency: 1/3
    fstest.go:292: Sleeping for 2s for list eventual consistency: 2/3
    fstest.go:292: Sleeping for 4s for list eventual consistency: 3/3
    fstest.go:321: 
        	Error Trace:	/home/rclone/go/src/github.com/rclone/rclone/fstest/fstest.go:321
        	            				/home/rclone/go/src/github.com/rclone/rclone/fstest/fstest.go:332
        	            				/home/rclone/go/src/github.com/rclone/rclone/fstest/run.go:173
        	            				/home/rclone/go/src/github.com/rclone/rclone/fstest/run.go:388
        	            				/home/rclone/go/pkg/mod/golang.org/toolchain@v0.0.1-go1.23.0.linux-amd64/src/testing/testing.go:1176
        	            				/home/rclone/go/pkg/mod/golang.org/toolchain@v0.0.1-go1.23.0.linux-amd64/src/testing/testing.go:1354
        	            				/home/rclone/go/pkg/mod/golang.org/toolchain@v0.0.1-go1.23.0.linux-amd64/src/testing/testing.go:1684
        	Error:      	Not equal: 
        	            	expected: []string{}
        	            	actual  : []string{"rclone-sync-test", "rclone-sync-test-ignore-file", "rclone-sync-test-include", "rclone-sync-test-include/layer2"}
        	            	
        	            	Diff:
        	            	--- Expected
        	            	+++ Actual
        	            	@@ -1,2 +1,6 @@
        	            	-([]string) {
        	            	+([]string) (len=4) {
        	            	+ (string) (len=16) "rclone-sync-test",
        	            	+ (string) (len=28) "rclone-sync-test-ignore-file",
        	            	+ (string) (len=24) "rclone-sync-test-include",
        	            	+ (string) (len=31) "rclone-sync-test-include/layer2"
        	            	 }
        	Test:       	TestSyncOverlapWithFilter
        	Messages:   	directories
2025/03/06 01:50:53 DEBUG : rclone-sync-test-include/layer2/: Removing directory marker
    run.go:125: removing dir "rclone-sync-test-include/layer2" failed - try 1/3: removing directory marker failed: googleapi: Error 404: No such object: rclone-test-doxaduw2yope/rclone-sync-test-include/layer2/, notFound
2025/03/06 01:50:54 DEBUG : rclone-sync-test-include/layer2/: Removing directory marker
    run.go:125: removing dir "rclone-sync-test-include/layer2" failed - try 2/3: removing directory marker failed: googleapi: Error 404: No such object: rclone-test-doxaduw2yope/rclone-sync-test-include/layer2/, notFound
2025/03/06 01:50:55 DEBUG : rclone-sync-test-include/layer2/: Removing directory marker
    run.go:125: removing dir "rclone-sync-test-include/layer2" failed - try 3/3: removing directory marker failed: googleapi: Error 404: No such object: rclone-test-doxaduw2yope/rclone-sync-test-include/layer2/, notFound
    run.go:128: removing dir "rclone-sync-test-include/layer2" failed: removing directory marker failed: googleapi: Error 404: No such object: rclone-test-doxaduw2yope/rclone-sync-test-include/layer2/, notFound
2025/03/06 01:50:56 DEBUG : rclone-sync-test-include/: Removing directory marker
    run.go:125: removing dir "rclone-sync-test-include" failed - try 1/3: removing directory marker failed: googleapi: Error 404: No such object: rclone-test-doxaduw2yope/rclone-sync-test-include/, notFound
2025/03/06 01:50:57 DEBUG : rclone-sync-test-include/: Removing directory marker
    run.go:125: removing dir "rclone-sync-test-include" failed - try 2/3: removing directory marker failed: googleapi: Error 404: No such object: rclone-test-doxaduw2yope/rclone-sync-test-include/, notFound
2025/03/06 01:50:58 DEBUG : rclone-sync-test-include/: Removing directory marker
    run.go:125: removing dir "rclone-sync-test-include" failed - try 3/3: removing directory marker failed: googleapi: Error 404: No such object: rclone-test-doxaduw2yope/rclone-sync-test-include/, notFound
    run.go:128: removing dir "rclone-sync-test-include" failed: removing directory marker failed: googleapi: Error 404: No such object: rclone-test-doxaduw2yope/rclone-sync-test-include/, notFound
2025/03/06 01:50:59 DEBUG : rclone-sync-test-ignore-file/: Removing directory marker
    run.go:125: removing dir "rclone-sync-test-ignore-file" failed - try 1/3: removing directory marker failed: googleapi: Error 404: No such object: rclone-test-doxaduw2yope/rclone-sync-test-ignore-file/, notFound
2025/03/06 01:51:00 DEBUG : rclone-sync-test-ignore-file/: Removing directory marker
    run.go:125: removing dir "rclone-sync-test-ignore-file" failed - try 2/3: removing directory marker failed: googleapi: Error 404: No such object: rclone-test-doxaduw2yope/rclone-sync-test-ignore-file/, notFound
2025/03/06 01:51:01 DEBUG : rclone-sync-test-ignore-file/: Removing directory marker
    run.go:125: removing dir "rclone-sync-test-ignore-file" failed - try 3/3: removing directory marker failed: googleapi: Error 404: No such object: rclone-test-doxaduw2yope/rclone-sync-test-ignore-file/, notFound
    run.go:128: removing dir "rclone-sync-test-ignore-file" failed: removing directory marker failed: googleapi: Error 404: No such object: rclone-test-doxaduw2yope/rclone-sync-test-ignore-file/, notFound
2025/03/06 01:51:02 DEBUG : rclone-sync-test/: Removing directory marker
    run.go:125: removing dir "rclone-sync-test" failed - try 1/3: removing directory marker failed: googleapi: Error 404: No such object: rclone-test-doxaduw2yope/rclone-sync-test/, notFound
2025/03/06 01:51:03 DEBUG : rclone-sync-test/: Removing directory marker
    run.go:125: removing dir "rclone-sync-test" failed - try 2/3: removing directory marker failed: googleapi: Error 404: No such object: rclone-test-doxaduw2yope/rclone-sync-test/, notFound
2025/03/06 01:51:04 DEBUG : rclone-sync-test/: Removing directory marker
    run.go:125: removing dir "rclone-sync-test" failed - try 3/3: removing directory marker failed: googleapi: Error 404: No such object: rclone-test-doxaduw2yope/rclone-sync-test/, notFound
    run.go:128: removing dir "rclone-sync-test" failed: removing directory marker failed: googleapi: Error 404: No such object: rclone-test-doxaduw2yope/rclone-sync-test/, notFound
    fstest.go:292: Sleeping for 1s for list eventual consistency: 1/3
    fstest.go:292: Sleeping for 2s for list eventual consistency: 2/3
    fstest.go:292: Sleeping for 4s for list eventual consistency: 3/3
    fstest.go:321: 
        	Error Trace:	/home/rclone/go/src/github.com/rclone/rclone/fstest/fstest.go:321
        	            				/home/rclone/go/src/github.com/rclone/rclone/fstest/fstest.go:332
        	            				/home/rclone/go/src/github.com/rclone/rclone/fstest/run.go:173
        	            				/home/rclone/go/src/github.com/rclone/rclone/fstest/run.go:388
        	            				/home/rclone/go/pkg/mod/golang.org/toolchain@v0.0.1-go1.23.0.linux-amd64/src/testing/testing.go:1176
        	            				/home/rclone/go/pkg/mod/golang.org/toolchain@v0.0.1-go1.23.0.linux-amd64/src/testing/testing.go:1354
        	            				/home/rclone/go/pkg/mod/golang.org/toolchain@v0.0.1-go1.23.0.linux-amd64/src/testing/testing.go:1684
        	Error:      	Not equal: 
        	            	expected: []string{}
        	            	actual  : []string{"rclone-sync-test", "rclone-sync-test-ignore-file", "rclone-sync-test-include", "rclone-sync-test-include/layer2"}
        	            	
        	            	Diff:
        	            	--- Expected
        	            	+++ Actual
        	            	@@ -1,2 +1,6 @@
        	            	-([]string) {
        	            	+([]string) (len=4) {
        	            	+ (string) (len=16) "rclone-sync-test",
        	            	+ (string) (len=28) "rclone-sync-test-ignore-file",
        	            	+ (string) (len=24) "rclone-sync-test-include",
        	            	+ (string) (len=31) "rclone-sync-test-include/layer2"
        	            	 }
        	Test:       	TestSyncOverlapWithFilter
        	Messages:   	directories
2025/03/06 01:51:13 DEBUG : rclone-sync-test-include/layer2/: Removing directory marker
    run.go:125: removing dir "rclone-sync-test-include/layer2" failed - try 1/3: removing directory marker failed: googleapi: Error 404: No such object: rclone-test-doxaduw2yope/rclone-sync-test-include/layer2/, notFound
2025/03/06 01:51:14 DEBUG : rclone-sync-test-include/layer2/: Removing directory marker
    run.go:125: removing dir "rclone-sync-test-include/layer2" failed - try 2/3: removing directory marker failed: googleapi: Error 404: No such object: rclone-test-doxaduw2yope/rclone-sync-test-include/layer2/, notFound
2025/03/06 01:51:15 DEBUG : rclone-sync-test-include/layer2/: Removing directory marker
    run.go:125: removing dir "rclone-sync-test-include/layer2" failed - try 3/3: removing directory marker failed: googleapi: Error 404: No such object: rclone-test-doxaduw2yope/rclone-sync-test-include/layer2/, notFound
    run.go:128: removing dir "rclone-sync-test-include/layer2" failed: removing directory marker failed: googleapi: Error 404: No such object: rclone-test-doxaduw2yope/rclone-sync-test-include/layer2/, notFound
2025/03/06 01:51:16 DEBUG : rclone-sync-test-include/: Removing directory marker
    run.go:125: removing dir "rclone-sync-test-include" failed - try 1/3: removing directory marker failed: googleapi: Error 404: No such object: rclone-test-doxaduw2yope/rclone-sync-test-include/, notFound
2025/03/06 01:51:17 DEBUG : rclone-sync-test-include/: Removing directory marker
    run.go:125: removing dir "rclone-sync-test-include" failed - try 2/3: removing directory marker failed: googleapi: Error 404: No such object: rclone-test-doxaduw2yope/rclone-sync-test-include/, notFound
2025/03/06 01:51:18 DEBUG : rclone-sync-test-include/: Removing directory marker
    run.go:125: removing dir "rclone-sync-test-include" failed - try 3/3: removing directory marker failed: googleapi: Error 404: No such object: rclone-test-doxaduw2yope/rclone-sync-test-include/, notFound
    run.go:128: removing dir "rclone-sync-test-include" failed: removing directory marker failed: googleapi: Error 404: No such object: rclone-test-doxaduw2yope/rclone-sync-test-include/, notFound
2025/03/06 01:51:19 DEBUG : rclone-sync-test-ignore-file/: Removing directory marker
    run.go:125: removing dir "rclone-sync-test-ignore-file" failed - try 1/3: removing directory marker failed: googleapi: Error 404: No such object: rclone-test-doxaduw2yope/rclone-sync-test-ignore-file/, notFound
2025/03/06 01:51:20 DEBUG : rclone-sync-test-ignore-file/: Removing directory marker
    run.go:125: removing dir "rclone-sync-test-ignore-file" failed - try 2/3: removing directory marker failed: googleapi: Error 404: No such object: rclone-test-doxaduw2yope/rclone-sync-test-ignore-file/, notFound
2025/03/06 01:51:21 DEBUG : rclone-sync-test-ignore-file/: Removing directory marker
    run.go:125: removing dir "rclone-sync-test-ignore-file" failed - try 3/3: removing directory marker failed: googleapi: Error 404: No such object: rclone-test-doxaduw2yope/rclone-sync-test-ignore-file/, notFound
    run.go:128: removing dir "rclone-sync-test-ignore-file" failed: removing directory marker failed: googleapi: Error 404: No such object: rclone-test-doxaduw2yope/rclone-sync-test-ignore-file/, notFound
2025/03/06 01:51:22 DEBUG : rclone-sync-test/: Removing directory marker
    run.go:125: removing dir "rclone-sync-test" failed - try 1/3: removing directory marker failed: googleapi: Error 404: No such object: rclone-test-doxaduw2yope/rclone-sync-test/, notFound
2025/03/06 01:51:23 DEBUG : rclone-sync-test/: Removing directory marker
    run.go:125: removing dir "rclone-sync-test" failed - try 2/3: removing directory marker failed: googleapi: Error 404: No such object: rclone-test-doxaduw2yope/rclone-sync-test/, notFound
2025/03/06 01:51:24 DEBUG : rclone-sync-test/: Removing directory marker
    run.go:125: removing dir "rclone-sync-test" failed - try 3/3: removing directory marker failed: googleapi: Error 404: No such object: rclone-test-doxaduw2yope/rclone-sync-test/, notFound
    run.go:128: removing dir "rclone-sync-test" failed: removing directory marker failed: googleapi: Error 404: No such object: rclone-test-doxaduw2yope/rclone-sync-test/, notFound
    fstest.go:292: Sleeping for 1s for list eventual consistency: 1/3
    fstest.go:292: Sleeping for 2s for list eventual consistency: 2/3
    fstest.go:292: Sleeping for 4s for list eventual consistency: 3/3
    fstest.go:321: 
        	Error Trace:	/home/rclone/go/src/github.com/rclone/rclone/fstest/fstest.go:321
        	            				/home/rclone/go/src/github.com/rclone/rclone/fstest/fstest.go:332
        	            				/home/rclone/go/src/github.com/rclone/rclone/fstest/run.go:173
        	            				/home/rclone/go/src/github.com/rclone/rclone/fstest/run.go:388
        	            				/home/rclone/go/pkg/mod/golang.org/toolchain@v0.0.1-go1.23.0.linux-amd64/src/testing/testing.go:1176
        	            				/home/rclone/go/pkg/mod/golang.org/toolchain@v0.0.1-go1.23.0.linux-amd64/src/testing/testing.go:1354
        	            				/home/rclone/go/pkg/mod/golang.org/toolchain@v0.0.1-go1.23.0.linux-amd64/src/testing/testing.go:1684
        	Error:      	Not equal: 
        	            	expected: []string{}
        	            	actual  : []string{"rclone-sync-test", "rclone-sync-test-ignore-file", "rclone-sync-test-include", "rclone-sync-test-include/layer2"}
        	            	
        	            	Diff:
        	            	--- Expected
        	            	+++ Actual
        	            	@@ -1,2 +1,6 @@
        	            	-([]string) {
        	            	+([]string) (len=4) {
        	            	+ (string) (len=16) "rclone-sync-test",
        	            	+ (string) (len=28) "rclone-sync-test-ignore-file",
        	            	+ (string) (len=24) "rclone-sync-test-include",
        	            	+ (string) (len=31) "rclone-sync-test-include/layer2"
        	            	 }
        	Test:       	TestSyncOverlapWithFilter
        	Messages:   	directories
2025/03/06 01:51:33 DEBUG : rclone-sync-test-include/layer2/: Removing directory marker
    run.go:125: removing dir "rclone-sync-test-include/layer2" failed - try 1/3: removing directory marker failed: googleapi: Error 404: No such object: rclone-test-doxaduw2yope/rclone-sync-test-include/layer2/, notFound
2025/03/06 01:51:34 DEBUG : rclone-sync-test-include/layer2/: Removing directory marker
    run.go:125: removing dir "rclone-sync-test-include/layer2" failed - try 2/3: removing directory marker failed: googleapi: Error 404: No such object: rclone-test-doxaduw2yope/rclone-sync-test-include/layer2/, notFound
2025/03/06 01:51:35 DEBUG : rclone-sync-test-include/layer2/: Removing directory marker
    run.go:125: removing dir "rclone-sync-test-include/layer2" failed - try 3/3: removing directory marker failed: googleapi: Error 404: No such object: rclone-test-doxaduw2yope/rclone-sync-test-include/layer2/, notFound
    run.go:128: removing dir "rclone-sync-test-include/layer2" failed: removing directory marker failed: googleapi: Error 404: No such object: rclone-test-doxaduw2yope/rclone-sync-test-include/layer2/, notFound
2025/03/06 01:51:36 DEBUG : rclone-sync-test-include/: Removing directory marker
    run.go:125: removing dir "rclone-sync-test-include" failed - try 1/3: removing directory marker failed: googleapi: Error 404: No such object: rclone-test-doxaduw2yope/rclone-sync-test-include/, notFound
2025/03/06 01:51:37 DEBUG : rclone-sync-test-include/: Removing directory marker
    run.go:125: removing dir "rclone-sync-test-include" failed - try 2/3: removing directory marker failed: googleapi: Error 404: No such object: rclone-test-doxaduw2yope/rclone-sync-test-include/, notFound
2025/03/06 01:51:38 DEBUG : rclone-sync-test-include/: Removing directory marker
    run.go:125: removing dir "rclone-sync-test-include" failed - try 3/3: removing directory marker failed: googleapi: Error 404: No such object: rclone-test-doxaduw2yope/rclone-sync-test-include/, notFound
    run.go:128: removing dir "rclone-sync-test-include" failed: removing directory marker failed: googleapi: Error 404: No such object: rclone-test-doxaduw2yope/rclone-sync-test-include/, notFound
2025/03/06 01:51:39 DEBUG : rclone-sync-test-ignore-file/: Removing directory marker
    run.go:125: removing dir "rclone-sync-test-ignore-file" failed - try 1/3: removing directory marker failed: googleapi: Error 404: No such object: rclone-test-doxaduw2yope/rclone-sync-test-ignore-file/, notFound
2025/03/06 01:51:40 DEBUG : rclone-sync-test-ignore-file/: Removing directory marker
    run.go:125: removing dir "rclone-sync-test-ignore-file" failed - try 2/3: removing directory marker failed: googleapi: Error 404: No such object: rclone-test-doxaduw2yope/rclone-sync-test-ignore-file/, notFound
2025/03/06 01:51:41 DEBUG : rclone-sync-test-ignore-file/: Removing directory marker
    run.go:125: removing dir "rclone-sync-test-ignore-file" failed - try 3/3: removing directory marker failed: googleapi: Error 404: No such object: rclone-test-doxaduw2yope/rclone-sync-test-ignore-file/, notFound
    run.go:128: removing dir "rclone-sync-test-ignore-file" failed: removing directory marker failed: googleapi: Error 404: No such object: rclone-test-doxaduw2yope/rclone-sync-test-ignore-file/, notFound
2025/03/06 01:51:42 DEBUG : rclone-sync-test/: Removing directory marker
    run.go:125: removing dir "rclone-sync-test" failed - try 1/3: removing directory marker failed: googleapi: Error 404: No such object: rclone-test-doxaduw2yope/rclone-sync-test/, notFound
2025/03/06 01:51:43 DEBUG : rclone-sync-test/: Removing directory marker
    run.go:125: removing dir "rclone-sync-test" failed - try 2/3: removing directory marker failed: googleapi: Error 404: No such object: rclone-test-doxaduw2yope/rclone-sync-test/, notFound
2025/03/06 01:51:44 DEBUG : rclone-sync-test/: Removing directory marker
    run.go:125: removing dir "rclone-sync-test" failed - try 3/3: removing directory marker failed: googleapi: Error 404: No such object: rclone-test-doxaduw2yope/rclone-sync-test/, notFound
    run.go:128: removing dir "rclone-sync-test" failed: removing directory marker failed: googleapi: Error 404: No such object: rclone-test-doxaduw2yope/rclone-sync-test/, notFound
    fstest.go:292: Sleeping for 1s for list eventual consistency: 1/3
    fstest.go:292: Sleeping for 2s for list eventual consistency: 2/3
    fstest.go:292: Sleeping for 4s for list eventual consistency: 3/3
    fstest.go:321: 
        	Error Trace:	/home/rclone/go/src/github.com/rclone/rclone/fstest/fstest.go:321
        	            				/home/rclone/go/src/github.com/rclone/rclone/fstest/fstest.go:332
        	            				/home/rclone/go/src/github.com/rclone/rclone/fstest/run.go:173
        	            				/home/rclone/go/src/github.com/rclone/rclone/fstest/run.go:388
        	            				/home/rclone/go/pkg/mod/golang.org/toolchain@v0.0.1-go1.23.0.linux-amd64/src/testing/testing.go:1176
        	            				/home/rclone/go/pkg/mod/golang.org/toolchain@v0.0.1-go1.23.0.linux-amd64/src/testing/testing.go:1354
        	            				/home/rclone/go/pkg/mod/golang.org/toolchain@v0.0.1-go1.23.0.linux-amd64/src/testing/testing.go:1684
        	Error:      	Not equal: 
        	            	expected: []string{}
        	            	actual  : []string{"rclone-sync-test", "rclone-sync-test-ignore-file", "rclone-sync-test-include", "rclone-sync-test-include/layer2"}
        	            	
        	            	Diff:
        	            	--- Expected
        	            	+++ Actual
        	            	@@ -1,2 +1,6 @@
        	            	-([]string) {
        	            	+([]string) (len=4) {
        	            	+ (string) (len=16) "rclone-sync-test",
        	            	+ (string) (len=28) "rclone-sync-test-ignore-file",
        	            	+ (string) (len=24) "rclone-sync-test-include",
        	            	+ (string) (len=31) "rclone-sync-test-include/layer2"
        	            	 }
        	Test:       	TestSyncOverlapWithFilter
        	Messages:   	directories
2025/03/06 01:51:53 DEBUG : rclone-sync-test-include/layer2/: Removing directory marker
    run.go:125: removing dir "rclone-sync-test-include/layer2" failed - try 1/3: removing directory marker failed: googleapi: Error 404: No such object: rclone-test-doxaduw2yope/rclone-sync-test-include/layer2/, notFound
2025/03/06 01:51:54 DEBUG : rclone-sync-test-include/layer2/: Removing directory marker
    run.go:125: removing dir "rclone-sync-test-include/layer2" failed - try 2/3: removing directory marker failed: googleapi: Error 404: No such object: rclone-test-doxaduw2yope/rclone-sync-test-include/layer2/, notFound
2025/03/06 01:51:55 DEBUG : rclone-sync-test-include/layer2/: Removing directory marker
    run.go:125: removing dir "rclone-sync-test-include/layer2" failed - try 3/3: removing directory marker failed: googleapi: Error 404: No such object: rclone-test-doxaduw2yope/rclone-sync-test-include/layer2/, notFound
    run.go:128: removing dir "rclone-sync-test-include/layer2" failed: removing directory marker failed: googleapi: Error 404: No such object: rclone-test-doxaduw2yope/rclone-sync-test-include/layer2/, notFound
2025/03/06 01:51:56 DEBUG : rclone-sync-test-include/: Removing directory marker
    run.go:125: removing dir "rclone-sync-test-include" failed - try 1/3: removing directory marker failed: googleapi: Error 404: No such object: rclone-test-doxaduw2yope/rclone-sync-test-include/, notFound
2025/03/06 01:51:57 DEBUG : rclone-sync-test-include/: Removing directory marker
    run.go:125: removing dir "rclone-sync-test-include" failed - try 2/3: removing directory marker failed: googleapi: Error 404: No such object: rclone-test-doxaduw2yope/rclone-sync-test-include/, notFound
2025/03/06 01:51:58 DEBUG : rclone-sync-test-include/: Removing directory marker
    run.go:125: removing dir "rclone-sync-test-include" failed - try 3/3: removing directory marker failed: googleapi: Error 404: No such object: rclone-test-doxaduw2yope/rclone-sync-test-include/, notFound
    run.go:128: removing dir "rclone-sync-test-include" failed: removing directory marker failed: googleapi: Error 404: No such object: rclone-test-doxaduw2yope/rclone-sync-test-include/, notFound
2025/03/06 01:51:59 DEBUG : rclone-sync-test-ignore-file/: Removing directory marker
    run.go:125: removing dir "rclone-sync-test-ignore-file" failed - try 1/3: removing directory marker failed: googleapi: Error 404: No such object: rclone-test-doxaduw2yope/rclone-sync-test-ignore-file/, notFound
2025/03/06 01:52:00 DEBUG : rclone-sync-test-ignore-file/: Removing directory marker
    run.go:125: removing dir "rclone-sync-test-ignore-file" failed - try 2/3: removing directory marker failed: googleapi: Error 404: No such object: rclone-test-doxaduw2yope/rclone-sync-test-ignore-file/, notFound
2025/03/06 01:52:01 DEBUG : rclone-sync-test-ignore-file/: Removing directory marker
    run.go:125: removing dir "rclone-sync-test-ignore-file" failed - try 3/3: removing directory marker failed: googleapi: Error 404: No such object: rclone-test-doxaduw2yope/rclone-sync-test-ignore-file/, notFound
    run.go:128: removing dir "rclone-sync-test-ignore-file" failed: removing directory marker failed: googleapi: Error 404: No such object: rclone-test-doxaduw2yope/rclone-sync-test-ignore-file/, notFound
2025/03/06 01:52:02 DEBUG : rclone-sync-test/: Removing directory marker
    run.go:125: removing dir "rclone-sync-test" failed - try 1/3: removing directory marker failed: googleapi: Error 404: No such object: rclone-test-doxaduw2yope/rclone-sync-test/, notFound
2025/03/06 01:52:03 DEBUG : rclone-sync-test/: Removing directory marker
    run.go:125: removing dir "rclone-sync-test" failed - try 2/3: removing directory marker failed: googleapi: Error 404: No such object: rclone-test-doxaduw2yope/rclone-sync-test/, notFound
2025/03/06 01:52:04 DEBUG : rclone-sync-test/: Removing directory marker
    run.go:125: removing dir "rclone-sync-test" failed - try 3/3: removing directory marker failed: googleapi: Error 404: No such object: rclone-test-doxaduw2yope/rclone-sync-test/, notFound
    run.go:128: removing dir "rclone-sync-test" failed: removing directory marker failed: googleapi: Error 404: No such object: rclone-test-doxaduw2yope/rclone-sync-test/, notFound
    fstest.go:292: Sleeping for 1s for list eventual consistency: 1/3
    fstest.go:292: Sleeping for 2s for list eventual consistency: 2/3
    fstest.go:292: Sleeping for 4s for list eventual consistency: 3/3
    fstest.go:321: 
        	Error Trace:	/home/rclone/go/src/github.com/rclone/rclone/fstest/fstest.go:321
        	            				/home/rclone/go/src/github.com/rclone/rclone/fstest/fstest.go:332
        	            				/home/rclone/go/src/github.com/rclone/rclone/fstest/run.go:173
        	            				/home/rclone/go/src/github.com/rclone/rclone/fstest/run.go:388
        	            				/home/rclone/go/pkg/mod/golang.org/toolchain@v0.0.1-go1.23.0.linux-amd64/src/testing/testing.go:1176
        	            				/home/rclone/go/pkg/mod/golang.org/toolchain@v0.0.1-go1.23.0.linux-amd64/src/testing/testing.go:1354
        	            				/home/rclone/go/pkg/mod/golang.org/toolchain@v0.0.1-go1.23.0.linux-amd64/src/testing/testing.go:1684
        	Error:      	Not equal: 
        	            	expected: []string{}
        	            	actual  : []string{"rclone-sync-test", "rclone-sync-test-ignore-file", "rclone-sync-test-include", "rclone-sync-test-include/layer2"}
        	            	
        	            	Diff:
        	            	--- Expected
        	            	+++ Actual
        	            	@@ -1,2 +1,6 @@
        	            	-([]string) {
        	            	+([]string) (len=4) {
        	            	+ (string) (len=16) "rclone-sync-test",
        	            	+ (string) (len=28) "rclone-sync-test-ignore-file",
        	            	+ (string) (len=24) "rclone-sync-test-include",
        	            	+ (string) (len=31) "rclone-sync-test-include/layer2"
        	            	 }
        	Test:       	TestSyncOverlapWithFilter
        	Messages:   	directories
2025/03/06 01:52:13 DEBUG : rclone-sync-test-include/layer2/: Removing directory marker
    run.go:125: removing dir "rclone-sync-test-include/layer2" failed - try 1/3: removing directory marker failed: googleapi: Error 404: No such object: rclone-test-doxaduw2yope/rclone-sync-test-include/layer2/, notFound
2025/03/06 01:52:14 DEBUG : rclone-sync-test-include/layer2/: Removing directory marker
    run.go:125: removing dir "rclone-sync-test-include/layer2" failed - try 2/3: removing directory marker failed: googleapi: Error 404: No such object: rclone-test-doxaduw2yope/rclone-sync-test-include/layer2/, notFound
2025/03/06 01:52:15 DEBUG : rclone-sync-test-include/layer2/: Removing directory marker
    run.go:125: removing dir "rclone-sync-test-include/layer2" failed - try 3/3: removing directory marker failed: googleapi: Error 404: No such object: rclone-test-doxaduw2yope/rclone-sync-test-include/layer2/, notFound
    run.go:128: removing dir "rclone-sync-test-include/layer2" failed: removing directory marker failed: googleapi: Error 404: No such object: rclone-test-doxaduw2yope/rclone-sync-test-include/layer2/, notFound
2025/03/06 01:52:16 DEBUG : rclone-sync-test-include/: Removing directory marker
    run.go:125: removing dir "rclone-sync-test-include" failed - try 1/3: removing directory marker failed: googleapi: Error 404: No such object: rclone-test-doxaduw2yope/rclone-sync-test-include/, notFound
2025/03/06 01:52:17 DEBUG : rclone-sync-test-include/: Removing directory marker
    run.go:125: removing dir "rclone-sync-test-include" failed - try 2/3: removing directory marker failed: googleapi: Error 404: No such object: rclone-test-doxaduw2yope/rclone-sync-test-include/, notFound
2025/03/06 01:52:18 DEBUG : rclone-sync-test-include/: Removing directory marker
    run.go:125: removing dir "rclone-sync-test-include" failed - try 3/3: removing directory marker failed: googleapi: Error 404: No such object: rclone-test-doxaduw2yope/rclone-sync-test-include/, notFound
    run.go:128: removing dir "rclone-sync-test-include" failed: removing directory marker failed: googleapi: Error 404: No such object: rclone-test-doxaduw2yope/rclone-sync-test-include/, notFound
2025/03/06 01:52:19 DEBUG : rclone-sync-test-ignore-file/: Removing directory marker
    run.go:125: removing dir "rclone-sync-test-ignore-file" failed - try 1/3: removing directory marker failed: googleapi: Error 404: No such object: rclone-test-doxaduw2yope/rclone-sync-test-ignore-file/, notFound
2025/03/06 01:52:20 DEBUG : rclone-sync-test-ignore-file/: Removing directory marker
    run.go:125: removing dir "rclone-sync-test-ignore-file" failed - try 2/3: removing directory marker failed: googleapi: Error 404: No such object: rclone-test-doxaduw2yope/rclone-sync-test-ignore-file/, notFound
2025/03/06 01:52:21 DEBUG : rclone-sync-test-ignore-file/: Removing directory marker
    run.go:125: removing dir "rclone-sync-test-ignore-file" failed - try 3/3: removing directory marker failed: googleapi: Error 404: No such object: rclone-test-doxaduw2yope/rclone-sync-test-ignore-file/, notFound
    run.go:128: removing dir "rclone-sync-test-ignore-file" failed: removing directory marker failed: googleapi: Error 404: No such object: rclone-test-doxaduw2yope/rclone-sync-test-ignore-file/, notFound
2025/03/06 01:52:22 DEBUG : rclone-sync-test/: Removing directory marker
    run.go:125: removing dir "rclone-sync-test" failed - try 1/3: removing directory marker failed: googleapi: Error 404: No such object: rclone-test-doxaduw2yope/rclone-sync-test/, notFound
2025/03/06 01:52:23 DEBUG : rclone-sync-test/: Removing directory marker
    run.go:125: removing dir "rclone-sync-test" failed - try 2/3: removing directory marker failed: googleapi: Error 404: No such object: rclone-test-doxaduw2yope/rclone-sync-test/, notFound
2025/03/06 01:52:24 DEBUG : rclone-sync-test/: Removing directory marker
    run.go:125: removing dir "rclone-sync-test" failed - try 3/3: removing directory marker failed: googleapi: Error 404: No such object: rclone-test-doxaduw2yope/rclone-sync-test/, notFound
    run.go:128: removing dir "rclone-sync-test" failed: removing directory marker failed: googleapi: Error 404: No such object: rclone-test-doxaduw2yope/rclone-sync-test/, notFound
    fstest.go:292: Sleeping for 1s for list eventual consistency: 1/3
    fstest.go:292: Sleeping for 2s for list eventual consistency: 2/3
    fstest.go:292: Sleeping for 4s for list eventual consistency: 3/3
    fstest.go:321: 
        	Error Trace:	/home/rclone/go/src/github.com/rclone/rclone/fstest/fstest.go:321
        	            				/home/rclone/go/src/github.com/rclone/rclone/fstest/fstest.go:332
        	            				/home/rclone/go/src/github.com/rclone/rclone/fstest/run.go:173
        	            				/home/rclone/go/src/github.com/rclone/rclone/fstest/run.go:388
        	            				/home/rclone/go/pkg/mod/golang.org/toolchain@v0.0.1-go1.23.0.linux-amd64/src/testing/testing.go:1176
        	            				/home/rclone/go/pkg/mod/golang.org/toolchain@v0.0.1-go1.23.0.linux-amd64/src/testing/testing.go:1354
        	            				/home/rclone/go/pkg/mod/golang.org/toolchain@v0.0.1-go1.23.0.linux-amd64/src/testing/testing.go:1684
        	Error:      	Not equal: 
        	            	expected: []string{}
        	            	actual  : []string{"rclone-sync-test", "rclone-sync-test-ignore-file", "rclone-sync-test-include", "rclone-sync-test-include/layer2"}
        	            	
        	            	Diff:
        	            	--- Expected
        	            	+++ Actual
        	            	@@ -1,2 +1,6 @@
        	            	-([]string) {
        	            	+([]string) (len=4) {
        	            	+ (string) (len=16) "rclone-sync-test",
        	            	+ (string) (len=28) "rclone-sync-test-ignore-file",
        	            	+ (string) (len=24) "rclone-sync-test-include",
        	            	+ (string) (len=31) "rclone-sync-test-include/layer2"
        	            	 }
        	Test:       	TestSyncOverlapWithFilter
        	Messages:   	directories
2025/03/06 01:52:32 DEBUG : rclone-sync-test-include/layer2/: Removing directory marker
    run.go:125: removing dir "rclone-sync-test-include/layer2" failed - try 1/3: removing directory marker failed: googleapi: Error 404: No such object: rclone-test-doxaduw2yope/rclone-sync-test-include/layer2/, notFound
2025/03/06 01:52:33 DEBUG : rclone-sync-test-include/layer2/: Removing directory marker
    run.go:125: removing dir "rclone-sync-test-include/layer2" failed - try 2/3: removing directory marker failed: googleapi: Error 404: No such object: rclone-test-doxaduw2yope/rclone-sync-test-include/layer2/, notFound
2025/03/06 01:52:35 DEBUG : rclone-sync-test-include/layer2/: Removing directory marker
    run.go:125: removing dir "rclone-sync-test-include/layer2" failed - try 3/3: removing directory marker failed: googleapi: Error 404: No such object: rclone-test-doxaduw2yope/rclone-sync-test-include/layer2/, notFound
    run.go:128: removing dir "rclone-sync-test-include/layer2" failed: removing directory marker failed: googleapi: Error 404: No such object: rclone-test-doxaduw2yope/rclone-sync-test-include/layer2/, notFound
2025/03/06 01:52:36 DEBUG : rclone-sync-test-include/: Removing directory marker
    run.go:125: removing dir "rclone-sync-test-include" failed - try 1/3: removing directory marker failed: googleapi: Error 404: No such object: rclone-test-doxaduw2yope/rclone-sync-test-include/, notFound
2025/03/06 01:52:37 DEBUG : rclone-sync-test-include/: Removing directory marker
    run.go:125: removing dir "rclone-sync-test-include" failed - try 2/3: removing directory marker failed: googleapi: Error 404: No such object: rclone-test-doxaduw2yope/rclone-sync-test-include/, notFound
2025/03/06 01:52:38 DEBUG : rclone-sync-test-include/: Removing directory marker
    run.go:125: removing dir "rclone-sync-test-include" failed - try 3/3: removing directory marker failed: googleapi: Error 404: No such object: rclone-test-doxaduw2yope/rclone-sync-test-include/, notFound
    run.go:128: removing dir "rclone-sync-test-include" failed: removing directory marker failed: googleapi: Error 404: No such object: rclone-test-doxaduw2yope/rclone-sync-test-include/, notFound
2025/03/06 01:52:39 DEBUG : rclone-sync-test-ignore-file/: Removing directory marker
    run.go:125: removing dir "rclone-sync-test-ignore-file" failed - try 1/3: removing directory marker failed: googleapi: Error 404: No such object: rclone-test-doxaduw2yope/rclone-sync-test-ignore-file/, notFound
2025/03/06 01:52:40 DEBUG : rclone-sync-test-ignore-file/: Removing directory marker
    run.go:125: removing dir "rclone-sync-test-ignore-file" failed - try 2/3: removing directory marker failed: googleapi: Error 404: No such object: rclone-test-doxaduw2yope/rclone-sync-test-ignore-file/, notFound
2025/03/06 01:52:41 DEBUG : rclone-sync-test-ignore-file/: Removing directory marker
    run.go:125: removing dir "rclone-sync-test-ignore-file" failed - try 3/3: removing directory marker failed: googleapi: Error 404: No such object: rclone-test-doxaduw2yope/rclone-sync-test-ignore-file/, notFound
    run.go:128: removing dir "rclone-sync-test-ignore-file" failed: removing directory marker failed: googleapi: Error 404: No such object: rclone-test-doxaduw2yope/rclone-sync-test-ignore-file/, notFound
2025/03/06 01:52:42 DEBUG : rclone-sync-test/: Removing directory marker
    run.go:125: removing dir "rclone-sync-test" failed - try 1/3: removing directory marker failed: googleapi: Error 404: No such object: rclone-test-doxaduw2yope/rclone-sync-test/, notFound
2025/03/06 01:52:43 DEBUG : rclone-sync-test/: Removing directory marker
    run.go:125: removing dir "rclone-sync-test" failed - try 2/3: removing directory marker failed: googleapi: Error 404: No such object: rclone-test-doxaduw2yope/rclone-sync-test/, notFound
2025/03/06 01:52:44 DEBUG : rclone-sync-test/: Removing directory marker
    run.go:125: removing dir "rclone-sync-test" failed - try 3/3: removing directory marker failed: googleapi: Error 404: No such object: rclone-test-doxaduw2yope/rclone-sync-test/, notFound
    run.go:128: removing dir "rclone-sync-test" failed: removing directory marker failed: googleapi: Error 404: No such object: rclone-test-doxaduw2yope/rclone-sync-test/, notFound
    fstest.go:292: Sleeping for 1s for list eventual consistency: 1/3
    fstest.go:292: Sleeping for 2s for list eventual consistency: 2/3
    fstest.go:292: Sleeping for 4s for list eventual consistency: 3/3
    fstest.go:321: 
        	Error Trace:	/home/rclone/go/src/github.com/rclone/rclone/fstest/fstest.go:321
        	            				/home/rclone/go/src/github.com/rclone/rclone/fstest/fstest.go:332
        	            				/home/rclone/go/src/github.com/rclone/rclone/fstest/run.go:173
        	            				/home/rclone/go/src/github.com/rclone/rclone/fstest/run.go:388
        	            				/home/rclone/go/pkg/mod/golang.org/toolchain@v0.0.1-go1.23.0.linux-amd64/src/testing/testing.go:1176
        	            				/home/rclone/go/pkg/mod/golang.org/toolchain@v0.0.1-go1.23.0.linux-amd64/src/testing/testing.go:1354
        	            				/home/rclone/go/pkg/mod/golang.org/toolchain@v0.0.1-go1.23.0.linux-amd64/src/testing/testing.go:1684
        	Error:      	Not equal: 
        	            	expected: []string{}
        	            	actual  : []string{"rclone-sync-test", "rclone-sync-test-ignore-file", "rclone-sync-test-include", "rclone-sync-test-include/layer2"}
        	            	
        	            	Diff:
        	            	--- Expected
        	            	+++ Actual
        	            	@@ -1,2 +1,6 @@
        	            	-([]string) {
        	            	+([]string) (len=4) {
        	            	+ (string) (len=16) "rclone-sync-test",
        	            	+ (string) (len=28) "rclone-sync-test-ignore-file",
        	            	+ (string) (len=24) "rclone-sync-test-include",
        	            	+ (string) (len=31) "rclone-sync-test-include/layer2"
        	            	 }
        	Test:       	TestSyncOverlapWithFilter
        	Messages:   	directories
2025/03/06 01:52:52 DEBUG : rclone-sync-test-include/layer2/: Removing directory marker
    run.go:125: removing dir "rclone-sync-test-include/layer2" failed - try 1/3: removing directory marker failed: googleapi: Error 404: No such object: rclone-test-doxaduw2yope/rclone-sync-test-include/layer2/, notFound
2025/03/06 01:52:53 DEBUG : rclone-sync-test-include/layer2/: Removing directory marker
    run.go:125: removing dir "rclone-sync-test-include/layer2" failed - try 2/3: removing directory marker failed: googleapi: Error 404: No such object: rclone-test-doxaduw2yope/rclone-sync-test-include/layer2/, notFound
2025/03/06 01:52:54 DEBUG : rclone-sync-test-include/layer2/: Removing directory marker
    run.go:125: removing dir "rclone-sync-test-include/layer2" failed - try 3/3: removing directory marker failed: googleapi: Error 404: No such object: rclone-test-doxaduw2yope/rclone-sync-test-include/layer2/, notFound
    run.go:128: removing dir "rclone-sync-test-include/layer2" failed: removing directory marker failed: googleapi: Error 404: No such object: rclone-test-doxaduw2yope/rclone-sync-test-include/layer2/, notFound
2025/03/06 01:52:55 DEBUG : rclone-sync-test-include/: Removing directory marker
    run.go:125: removing dir "rclone-sync-test-include" failed - try 1/3: removing directory marker failed: googleapi: Error 404: No such object: rclone-test-doxaduw2yope/rclone-sync-test-include/, notFound
2025/03/06 01:52:56 DEBUG : rclone-sync-test-include/: Removing directory marker
    run.go:125: removing dir "rclone-sync-test-include" failed - try 2/3: removing directory marker failed: googleapi: Error 404: No such object: rclone-test-doxaduw2yope/rclone-sync-test-include/, notFound
2025/03/06 01:52:58 DEBUG : rclone-sync-test-include/: Removing directory marker
    run.go:125: removing dir "rclone-sync-test-include" failed - try 3/3: removing directory marker failed: googleapi: Error 404: No such object: rclone-test-doxaduw2yope/rclone-sync-test-include/, notFound
    run.go:128: removing dir "rclone-sync-test-include" failed: removing directory marker failed: googleapi: Error 404: No such object: rclone-test-doxaduw2yope/rclone-sync-test-include/, notFound
2025/03/06 01:52:59 DEBUG : rclone-sync-test-ignore-file/: Removing directory marker
    run.go:125: removing dir "rclone-sync-test-ignore-file" failed - try 1/3: removing directory marker failed: googleapi: Error 404: No such object: rclone-test-doxaduw2yope/rclone-sync-test-ignore-file/, notFound
2025/03/06 01:53:00 DEBUG : rclone-sync-test-ignore-file/: Removing directory marker
    run.go:125: removing dir "rclone-sync-test-ignore-file" failed - try 2/3: removing directory marker failed: googleapi: Error 404: No such object: rclone-test-doxaduw2yope/rclone-sync-test-ignore-file/, notFound
2025/03/06 01:53:01 DEBUG : rclone-sync-test-ignore-file/: Removing directory marker
    run.go:125: removing dir "rclone-sync-test-ignore-file" failed - try 3/3: removing directory marker failed: googleapi: Error 404: No such object: rclone-test-doxaduw2yope/rclone-sync-test-ignore-file/, notFound
    run.go:128: removing dir "rclone-sync-test-ignore-file" failed: removing directory marker failed: googleapi: Error 404: No such object: rclone-test-doxaduw2yope/rclone-sync-test-ignore-file/, notFound
2025/03/06 01:53:02 DEBUG : rclone-sync-test/: Removing directory marker
    run.go:125: removing dir "rclone-sync-test" failed - try 1/3: removing directory marker failed: googleapi: Error 404: No such object: rclone-test-doxaduw2yope/rclone-sync-test/, notFound
2025/03/06 01:53:03 DEBUG : rclone-sync-test/: Removing directory marker
    run.go:125: removing dir "rclone-sync-test" failed - try 2/3: removing directory marker failed: googleapi: Error 404: No such object: rclone-test-doxaduw2yope/rclone-sync-test/, notFound
2025/03/06 01:53:04 DEBUG : rclone-sync-test/: Removing directory marker
    run.go:125: removing dir "rclone-sync-test" failed - try 3/3: removing directory marker failed: googleapi: Error 404: No such object: rclone-test-doxaduw2yope/rclone-sync-test/, notFound
    run.go:128: removing dir "rclone-sync-test" failed: removing directory marker failed: googleapi: Error 404: No such object: rclone-test-doxaduw2yope/rclone-sync-test/, notFound
    fstest.go:292: Sleeping for 1s for list eventual consistency: 1/3
    fstest.go:292: Sleeping for 2s for list eventual consistency: 2/3
    fstest.go:292: Sleeping for 4s for list eventual consistency: 3/3
    fstest.go:321: 
        	Error Trace:	/home/rclone/go/src/github.com/rclone/rclone/fstest/fstest.go:321
        	            				/home/rclone/go/src/github.com/rclone/rclone/fstest/fstest.go:332
        	            				/home/rclone/go/src/github.com/rclone/rclone/fstest/run.go:173
        	            				/home/rclone/go/src/github.com/rclone/rclone/fstest/run.go:388
        	            				/home/rclone/go/pkg/mod/golang.org/toolchain@v0.0.1-go1.23.0.linux-amd64/src/testing/testing.go:1176
        	            				/home/rclone/go/pkg/mod/golang.org/toolchain@v0.0.1-go1.23.0.linux-amd64/src/testing/testing.go:1354
        	            				/home/rclone/go/pkg/mod/golang.org/toolchain@v0.0.1-go1.23.0.linux-amd64/src/testing/testing.go:1684
        	Error:      	Not equal: 
        	            	expected: []string{}
        	            	actual  : []string{"rclone-sync-test", "rclone-sync-test-ignore-file", "rclone-sync-test-include", "rclone-sync-test-include/layer2"}
        	            	
        	            	Diff:
        	            	--- Expected
        	            	+++ Actual
        	            	@@ -1,2 +1,6 @@
        	            	-([]string) {
        	            	+([]string) (len=4) {
        	            	+ (string) (len=16) "rclone-sync-test",
        	            	+ (string) (len=28) "rclone-sync-test-ignore-file",
        	            	+ (string) (len=24) "rclone-sync-test-include",
        	            	+ (string) (len=31) "rclone-sync-test-include/layer2"
        	            	 }
        	Test:       	TestSyncOverlapWithFilter
        	Messages:   	directories
2025/03/06 01:53:12 DEBUG : rclone-sync-test-include/layer2/: Removing directory marker
    run.go:125: removing dir "rclone-sync-test-include/layer2" failed - try 1/3: removing directory marker failed: googleapi: Error 404: No such object: rclone-test-doxaduw2yope/rclone-sync-test-include/layer2/, notFound
2025/03/06 01:53:13 DEBUG : rclone-sync-test-include/layer2/: Removing directory marker
    run.go:125: removing dir "rclone-sync-test-include/layer2" failed - try 2/3: removing directory marker failed: googleapi: Error 404: No such object: rclone-test-doxaduw2yope/rclone-sync-test-include/layer2/, notFound
2025/03/06 01:53:14 DEBUG : rclone-sync-test-include/layer2/: Removing directory marker
    run.go:125: removing dir "rclone-sync-test-include/layer2" failed - try 3/3: removing directory marker failed: googleapi: Error 404: No such object: rclone-test-doxaduw2yope/rclone-sync-test-include/layer2/, notFound
    run.go:128: removing dir "rclone-sync-test-include/layer2" failed: removing directory marker failed: googleapi: Error 404: No such object: rclone-test-doxaduw2yope/rclone-sync-test-include/layer2/, notFound
2025/03/06 01:53:15 DEBUG : rclone-sync-test-include/: Removing directory marker
    run.go:125: removing dir "rclone-sync-test-include" failed - try 1/3: removing directory marker failed: googleapi: Error 404: No such object: rclone-test-doxaduw2yope/rclone-sync-test-include/, notFound
2025/03/06 01:53:17 DEBUG : rclone-sync-test-include/: Removing directory marker
    run.go:125: removing dir "rclone-sync-test-include" failed - try 2/3: removing directory marker failed: googleapi: Error 404: No such object: rclone-test-doxaduw2yope/rclone-sync-test-include/, notFound
2025/03/06 01:53:18 DEBUG : rclone-sync-test-include/: Removing directory marker
    run.go:125: removing dir "rclone-sync-test-include" failed - try 3/3: removing directory marker failed: googleapi: Error 404: No such object: rclone-test-doxaduw2yope/rclone-sync-test-include/, notFound
    run.go:128: removing dir "rclone-sync-test-include" failed: removing directory marker failed: googleapi: Error 404: No such object: rclone-test-doxaduw2yope/rclone-sync-test-include/, notFound
2025/03/06 01:53:19 DEBUG : rclone-sync-test-ignore-file/: Removing directory marker
    run.go:125: removing dir "rclone-sync-test-ignore-file" failed - try 1/3: removing directory marker failed: googleapi: Error 404: No such object: rclone-test-doxaduw2yope/rclone-sync-test-ignore-file/, notFound
2025/03/06 01:53:20 DEBUG : rclone-sync-test-ignore-file/: Removing directory marker
    run.go:125: removing dir "rclone-sync-test-ignore-file" failed - try 2/3: removing directory marker failed: googleapi: Error 404: No such object: rclone-test-doxaduw2yope/rclone-sync-test-ignore-file/, notFound
2025/03/06 01:53:21 DEBUG : rclone-sync-test-ignore-file/: Removing directory marker
    run.go:125: removing dir "rclone-sync-test-ignore-file" failed - try 3/3: removing directory marker failed: googleapi: Error 404: No such object: rclone-test-doxaduw2yope/rclone-sync-test-ignore-file/, notFound
    run.go:128: removing dir "rclone-sync-test-ignore-file" failed: removing directory marker failed: googleapi: Error 404: No such object: rclone-test-doxaduw2yope/rclone-sync-test-ignore-file/, notFound
2025/03/06 01:53:22 DEBUG : rclone-sync-test/: Removing directory marker
    run.go:125: removing dir "rclone-sync-test" failed - try 1/3: removing directory marker failed: googleapi: Error 404: No such object: rclone-test-doxaduw2yope/rclone-sync-test/, notFound
2025/03/06 01:53:23 DEBUG : rclone-sync-test/: Removing directory marker
    run.go:125: removing dir "rclone-sync-test" failed - try 2/3: removing directory marker failed: googleapi: Error 404: No such object: rclone-test-doxaduw2yope/rclone-sync-test/, notFound
2025/03/06 01:53:24 DEBUG : rclone-sync-test/: Removing directory marker
    run.go:125: removing dir "rclone-sync-test" failed - try 3/3: removing directory marker failed: googleapi: Error 404: No such object: rclone-test-doxaduw2yope/rclone-sync-test/, notFound
    run.go:128: removing dir "rclone-sync-test" failed: removing directory marker failed: googleapi: Error 404: No such object: rclone-test-doxaduw2yope/rclone-sync-test/, notFound
    fstest.go:292: Sleeping for 1s for list eventual consistency: 1/3
    fstest.go:292: Sleeping for 2s for list eventual consistency: 2/3
    fstest.go:292: Sleeping for 4s for list eventual consistency: 3/3
    fstest.go:321: 
        	Error Trace:	/home/rclone/go/src/github.com/rclone/rclone/fstest/fstest.go:321
        	            				/home/rclone/go/src/github.com/rclone/rclone/fstest/fstest.go:332
        	            				/home/rclone/go/src/github.com/rclone/rclone/fstest/run.go:173
        	            				/home/rclone/go/src/github.com/rclone/rclone/fstest/run.go:388
        	            				/home/rclone/go/pkg/mod/golang.org/toolchain@v0.0.1-go1.23.0.linux-amd64/src/testing/testing.go:1176
        	            				/home/rclone/go/pkg/mod/golang.org/toolchain@v0.0.1-go1.23.0.linux-amd64/src/testing/testing.go:1354
        	            				/home/rclone/go/pkg/mod/golang.org/toolchain@v0.0.1-go1.23.0.linux-amd64/src/testing/testing.go:1684
        	Error:      	Not equal: 
        	            	expected: []string{}
        	            	actual  : []string{"rclone-sync-test", "rclone-sync-test-ignore-file", "rclone-sync-test-include", "rclone-sync-test-include/layer2"}
        	            	
        	            	Diff:
        	            	--- Expected
        	            	+++ Actual
        	            	@@ -1,2 +1,6 @@
        	            	-([]string) {
        	            	+([]string) (len=4) {
        	            	+ (string) (len=16) "rclone-sync-test",
        	            	+ (string) (len=28) "rclone-sync-test-ignore-file",
        	            	+ (string) (len=24) "rclone-sync-test-include",
        	            	+ (string) (len=31) "rclone-sync-test-include/layer2"
        	            	 }
        	Test:       	TestSyncOverlapWithFilter
        	Messages:   	directories
2025/03/06 01:53:32 DEBUG : rclone-sync-test-include/layer2/: Removing directory marker
    run.go:125: removing dir "rclone-sync-test-include/layer2" failed - try 1/3: removing directory marker failed: googleapi: Error 404: No such object: rclone-test-doxaduw2yope/rclone-sync-test-include/layer2/, notFound
2025/03/06 01:53:33 DEBUG : rclone-sync-test-include/layer2/: Removing directory marker
    run.go:125: removing dir "rclone-sync-test-include/layer2" failed - try 2/3: removing directory marker failed: googleapi: Error 404: No such object: rclone-test-doxaduw2yope/rclone-sync-test-include/layer2/, notFound
2025/03/06 01:53:34 DEBUG : rclone-sync-test-include/layer2/: Removing directory marker
    run.go:125: removing dir "rclone-sync-test-include/layer2" failed - try 3/3: removing directory marker failed: googleapi: Error 404: No such object: rclone-test-doxaduw2yope/rclone-sync-test-include/layer2/, notFound
    run.go:128: removing dir "rclone-sync-test-include/layer2" failed: removing directory marker failed: googleapi: Error 404: No such object: rclone-test-doxaduw2yope/rclone-sync-test-include/layer2/, notFound
2025/03/06 01:53:35 DEBUG : rclone-sync-test-include/: Removing directory marker
    run.go:125: removing dir "rclone-sync-test-include" failed - try 1/3: removing directory marker failed: googleapi: Error 404: No such object: rclone-test-doxaduw2yope/rclone-sync-test-include/, notFound
2025/03/06 01:53:36 DEBUG : rclone-sync-test-include/: Removing directory marker
    run.go:125: removing dir "rclone-sync-test-include" failed - try 2/3: removing directory marker failed: googleapi: Error 404: No such object: rclone-test-doxaduw2yope/rclone-sync-test-include/, notFound
2025/03/06 01:53:37 DEBUG : rclone-sync-test-include/: Removing directory marker
    run.go:125: removing dir "rclone-sync-test-include" failed - try 3/3: removing directory marker failed: googleapi: Error 404: No such object: rclone-test-doxaduw2yope/rclone-sync-test-include/, notFound
    run.go:128: removing dir "rclone-sync-test-include" failed: removing directory marker failed: googleapi: Error 404: No such object: rclone-test-doxaduw2yope/rclone-sync-test-include/, notFound
2025/03/06 01:53:39 DEBUG : rclone-sync-test-ignore-file/: Removing directory marker
    run.go:125: removing dir "rclone-sync-test-ignore-file" failed - try 1/3: removing directory marker failed: googleapi: Error 404: No such object: rclone-test-doxaduw2yope/rclone-sync-test-ignore-file/, notFound
2025/03/06 01:53:40 DEBUG : rclone-sync-test-ignore-file/: Removing directory marker
    run.go:125: removing dir "rclone-sync-test-ignore-file" failed - try 2/3: removing directory marker failed: googleapi: Error 404: No such object: rclone-test-doxaduw2yope/rclone-sync-test-ignore-file/, notFound
2025/03/06 01:53:41 DEBUG : rclone-sync-test-ignore-file/: Removing directory marker
    run.go:125: removing dir "rclone-sync-test-ignore-file" failed - try 3/3: removing directory marker failed: googleapi: Error 404: No such object: rclone-test-doxaduw2yope/rclone-sync-test-ignore-file/, notFound
    run.go:128: removing dir "rclone-sync-test-ignore-file" failed: removing directory marker failed: googleapi: Error 404: No such object: rclone-test-doxaduw2yope/rclone-sync-test-ignore-file/, notFound
2025/03/06 01:53:42 DEBUG : rclone-sync-test/: Removing directory marker
    run.go:125: removing dir "rclone-sync-test" failed - try 1/3: removing directory marker failed: googleapi: Error 404: No such object: rclone-test-doxaduw2yope/rclone-sync-test/, notFound
2025/03/06 01:53:43 DEBUG : rclone-sync-test/: Removing directory marker
    run.go:125: removing dir "rclone-sync-test" failed - try 2/3: removing directory marker failed: googleapi: Error 404: No such object: rclone-test-doxaduw2yope/rclone-sync-test/, notFound
2025/03/06 01:53:44 DEBUG : rclone-sync-test/: Removing directory marker
    run.go:125: removing dir "rclone-sync-test" failed - try 3/3: removing directory marker failed: googleapi: Error 404: No such object: rclone-test-doxaduw2yope/rclone-sync-test/, notFound
    run.go:128: removing dir "rclone-sync-test" failed: removing directory marker failed: googleapi: Error 404: No such object: rclone-test-doxaduw2yope/rclone-sync-test/, notFound
    fstest.go:292: Sleeping for 1s for list eventual consistency: 1/3
    fstest.go:292: Sleeping for 2s for list eventual consistency: 2/3
    fstest.go:292: Sleeping for 4s for list eventual consistency: 3/3
    fstest.go:321: 
        	Error Trace:	/home/rclone/go/src/github.com/rclone/rclone/fstest/fstest.go:321
        	            				/home/rclone/go/src/github.com/rclone/rclone/fstest/fstest.go:332
        	            				/home/rclone/go/src/github.com/rclone/rclone/fstest/run.go:173
        	            				/home/rclone/go/src/github.com/rclone/rclone/fstest/run.go:388
        	            				/home/rclone/go/pkg/mod/golang.org/toolchain@v0.0.1-go1.23.0.linux-amd64/src/testing/testing.go:1176
        	            				/home/rclone/go/pkg/mod/golang.org/toolchain@v0.0.1-go1.23.0.linux-amd64/src/testing/testing.go:1354
        	            				/home/rclone/go/pkg/mod/golang.org/toolchain@v0.0.1-go1.23.0.linux-amd64/src/testing/testing.go:1684
        	Error:      	Not equal: 
        	            	expected: []string{}
        	            	actual  : []string{"rclone-sync-test", "rclone-sync-test-ignore-file", "rclone-sync-test-include", "rclone-sync-test-include/layer2"}
        	            	
        	            	Diff:
        	            	--- Expected
        	            	+++ Actual
        	            	@@ -1,2 +1,6 @@
        	            	-([]string) {
        	            	+([]string) (len=4) {
        	            	+ (string) (len=16) "rclone-sync-test",
        	            	+ (string) (len=28) "rclone-sync-test-ignore-file",
        	            	+ (string) (len=24) "rclone-sync-test-include",
        	            	+ (string) (len=31) "rclone-sync-test-include/layer2"
        	            	 }
        	Test:       	TestSyncOverlapWithFilter
        	Messages:   	directories
2025/03/06 01:53:52 DEBUG : rclone-sync-test-include/layer2/: Removing directory marker
    run.go:125: removing dir "rclone-sync-test-include/layer2" failed - try 1/3: removing directory marker failed: googleapi: Error 404: No such object: rclone-test-doxaduw2yope/rclone-sync-test-include/layer2/, notFound
2025/03/06 01:53:53 DEBUG : rclone-sync-test-include/layer2/: Removing directory marker
    run.go:125: removing dir "rclone-sync-test-include/layer2" failed - try 2/3: removing directory marker failed: googleapi: Error 404: No such object: rclone-test-doxaduw2yope/rclone-sync-test-include/layer2/, notFound
2025/03/06 01:53:54 DEBUG : rclone-sync-test-include/layer2/: Removing directory marker
    run.go:125: removing dir "rclone-sync-test-include/layer2" failed - try 3/3: removing directory marker failed: googleapi: Error 404: No such object: rclone-test-doxaduw2yope/rclone-sync-test-include/layer2/, notFound
    run.go:128: removing dir "rclone-sync-test-include/layer2" failed: removing directory marker failed: googleapi: Error 404: No such object: rclone-test-doxaduw2yope/rclone-sync-test-include/layer2/, notFound
2025/03/06 01:53:55 DEBUG : rclone-sync-test-include/: Removing directory marker
    run.go:125: removing dir "rclone-sync-test-include" failed - try 1/3: removing directory marker failed: googleapi: Error 404: No such object: rclone-test-doxaduw2yope/rclone-sync-test-include/, notFound
2025/03/06 01:53:57 DEBUG : rclone-sync-test-include/: Removing directory marker
    run.go:125: removing dir "rclone-sync-test-include" failed - try 2/3: removing directory marker failed: googleapi: Error 404: No such object: rclone-test-doxaduw2yope/rclone-sync-test-include/, notFound
2025/03/06 01:53:58 DEBUG : rclone-sync-test-include/: Removing directory marker
    run.go:125: removing dir "rclone-sync-test-include" failed - try 3/3: removing directory marker failed: googleapi: Error 404: No such object: rclone-test-doxaduw2yope/rclone-sync-test-include/, notFound
    run.go:128: removing dir "rclone-sync-test-include" failed: removing directory marker failed: googleapi: Error 404: No such object: rclone-test-doxaduw2yope/rclone-sync-test-include/, notFound
2025/03/06 01:53:59 DEBUG : rclone-sync-test-ignore-file/: Removing directory marker
    run.go:125: removing dir "rclone-sync-test-ignore-file" failed - try 1/3: removing directory marker failed: googleapi: Error 404: No such object: rclone-test-doxaduw2yope/rclone-sync-test-ignore-file/, notFound
2025/03/06 01:54:00 DEBUG : rclone-sync-test-ignore-file/: Removing directory marker
    run.go:125: removing dir "rclone-sync-test-ignore-file" failed - try 2/3: removing directory marker failed: googleapi: Error 404: No such object: rclone-test-doxaduw2yope/rclone-sync-test-ignore-file/, notFound
2025/03/06 01:54:01 DEBUG : rclone-sync-test-ignore-file/: Removing directory marker
    run.go:125: removing dir "rclone-sync-test-ignore-file" failed - try 3/3: removing directory marker failed: googleapi: Error 404: No such object: rclone-test-doxaduw2yope/rclone-sync-test-ignore-file/, notFound
    run.go:128: removing dir "rclone-sync-test-ignore-file" failed: removing directory marker failed: googleapi: Error 404: No such object: rclone-test-doxaduw2yope/rclone-sync-test-ignore-file/, notFound
2025/03/06 01:54:02 DEBUG : rclone-sync-test/: Removing directory marker
    run.go:125: removing dir "rclone-sync-test" failed - try 1/3: removing directory marker failed: googleapi: Error 404: No such object: rclone-test-doxaduw2yope/rclone-sync-test/, notFound
2025/03/06 01:54:03 DEBUG : rclone-sync-test/: Removing directory marker
    run.go:125: removing dir "rclone-sync-test" failed - try 2/3: removing directory marker failed: googleapi: Error 404: No such object: rclone-test-doxaduw2yope/rclone-sync-test/, notFound
2025/03/06 01:54:04 DEBUG : rclone-sync-test/: Removing directory marker
    run.go:125: removing dir "rclone-sync-test" failed - try 3/3: removing directory marker failed: googleapi: Error 404: No such object: rclone-test-doxaduw2yope/rclone-sync-test/, notFound
    run.go:128: removing dir "rclone-sync-test" failed: removing directory marker failed: googleapi: Error 404: No such object: rclone-test-doxaduw2yope/rclone-sync-test/, notFound
    fstest.go:292: Sleeping for 1s for list eventual consistency: 1/3
    fstest.go:292: Sleeping for 2s for list eventual consistency: 2/3
    fstest.go:292: Sleeping for 4s for list eventual consistency: 3/3
    fstest.go:321: 
        	Error Trace:	/home/rclone/go/src/github.com/rclone/rclone/fstest/fstest.go:321
        	            				/home/rclone/go/src/github.com/rclone/rclone/fstest/fstest.go:332
        	            				/home/rclone/go/src/github.com/rclone/rclone/fstest/run.go:173
        	            				/home/rclone/go/src/github.com/rclone/rclone/fstest/run.go:388
        	            				/home/rclone/go/pkg/mod/golang.org/toolchain@v0.0.1-go1.23.0.linux-amd64/src/testing/testing.go:1176
        	            				/home/rclone/go/pkg/mod/golang.org/toolchain@v0.0.1-go1.23.0.linux-amd64/src/testing/testing.go:1354
        	            				/home/rclone/go/pkg/mod/golang.org/toolchain@v0.0.1-go1.23.0.linux-amd64/src/testing/testing.go:1684
        	Error:      	Not equal: 
        	            	expected: []string{}
        	            	actual  : []string{"rclone-sync-test", "rclone-sync-test-ignore-file", "rclone-sync-test-include", "rclone-sync-test-include/layer2"}
        	            	
        	            	Diff:
        	            	--- Expected
        	            	+++ Actual
        	            	@@ -1,2 +1,6 @@
        	            	-([]string) {
        	            	+([]string) (len=4) {
        	            	+ (string) (len=16) "rclone-sync-test",
        	            	+ (string) (len=28) "rclone-sync-test-ignore-file",
        	            	+ (string) (len=24) "rclone-sync-test-include",
        	            	+ (string) (len=31) "rclone-sync-test-include/layer2"
        	            	 }
        	Test:       	TestSyncOverlapWithFilter
        	Messages:   	directories
2025/03/06 01:54:12 DEBUG : rclone-sync-test-include/layer2/: Removing directory marker
    run.go:125: removing dir "rclone-sync-test-include/layer2" failed - try 1/3: removing directory marker failed: googleapi: Error 404: No such object: rclone-test-doxaduw2yope/rclone-sync-test-include/layer2/, notFound
2025/03/06 01:54:13 DEBUG : rclone-sync-test-include/layer2/: Removing directory marker
    run.go:125: removing dir "rclone-sync-test-include/layer2" failed - try 2/3: removing directory marker failed: googleapi: Error 404: No such object: rclone-test-doxaduw2yope/rclone-sync-test-include/layer2/, notFound
2025/03/06 01:54:14 DEBUG : rclone-sync-test-include/layer2/: Removing directory marker
    run.go:125: removing dir "rclone-sync-test-include/layer2" failed - try 3/3: removing directory marker failed: googleapi: Error 404: No such object: rclone-test-doxaduw2yope/rclone-sync-test-include/layer2/, notFound
    run.go:128: removing dir "rclone-sync-test-include/layer2" failed: removing directory marker failed: googleapi: Error 404: No such object: rclone-test-doxaduw2yope/rclone-sync-test-include/layer2/, notFound
2025/03/06 01:54:15 DEBUG : rclone-sync-test-include/: Removing directory marker
    run.go:125: removing dir "rclone-sync-test-include" failed - try 1/3: removing directory marker failed: googleapi: Error 404: No such object: rclone-test-doxaduw2yope/rclone-sync-test-include/, notFound
2025/03/06 01:54:16 DEBUG : rclone-sync-test-include/: Removing directory marker
    run.go:125: removing dir "rclone-sync-test-include" failed - try 2/3: removing directory marker failed: googleapi: Error 404: No such object: rclone-test-doxaduw2yope/rclone-sync-test-include/, notFound
2025/03/06 01:54:17 DEBUG : rclone-sync-test-include/: Removing directory marker
    run.go:125: removing dir "rclone-sync-test-include" failed - try 3/3: removing directory marker failed: googleapi: Error 404: No such object: rclone-test-doxaduw2yope/rclone-sync-test-include/, notFound
    run.go:128: removing dir "rclone-sync-test-include" failed: removing directory marker failed: googleapi: Error 404: No such object: rclone-test-doxaduw2yope/rclone-sync-test-include/, notFound
2025/03/06 01:54:18 DEBUG : rclone-sync-test-ignore-file/: Removing directory marker
    run.go:125: removing dir "rclone-sync-test-ignore-file" failed - try 1/3: removing directory marker failed: googleapi: Error 404: No such object: rclone-test-doxaduw2yope/rclone-sync-test-ignore-file/, notFound
2025/03/06 01:54:20 DEBUG : rclone-sync-test-ignore-file/: Removing directory marker
    run.go:125: removing dir "rclone-sync-test-ignore-file" failed - try 2/3: removing directory marker failed: googleapi: Error 404: No such object: rclone-test-doxaduw2yope/rclone-sync-test-ignore-file/, notFound
2025/03/06 01:54:21 DEBUG : rclone-sync-test-ignore-file/: Removing directory marker
    run.go:125: removing dir "rclone-sync-test-ignore-file" failed - try 3/3: removing directory marker failed: googleapi: Error 404: No such object: rclone-test-doxaduw2yope/rclone-sync-test-ignore-file/, notFound
    run.go:128: removing dir "rclone-sync-test-ignore-file" failed: removing directory marker failed: googleapi: Error 404: No such object: rclone-test-doxaduw2yope/rclone-sync-test-ignore-file/, notFound
2025/03/06 01:54:22 DEBUG : rclone-sync-test/: Removing directory marker
    run.go:125: removing dir "rclone-sync-test" failed - try 1/3: removing directory marker failed: googleapi: Error 404: No such object: rclone-test-doxaduw2yope/rclone-sync-test/, notFound
2025/03/06 01:54:23 DEBUG : rclone-sync-test/: Removing directory marker
    run.go:125: removing dir "rclone-sync-test" failed - try 2/3: removing directory marker failed: googleapi: Error 404: No such object: rclone-test-doxaduw2yope/rclone-sync-test/, notFound
2025/03/06 01:54:24 DEBUG : rclone-sync-test/: Removing directory marker
    run.go:125: removing dir "rclone-sync-test" failed - try 3/3: removing directory marker failed: googleapi: Error 404: No such object: rclone-test-doxaduw2yope/rclone-sync-test/, notFound
    run.go:128: removing dir "rclone-sync-test" failed: removing directory marker failed: googleapi: Error 404: No such object: rclone-test-doxaduw2yope/rclone-sync-test/, notFound
    fstest.go:292: Sleeping for 1s for list eventual consistency: 1/3
    fstest.go:292: Sleeping for 2s for list eventual consistency: 2/3
    fstest.go:292: Sleeping for 4s for list eventual consistency: 3/3
    fstest.go:321: 
        	Error Trace:	/home/rclone/go/src/github.com/rclone/rclone/fstest/fstest.go:321
        	            				/home/rclone/go/src/github.com/rclone/rclone/fstest/fstest.go:332
        	            				/home/rclone/go/src/github.com/rclone/rclone/fstest/run.go:173
        	            				/home/rclone/go/src/github.com/rclone/rclone/fstest/run.go:388
        	            				/home/rclone/go/pkg/mod/golang.org/toolchain@v0.0.1-go1.23.0.linux-amd64/src/testing/testing.go:1176
        	            				/home/rclone/go/pkg/mod/golang.org/toolchain@v0.0.1-go1.23.0.linux-amd64/src/testing/testing.go:1354
        	            				/home/rclone/go/pkg/mod/golang.org/toolchain@v0.0.1-go1.23.0.linux-amd64/src/testing/testing.go:1684
        	Error:      	Not equal: 
        	            	expected: []string{}
        	            	actual  : []string{"rclone-sync-test", "rclone-sync-test-ignore-file", "rclone-sync-test-include", "rclone-sync-test-include/layer2"}
        	            	
        	            	Diff:
        	            	--- Expected
        	            	+++ Actual
        	            	@@ -1,2 +1,6 @@
        	            	-([]string) {
        	            	+([]string) (len=4) {
        	            	+ (string) (len=16) "rclone-sync-test",
        	            	+ (string) (len=28) "rclone-sync-test-ignore-file",
        	            	+ (string) (len=24) "rclone-sync-test-include",
        	            	+ (string) (len=31) "rclone-sync-test-include/layer2"
        	            	 }
        	Test:       	TestSyncOverlapWithFilter
        	Messages:   	directories
2025/03/06 01:54:32 DEBUG : rclone-sync-test-include/layer2/: Removing directory marker
    run.go:125: removing dir "rclone-sync-test-include/layer2" failed - try 1/3: removing directory marker failed: googleapi: Error 404: No such object: rclone-test-doxaduw2yope/rclone-sync-test-include/layer2/, notFound
2025/03/06 01:54:33 DEBUG : rclone-sync-test-include/layer2/: Removing directory marker
    run.go:125: removing dir "rclone-sync-test-include/layer2" failed - try 2/3: removing directory marker failed: googleapi: Error 404: No such object: rclone-test-doxaduw2yope/rclone-sync-test-include/layer2/, notFound
2025/03/06 01:54:34 DEBUG : rclone-sync-test-include/layer2/: Removing directory marker
    run.go:125: removing dir "rclone-sync-test-include/layer2" failed - try 3/3: removing directory marker failed: googleapi: Error 404: No such object: rclone-test-doxaduw2yope/rclone-sync-test-include/layer2/, notFound
    run.go:128: removing dir "rclone-sync-test-include/layer2" failed: removing directory marker failed: googleapi: Error 404: No such object: rclone-test-doxaduw2yope/rclone-sync-test-include/layer2/, notFound
2025/03/06 01:54:35 DEBUG : rclone-sync-test-include/: Removing directory marker
    run.go:125: removing dir "rclone-sync-test-include" failed - try 1/3: removing directory marker failed: googleapi: Error 404: No such object: rclone-test-doxaduw2yope/rclone-sync-test-include/, notFound
2025/03/06 01:54:36 DEBUG : rclone-sync-test-include/: Removing directory marker
    run.go:125: removing dir "rclone-sync-test-include" failed - try 2/3: removing directory marker failed: googleapi: Error 404: No such object: rclone-test-doxaduw2yope/rclone-sync-test-include/, notFound
2025/03/06 01:54:37 DEBUG : rclone-sync-test-include/: Removing directory marker
    run.go:125: removing dir "rclone-sync-test-include" failed - try 3/3: removing directory marker failed: googleapi: Error 404: No such object: rclone-test-doxaduw2yope/rclone-sync-test-include/, notFound
    run.go:128: removing dir "rclone-sync-test-include" failed: removing directory marker failed: googleapi: Error 404: No such object: rclone-test-doxaduw2yope/rclone-sync-test-include/, notFound
2025/03/06 01:54:38 DEBUG : rclone-sync-test-ignore-file/: Removing directory marker
    run.go:125: removing dir "rclone-sync-test-ignore-file" failed - try 1/3: removing directory marker failed: googleapi: Error 404: No such object: rclone-test-doxaduw2yope/rclone-sync-test-ignore-file/, notFound
2025/03/06 01:54:39 DEBUG : rclone-sync-test-ignore-file/: Removing directory marker
    run.go:125: removing dir "rclone-sync-test-ignore-file" failed - try 2/3: removing directory marker failed: googleapi: Error 404: No such object: rclone-test-doxaduw2yope/rclone-sync-test-ignore-file/, notFound
2025/03/06 01:54:40 DEBUG : rclone-sync-test-ignore-file/: Removing directory marker
    run.go:125: removing dir "rclone-sync-test-ignore-file" failed - try 3/3: removing directory marker failed: googleapi: Error 404: No such object: rclone-test-doxaduw2yope/rclone-sync-test-ignore-file/, notFound
    run.go:128: removing dir "rclone-sync-test-ignore-file" failed: removing directory marker failed: googleapi: Error 404: No such object: rclone-test-doxaduw2yope/rclone-sync-test-ignore-file/, notFound
2025/03/06 01:54:42 DEBUG : rclone-sync-test/: Removing directory marker
    run.go:125: removing dir "rclone-sync-test" failed - try 1/3: removing directory marker failed: googleapi: Error 404: No such object: rclone-test-doxaduw2yope/rclone-sync-test/, notFound
2025/03/06 01:54:43 DEBUG : rclone-sync-test/: Removing directory marker
    run.go:125: removing dir "rclone-sync-test" failed - try 2/3: removing directory marker failed: googleapi: Error 404: No such object: rclone-test-doxaduw2yope/rclone-sync-test/, notFound
2025/03/06 01:54:44 DEBUG : rclone-sync-test/: Removing directory marker
    run.go:125: removing dir "rclone-sync-test" failed - try 3/3: removing directory marker failed: googleapi: Error 404: No such object: rclone-test-doxaduw2yope/rclone-sync-test/, notFound
    run.go:128: removing dir "rclone-sync-test" failed: removing directory marker failed: googleapi: Error 404: No such object: rclone-test-doxaduw2yope/rclone-sync-test/, notFound
    fstest.go:292: Sleeping for 1s for list eventual consistency: 1/3
    fstest.go:292: Sleeping for 2s for list eventual consistency: 2/3
    fstest.go:292: Sleeping for 4s for list eventual consistency: 3/3
    fstest.go:321: 
        	Error Trace:	/home/rclone/go/src/github.com/rclone/rclone/fstest/fstest.go:321
        	            				/home/rclone/go/src/github.com/rclone/rclone/fstest/fstest.go:332
        	            				/home/rclone/go/src/github.com/rclone/rclone/fstest/run.go:173
        	            				/home/rclone/go/src/github.com/rclone/rclone/fstest/run.go:388
        	            				/home/rclone/go/pkg/mod/golang.org/toolchain@v0.0.1-go1.23.0.linux-amd64/src/testing/testing.go:1176
        	            				/home/rclone/go/pkg/mod/golang.org/toolchain@v0.0.1-go1.23.0.linux-amd64/src/testing/testing.go:1354
        	            				/home/rclone/go/pkg/mod/golang.org/toolchain@v0.0.1-go1.23.0.linux-amd64/src/testing/testing.go:1684
        	Error:      	Not equal: 
        	            	expected: []string{}
        	            	actual  : []string{"rclone-sync-test", "rclone-sync-test-ignore-file", "rclone-sync-test-include", "rclone-sync-test-include/layer2"}
        	            	
        	            	Diff:
        	            	--- Expected
        	            	+++ Actual
        	            	@@ -1,2 +1,6 @@
        	            	-([]string) {
        	            	+([]string) (len=4) {
        	            	+ (string) (len=16) "rclone-sync-test",
        	            	+ (string) (len=28) "rclone-sync-test-ignore-file",
        	            	+ (string) (len=24) "rclone-sync-test-include",
        	            	+ (string) (len=31) "rclone-sync-test-include/layer2"
        	            	 }
        	Test:       	TestSyncOverlapWithFilter
        	Messages:   	directories
2025/03/06 01:54:52 DEBUG : rclone-sync-test-include/layer2/: Removing directory marker
    run.go:125: removing dir "rclone-sync-test-include/layer2" failed - try 1/3: removing directory marker failed: googleapi: Error 404: No such object: rclone-test-doxaduw2yope/rclone-sync-test-include/layer2/, notFound
2025/03/06 01:54:53 DEBUG : rclone-sync-test-include/layer2/: Removing directory marker
    run.go:125: removing dir "rclone-sync-test-include/layer2" failed - try 2/3: removing directory marker failed: googleapi: Error 404: No such object: rclone-test-doxaduw2yope/rclone-sync-test-include/layer2/, notFound
2025/03/06 01:54:54 DEBUG : rclone-sync-test-include/layer2/: Removing directory marker
    run.go:125: removing dir "rclone-sync-test-include/layer2" failed - try 3/3: removing directory marker failed: googleapi: Error 404: No such object: rclone-test-doxaduw2yope/rclone-sync-test-include/layer2/, notFound
    run.go:128: removing dir "rclone-sync-test-include/layer2" failed: removing directory marker failed: googleapi: Error 404: No such object: rclone-test-doxaduw2yope/rclone-sync-test-include/layer2/, notFound
2025/03/06 01:54:55 DEBUG : rclone-sync-test-include/: Removing directory marker
    run.go:125: removing dir "rclone-sync-test-include" failed - try 1/3: removing directory marker failed: googleapi: Error 404: No such object: rclone-test-doxaduw2yope/rclone-sync-test-include/, notFound
2025/03/06 01:54:56 DEBUG : rclone-sync-test-include/: Removing directory marker
    run.go:125: removing dir "rclone-sync-test-include" failed - try 2/3: removing directory marker failed: googleapi: Error 404: No such object: rclone-test-doxaduw2yope/rclone-sync-test-include/, notFound
2025/03/06 01:54:57 DEBUG : rclone-sync-test-include/: Removing directory marker
    run.go:125: removing dir "rclone-sync-test-include" failed - try 3/3: removing directory marker failed: googleapi: Error 404: No such object: rclone-test-doxaduw2yope/rclone-sync-test-include/, notFound
    run.go:128: removing dir "rclone-sync-test-include" failed: removing directory marker failed: googleapi: Error 404: No such object: rclone-test-doxaduw2yope/rclone-sync-test-include/, notFound
2025/03/06 01:54:58 DEBUG : rclone-sync-test-ignore-file/: Removing directory marker
    run.go:125: removing dir "rclone-sync-test-ignore-file" failed - try 1/3: removing directory marker failed: googleapi: Error 404: No such object: rclone-test-doxaduw2yope/rclone-sync-test-ignore-file/, notFound
2025/03/06 01:54:59 DEBUG : rclone-sync-test-ignore-file/: Removing directory marker
    run.go:125: removing dir "rclone-sync-test-ignore-file" failed - try 2/3: removing directory marker failed: googleapi: Error 404: No such object: rclone-test-doxaduw2yope/rclone-sync-test-ignore-file/, notFound
2025/03/06 01:55:00 DEBUG : rclone-sync-test-ignore-file/: Removing directory marker
    run.go:125: removing dir "rclone-sync-test-ignore-file" failed - try 3/3: removing directory marker failed: googleapi: Error 404: No such object: rclone-test-doxaduw2yope/rclone-sync-test-ignore-file/, notFound
    run.go:128: removing dir "rclone-sync-test-ignore-file" failed: removing directory marker failed: googleapi: Error 404: No such object: rclone-test-doxaduw2yope/rclone-sync-test-ignore-file/, notFound
2025/03/06 01:55:01 DEBUG : rclone-sync-test/: Removing directory marker
    run.go:125: removing dir "rclone-sync-test" failed - try 1/3: removing directory marker failed: googleapi: Error 404: No such object: rclone-test-doxaduw2yope/rclone-sync-test/, notFound
2025/03/06 01:55:02 DEBUG : rclone-sync-test/: Removing directory marker
    run.go:125: removing dir "rclone-sync-test" failed - try 2/3: removing directory marker failed: googleapi: Error 404: No such object: rclone-test-doxaduw2yope/rclone-sync-test/, notFound
2025/03/06 01:55:04 DEBUG : rclone-sync-test/: Removing directory marker
    run.go:125: removing dir "rclone-sync-test" failed - try 3/3: removing directory marker failed: googleapi: Error 404: No such object: rclone-test-doxaduw2yope/rclone-sync-test/, notFound
    run.go:128: removing dir "rclone-sync-test" failed: removing directory marker failed: googleapi: Error 404: No such object: rclone-test-doxaduw2yope/rclone-sync-test/, notFound
    fstest.go:292: Sleeping for 1s for list eventual consistency: 1/3
    fstest.go:292: Sleeping for 2s for list eventual consistency: 2/3
    fstest.go:292: Sleeping for 4s for list eventual consistency: 3/3
    fstest.go:321: 
        	Error Trace:	/home/rclone/go/src/github.com/rclone/rclone/fstest/fstest.go:321
        	            				/home/rclone/go/src/github.com/rclone/rclone/fstest/fstest.go:332
        	            				/home/rclone/go/src/github.com/rclone/rclone/fstest/run.go:173
        	            				/home/rclone/go/src/github.com/rclone/rclone/fstest/run.go:388
        	            				/home/rclone/go/pkg/mod/golang.org/toolchain@v0.0.1-go1.23.0.linux-amd64/src/testing/testing.go:1176
        	            				/home/rclone/go/pkg/mod/golang.org/toolchain@v0.0.1-go1.23.0.linux-amd64/src/testing/testing.go:1354
        	            				/home/rclone/go/pkg/mod/golang.org/toolchain@v0.0.1-go1.23.0.linux-amd64/src/testing/testing.go:1684
        	Error:      	Not equal: 
        	            	expected: []string{}
        	            	actual  : []string{"rclone-sync-test", "rclone-sync-test-ignore-file", "rclone-sync-test-include", "rclone-sync-test-include/layer2"}
        	            	
        	            	Diff:
        	            	--- Expected
        	            	+++ Actual
        	            	@@ -1,2 +1,6 @@
        	            	-([]string) {
        	            	+([]string) (len=4) {
        	            	+ (string) (len=16) "rclone-sync-test",
        	            	+ (string) (len=28) "rclone-sync-test-ignore-file",
        	            	+ (string) (len=24) "rclone-sync-test-include",
        	            	+ (string) (len=31) "rclone-sync-test-include/layer2"
        	            	 }
        	Test:       	TestSyncOverlapWithFilter
        	Messages:   	directories
2025/03/06 01:55:12 DEBUG : rclone-sync-test-include/layer2/: Removing directory marker
    run.go:125: removing dir "rclone-sync-test-include/layer2" failed - try 1/3: removing directory marker failed: googleapi: Error 404: No such object: rclone-test-doxaduw2yope/rclone-sync-test-include/layer2/, notFound
2025/03/06 01:55:13 DEBUG : rclone-sync-test-include/layer2/: Removing directory marker
    run.go:125: removing dir "rclone-sync-test-include/layer2" failed - try 2/3: removing directory marker failed: googleapi: Error 404: No such object: rclone-test-doxaduw2yope/rclone-sync-test-include/layer2/, notFound
2025/03/06 01:55:14 DEBUG : rclone-sync-test-include/layer2/: Removing directory marker
    run.go:125: removing dir "rclone-sync-test-include/layer2" failed - try 3/3: removing directory marker failed: googleapi: Error 404: No such object: rclone-test-doxaduw2yope/rclone-sync-test-include/layer2/, notFound
    run.go:128: removing dir "rclone-sync-test-include/layer2" failed: removing directory marker failed: googleapi: Error 404: No such object: rclone-test-doxaduw2yope/rclone-sync-test-include/layer2/, notFound
2025/03/06 01:55:15 DEBUG : rclone-sync-test-include/: Removing directory marker
    run.go:125: removing dir "rclone-sync-test-include" failed - try 1/3: removing directory marker failed: googleapi: Error 404: No such object: rclone-test-doxaduw2yope/rclone-sync-test-include/, notFound
2025/03/06 01:55:16 DEBUG : rclone-sync-test-include/: Removing directory marker
    run.go:125: removing dir "rclone-sync-test-include" failed - try 2/3: removing directory marker failed: googleapi: Error 404: No such object: rclone-test-doxaduw2yope/rclone-sync-test-include/, notFound
2025/03/06 01:55:17 DEBUG : rclone-sync-test-include/: Removing directory marker
    run.go:125: removing dir "rclone-sync-test-include" failed - try 3/3: removing directory marker failed: googleapi: Error 404: No such object: rclone-test-doxaduw2yope/rclone-sync-test-include/, notFound
    run.go:128: removing dir "rclone-sync-test-include" failed: removing directory marker failed: googleapi: Error 404: No such object: rclone-test-doxaduw2yope/rclone-sync-test-include/, notFound
2025/03/06 01:55:18 DEBUG : rclone-sync-test-ignore-file/: Removing directory marker
    run.go:125: removing dir "rclone-sync-test-ignore-file" failed - try 1/3: removing directory marker failed: googleapi: Error 404: No such object: rclone-test-doxaduw2yope/rclone-sync-test-ignore-file/, notFound
2025/03/06 01:55:19 DEBUG : rclone-sync-test-ignore-file/: Removing directory marker
    run.go:125: removing dir "rclone-sync-test-ignore-file" failed - try 2/3: removing directory marker failed: googleapi: Error 404: No such object: rclone-test-doxaduw2yope/rclone-sync-test-ignore-file/, notFound
2025/03/06 01:55:20 DEBUG : rclone-sync-test-ignore-file/: Removing directory marker
    run.go:125: removing dir "rclone-sync-test-ignore-file" failed - try 3/3: removing directory marker failed: googleapi: Error 404: No such object: rclone-test-doxaduw2yope/rclone-sync-test-ignore-file/, notFound
    run.go:128: removing dir "rclone-sync-test-ignore-file" failed: removing directory marker failed: googleapi: Error 404: No such object: rclone-test-doxaduw2yope/rclone-sync-test-ignore-file/, notFound
2025/03/06 01:55:21 DEBUG : rclone-sync-test/: Removing directory marker
    run.go:125: removing dir "rclone-sync-test" failed - try 1/3: removing directory marker failed: googleapi: Error 404: No such object: rclone-test-doxaduw2yope/rclone-sync-test/, notFound
2025/03/06 01:55:22 DEBUG : rclone-sync-test/: Removing directory marker
    run.go:125: removing dir "rclone-sync-test" failed - try 2/3: removing directory marker failed: googleapi: Error 404: No such object: rclone-test-doxaduw2yope/rclone-sync-test/, notFound
2025/03/06 01:55:23 DEBUG : rclone-sync-test/: Removing directory marker
    run.go:125: removing dir "rclone-sync-test" failed - try 3/3: removing directory marker failed: googleapi: Error 404: No such object: rclone-test-doxaduw2yope/rclone-sync-test/, notFound
    run.go:128: removing dir "rclone-sync-test" failed: removing directory marker failed: googleapi: Error 404: No such object: rclone-test-doxaduw2yope/rclone-sync-test/, notFound
    fstest.go:292: Sleeping for 1s for list eventual consistency: 1/3
    fstest.go:292: Sleeping for 2s for list eventual consistency: 2/3
    fstest.go:292: Sleeping for 4s for list eventual consistency: 3/3
    fstest.go:321: 
        	Error Trace:	/home/rclone/go/src/github.com/rclone/rclone/fstest/fstest.go:321
        	            				/home/rclone/go/src/github.com/rclone/rclone/fstest/fstest.go:332
        	            				/home/rclone/go/src/github.com/rclone/rclone/fstest/run.go:173
        	            				/home/rclone/go/src/github.com/rclone/rclone/fstest/run.go:388
        	            				/home/rclone/go/pkg/mod/golang.org/toolchain@v0.0.1-go1.23.0.linux-amd64/src/testing/testing.go:1176
        	            				/home/rclone/go/pkg/mod/golang.org/toolchain@v0.0.1-go1.23.0.linux-amd64/src/testing/testing.go:1354
        	            				/home/rclone/go/pkg/mod/golang.org/toolchain@v0.0.1-go1.23.0.linux-amd64/src/testing/testing.go:1684
        	Error:      	Not equal: 
        	            	expected: []string{}
        	            	actual  : []string{"rclone-sync-test", "rclone-sync-test-ignore-file", "rclone-sync-test-include", "rclone-sync-test-include/layer2"}
        	            	
        	            	Diff:
        	            	--- Expected
        	            	+++ Actual
        	            	@@ -1,2 +1,6 @@
        	            	-([]string) {
        	            	+([]string) (len=4) {
        	            	+ (string) (len=16) "rclone-sync-test",
        	            	+ (string) (len=28) "rclone-sync-test-ignore-file",
        	            	+ (string) (len=24) "rclone-sync-test-include",
        	            	+ (string) (len=31) "rclone-sync-test-include/layer2"
        	            	 }
        	Test:       	TestSyncOverlapWithFilter
        	Messages:   	directories
2025/03/06 01:55:32 DEBUG : rclone-sync-test-include/layer2/: Removing directory marker
    run.go:125: removing dir "rclone-sync-test-include/layer2" failed - try 1/3: removing directory marker failed: googleapi: Error 404: No such object: rclone-test-doxaduw2yope/rclone-sync-test-include/layer2/, notFound
2025/03/06 01:55:33 DEBUG : rclone-sync-test-include/layer2/: Removing directory marker
    run.go:125: removing dir "rclone-sync-test-include/layer2" failed - try 2/3: removing directory marker failed: googleapi: Error 404: No such object: rclone-test-doxaduw2yope/rclone-sync-test-include/layer2/, notFound
2025/03/06 01:55:34 DEBUG : rclone-sync-test-include/layer2/: Removing directory marker
    run.go:125: removing dir "rclone-sync-test-include/layer2" failed - try 3/3: removing directory marker failed: googleapi: Error 404: No such object: rclone-test-doxaduw2yope/rclone-sync-test-include/layer2/, notFound
    run.go:128: removing dir "rclone-sync-test-include/layer2" failed: removing directory marker failed: googleapi: Error 404: No such object: rclone-test-doxaduw2yope/rclone-sync-test-include/layer2/, notFound
2025/03/06 01:55:35 DEBUG : rclone-sync-test-include/: Removing directory marker
    run.go:125: removing dir "rclone-sync-test-include" failed - try 1/3: removing directory marker failed: googleapi: Error 404: No such object: rclone-test-doxaduw2yope/rclone-sync-test-include/, notFound
2025/03/06 01:55:36 DEBUG : rclone-sync-test-include/: Removing directory marker
    run.go:125: removing dir "rclone-sync-test-include" failed - try 2/3: removing directory marker failed: googleapi: Error 404: No such object: rclone-test-doxaduw2yope/rclone-sync-test-include/, notFound
2025/03/06 01:55:37 DEBUG : rclone-sync-test-include/: Removing directory marker
    run.go:125: removing dir "rclone-sync-test-include" failed - try 3/3: removing directory marker failed: googleapi: Error 404: No such object: rclone-test-doxaduw2yope/rclone-sync-test-include/, notFound
    run.go:128: removing dir "rclone-sync-test-include" failed: removing directory marker failed: googleapi: Error 404: No such object: rclone-test-doxaduw2yope/rclone-sync-test-include/, notFound
2025/03/06 01:55:38 DEBUG : rclone-sync-test-ignore-file/: Removing directory marker
    run.go:125: removing dir "rclone-sync-test-ignore-file" failed - try 1/3: removing directory marker failed: googleapi: Error 404: No such object: rclone-test-doxaduw2yope/rclone-sync-test-ignore-file/, notFound
2025/03/06 01:55:39 DEBUG : rclone-sync-test-ignore-file/: Removing directory marker
    run.go:125: removing dir "rclone-sync-test-ignore-file" failed - try 2/3: removing directory marker failed: googleapi: Error 404: No such object: rclone-test-doxaduw2yope/rclone-sync-test-ignore-file/, notFound
2025/03/06 01:55:40 DEBUG : rclone-sync-test-ignore-file/: Removing directory marker
    run.go:125: removing dir "rclone-sync-test-ignore-file" failed - try 3/3: removing directory marker failed: googleapi: Error 404: No such object: rclone-test-doxaduw2yope/rclone-sync-test-ignore-file/, notFound
    run.go:128: removing dir "rclone-sync-test-ignore-file" failed: removing directory marker failed: googleapi: Error 404: No such object: rclone-test-doxaduw2yope/rclone-sync-test-ignore-file/, notFound
2025/03/06 01:55:41 DEBUG : rclone-sync-test/: Removing directory marker
    run.go:125: removing dir "rclone-sync-test" failed - try 1/3: removing directory marker failed: googleapi: Error 404: No such object: rclone-test-doxaduw2yope/rclone-sync-test/, notFound
2025/03/06 01:55:42 DEBUG : rclone-sync-test/: Removing directory marker
    run.go:125: removing dir "rclone-sync-test" failed - try 2/3: removing directory marker failed: googleapi: Error 404: No such object: rclone-test-doxaduw2yope/rclone-sync-test/, notFound
2025/03/06 01:55:43 DEBUG : rclone-sync-test/: Removing directory marker
    run.go:125: removing dir "rclone-sync-test" failed - try 3/3: removing directory marker failed: googleapi: Error 404: No such object: rclone-test-doxaduw2yope/rclone-sync-test/, notFound
    run.go:128: removing dir "rclone-sync-test" failed: removing directory marker failed: googleapi: Error 404: No such object: rclone-test-doxaduw2yope/rclone-sync-test/, notFound
    fstest.go:292: Sleeping for 1s for list eventual consistency: 1/3
    fstest.go:292: Sleeping for 2s for list eventual consistency: 2/3
    fstest.go:292: Sleeping for 4s for list eventual consistency: 3/3
    fstest.go:321: 
        	Error Trace:	/home/rclone/go/src/github.com/rclone/rclone/fstest/fstest.go:321
        	            				/home/rclone/go/src/github.com/rclone/rclone/fstest/fstest.go:332
        	            				/home/rclone/go/src/github.com/rclone/rclone/fstest/run.go:173
        	            				/home/rclone/go/src/github.com/rclone/rclone/fstest/run.go:388
        	            				/home/rclone/go/pkg/mod/golang.org/toolchain@v0.0.1-go1.23.0.linux-amd64/src/testing/testing.go:1176
        	            				/home/rclone/go/pkg/mod/golang.org/toolchain@v0.0.1-go1.23.0.linux-amd64/src/testing/testing.go:1354
        	            				/home/rclone/go/pkg/mod/golang.org/toolchain@v0.0.1-go1.23.0.linux-amd64/src/testing/testing.go:1684
        	Error:      	Not equal: 
        	            	expected: []string{}
        	            	actual  : []string{"rclone-sync-test", "rclone-sync-test-ignore-file", "rclone-sync-test-include", "rclone-sync-test-include/layer2"}
        	            	
        	            	Diff:
        	            	--- Expected
        	            	+++ Actual
        	            	@@ -1,2 +1,6 @@
        	            	-([]string) {
        	            	+([]string) (len=4) {
        	            	+ (string) (len=16) "rclone-sync-test",
        	            	+ (string) (len=28) "rclone-sync-test-ignore-file",
        	            	+ (string) (len=24) "rclone-sync-test-include",
        	            	+ (string) (len=31) "rclone-sync-test-include/layer2"
        	            	 }
        	Test:       	TestSyncOverlapWithFilter
        	Messages:   	directories
--- FAIL: TestSyncOverlapWithFilter (395.70s)
=== RUN   TestSyncCompareDest
    run.go:180: Remote "GCS bucket rclone-test-doxaduw2yope", Local "Local file system at /tmp/rclone3002156174", Modify Window "1ns"
2025/03/06 01:55:51 DEBUG : Creating backend with remote "TestGoogleCloudStorage,directory_markers:rclone-test-doxaduw2yope/dst"
2025/03/06 01:55:51 DEBUG : Config file has changed externally - reloading
2025/03/06 01:55:51 DEBUG : TestGoogleCloudStorage: detected overridden config - adding "{juk_h}" suffix to name
2025/03/06 01:55:52 DEBUG : Creating backend with remote "TestGoogleCloudStorage,directory_markers:rclone-test-doxaduw2yope/CompareDest"
2025/03/06 01:55:52 DEBUG : TestGoogleCloudStorage: detected overridden config - adding "{juk_h}" suffix to name
2025/03/06 01:55:53 DEBUG : fs cache: renaming cache item "TestGoogleCloudStorage,directory_markers:rclone-test-doxaduw2yope/CompareDest" to be canonical "TestGoogleCloudStorage{juk_h}:rclone-test-doxaduw2yope/CompareDest"
2025/03/06 01:55:53 DEBUG : one: Need to transfer - File not found at Destination
2025/03/06 01:55:53 DEBUG : GCS bucket rclone-test-doxaduw2yope path dst: Waiting for checks to finish
2025/03/06 01:55:53 DEBUG : GCS bucket rclone-test-doxaduw2yope path dst: Waiting for transfers to finish
2025/03/06 01:55:54 DEBUG : /: Creating directory marker
2025/03/06 01:55:54 DEBUG : one: md5 = f97c5d29941bfb1b2fdab0874906ab82 OK
2025/03/06 01:55:54 INFO  : one: Copied (new)
2025/03/06 01:55:54 DEBUG : Waiting for deletions to finish
2025/03/06 01:55:54 DEBUG : fs cache: switching user supplied name "TestGoogleCloudStorage,directory_markers:rclone-test-doxaduw2yope/CompareDest" for canonical name "TestGoogleCloudStorage{juk_h}:rclone-test-doxaduw2yope/CompareDest"
2025/03/06 01:55:54 ERROR : : Entry doesn't belong in directory "" (same as directory) - ignoring
2025/03/06 01:55:54 DEBUG : one: Sizes differ (src 5 vs dst 3)
2025/03/06 01:55:54 DEBUG : GCS bucket rclone-test-doxaduw2yope path dst: Waiting for checks to finish
2025/03/06 01:55:55 DEBUG : GCS bucket rclone-test-doxaduw2yope path dst: Waiting for transfers to finish
2025/03/06 01:55:55 DEBUG : one: md5 = 07912d142f5d63ee918b34796b5a2432 OK
2025/03/06 01:55:55 INFO  : one: Copied (replaced existing)
2025/03/06 01:55:55 DEBUG : Waiting for deletions to finish
2025/03/06 01:55:55 DEBUG : dst/: Creating directory marker
2025/03/06 01:55:56 DEBUG : CompareDest/: Creating directory marker
2025/03/06 01:55:56 DEBUG : fs cache: switching user supplied name "TestGoogleCloudStorage,directory_markers:rclone-test-doxaduw2yope/CompareDest" for canonical name "TestGoogleCloudStorage{juk_h}:rclone-test-doxaduw2yope/CompareDest"
2025/03/06 01:55:56 ERROR : : Entry doesn't belong in directory "" (same as directory) - ignoring
2025/03/06 01:55:56 DEBUG : one: Sizes differ (src 5 vs dst 3)
2025/03/06 01:55:56 DEBUG : GCS bucket rclone-test-doxaduw2yope path dst: Waiting for checks to finish
2025/03/06 01:55:56 DEBUG : one: Size and modification time the same (differ by 0s, within tolerance 1ns)
2025/03/06 01:55:56 DEBUG : one: Destination found in --compare-dest, skipping
2025/03/06 01:55:56 DEBUG : GCS bucket rclone-test-doxaduw2yope path dst: Waiting for transfers to finish
2025/03/06 01:55:56 DEBUG : Waiting for deletions to finish
2025/03/06 01:55:56 INFO  : There was nothing to transfer
2025/03/06 01:55:57 DEBUG : fs cache: switching user supplied name "TestGoogleCloudStorage,directory_markers:rclone-test-doxaduw2yope/CompareDest" for canonical name "TestGoogleCloudStorage{juk_h}:rclone-test-doxaduw2yope/CompareDest"
2025/03/06 01:55:57 ERROR : : Entry doesn't belong in directory "" (same as directory) - ignoring
2025/03/06 01:55:57 DEBUG : two: Size and modification time the same (differ by 0s, within tolerance 1ns)
2025/03/06 01:55:57 DEBUG : two: Destination found in --compare-dest, skipping
2025/03/06 01:55:57 DEBUG : one: Sizes differ (src 5 vs dst 3)
2025/03/06 01:55:57 DEBUG : GCS bucket rclone-test-doxaduw2yope path dst: Waiting for checks to finish
2025/03/06 01:55:57 DEBUG : one: Size and modification time the same (differ by 0s, within tolerance 1ns)
2025/03/06 01:55:57 DEBUG : one: Destination found in --compare-dest, skipping
2025/03/06 01:55:57 DEBUG : GCS bucket rclone-test-doxaduw2yope path dst: Waiting for transfers to finish
2025/03/06 01:55:57 DEBUG : Waiting for deletions to finish
2025/03/06 01:55:57 INFO  : There was nothing to transfer
2025/03/06 01:55:57 DEBUG : fs cache: switching user supplied name "TestGoogleCloudStorage,directory_markers:rclone-test-doxaduw2yope/CompareDest" for canonical name "TestGoogleCloudStorage{juk_h}:rclone-test-doxaduw2yope/CompareDest"
2025/03/06 01:55:57 ERROR : : Entry doesn't belong in directory "" (same as directory) - ignoring
2025/03/06 01:55:57 DEBUG : two: Size and modification time the same (differ by 0s, within tolerance 1ns)
2025/03/06 01:55:57 DEBUG : two: Destination found in --compare-dest, skipping
2025/03/06 01:55:57 DEBUG : one: Sizes differ (src 5 vs dst 3)
2025/03/06 01:55:57 DEBUG : GCS bucket rclone-test-doxaduw2yope path dst: Waiting for checks to finish
2025/03/06 01:55:58 DEBUG : one: Size and modification time the same (differ by 0s, within tolerance 1ns)
2025/03/06 01:55:58 DEBUG : one: Destination found in --compare-dest, skipping
2025/03/06 01:55:58 DEBUG : GCS bucket rclone-test-doxaduw2yope path dst: Waiting for transfers to finish
2025/03/06 01:55:58 DEBUG : Waiting for deletions to finish
2025/03/06 01:55:58 INFO  : There was nothing to transfer
2025/03/06 01:55:58 DEBUG : fs cache: switching user supplied name "TestGoogleCloudStorage,directory_markers:rclone-test-doxaduw2yope/CompareDest" for canonical name "TestGoogleCloudStorage{juk_h}:rclone-test-doxaduw2yope/CompareDest"
2025/03/06 01:55:58 ERROR : : Entry doesn't belong in directory "" (same as directory) - ignoring
2025/03/06 01:55:58 DEBUG : two: Modification times differ by -119h59m59.876543211s: 2011-12-30 12:59:59 +0000 UTC, 2011-12-25 12:59:59.123456789 +0000 UTC
2025/03/06 01:55:58 DEBUG : two: md5 = b8a9f715dbb64fd5c56e7783c6820a61 OK
2025/03/06 01:55:58 DEBUG : two: Destination found in --compare-dest, skipping
2025/03/06 01:55:58 DEBUG : one: Sizes differ (src 5 vs dst 3)
2025/03/06 01:55:58 DEBUG : GCS bucket rclone-test-doxaduw2yope path dst: Waiting for checks to finish
2025/03/06 01:55:58 DEBUG : one: Size and modification time the same (differ by 0s, within tolerance 1ns)
2025/03/06 01:55:58 DEBUG : one: Destination found in --compare-dest, skipping
2025/03/06 01:55:58 DEBUG : GCS bucket rclone-test-doxaduw2yope path dst: Waiting for transfers to finish
2025/03/06 01:55:58 DEBUG : Waiting for deletions to finish
2025/03/06 01:55:58 INFO  : There was nothing to transfer
2025/03/06 01:55:58 DEBUG : fs cache: switching user supplied name "TestGoogleCloudStorage,directory_markers:rclone-test-doxaduw2yope/CompareDest" for canonical name "TestGoogleCloudStorage{juk_h}:rclone-test-doxaduw2yope/CompareDest"
2025/03/06 01:55:58 ERROR : : Entry doesn't belong in directory "" (same as directory) - ignoring
2025/03/06 01:55:59 DEBUG : two: Sizes differ (src 5 vs dst 3)
2025/03/06 01:55:59 DEBUG : two: Need to transfer - File not found at Destination
2025/03/06 01:55:59 DEBUG : one: Sizes differ (src 5 vs dst 3)
2025/03/06 01:55:59 DEBUG : GCS bucket rclone-test-doxaduw2yope path dst: Waiting for checks to finish
2025/03/06 01:55:59 DEBUG : one: Size and modification time the same (differ by 0s, within tolerance 1ns)
2025/03/06 01:55:59 DEBUG : one: Destination found in --compare-dest, skipping
2025/03/06 01:55:59 DEBUG : GCS bucket rclone-test-doxaduw2yope path dst: Waiting for transfers to finish
2025/03/06 01:55:59 DEBUG : two: md5 = 2379e4ce8c3380e996ab0509f17069ad OK
2025/03/06 01:55:59 INFO  : two: Copied (new)
2025/03/06 01:55:59 DEBUG : Waiting for deletions to finish
2025/03/06 01:55:59 DEBUG : rclone-sync-test-include/layer2/: Removing directory marker
    run.go:125: removing dir "rclone-sync-test-include/layer2" failed - try 1/3: removing directory marker failed: googleapi: Error 404: No such object: rclone-test-doxaduw2yope/rclone-sync-test-include/layer2/, notFound
2025/03/06 01:56:00 DEBUG : rclone-sync-test-include/layer2/: Removing directory marker
    run.go:125: removing dir "rclone-sync-test-include/layer2" failed - try 2/3: removing directory marker failed: googleapi: Error 404: No such object: rclone-test-doxaduw2yope/rclone-sync-test-include/layer2/, notFound
2025/03/06 01:56:02 DEBUG : rclone-sync-test-include/layer2/: Removing directory marker
    run.go:125: removing dir "rclone-sync-test-include/layer2" failed - try 3/3: removing directory marker failed: googleapi: Error 404: No such object: rclone-test-doxaduw2yope/rclone-sync-test-include/layer2/, notFound
    run.go:128: removing dir "rclone-sync-test-include/layer2" failed: removing directory marker failed: googleapi: Error 404: No such object: rclone-test-doxaduw2yope/rclone-sync-test-include/layer2/, notFound
2025/03/06 01:56:03 DEBUG : rclone-sync-test-include/: Removing directory marker
    run.go:125: removing dir "rclone-sync-test-include" failed - try 1/3: removing directory marker failed: googleapi: Error 404: No such object: rclone-test-doxaduw2yope/rclone-sync-test-include/, notFound
2025/03/06 01:56:04 DEBUG : rclone-sync-test-include/: Removing directory marker
    run.go:125: removing dir "rclone-sync-test-include" failed - try 2/3: removing directory marker failed: googleapi: Error 404: No such object: rclone-test-doxaduw2yope/rclone-sync-test-include/, notFound
2025/03/06 01:56:05 DEBUG : rclone-sync-test-include/: Removing directory marker
    run.go:125: removing dir "rclone-sync-test-include" failed - try 3/3: removing directory marker failed: googleapi: Error 404: No such object: rclone-test-doxaduw2yope/rclone-sync-test-include/, notFound
    run.go:128: removing dir "rclone-sync-test-include" failed: removing directory marker failed: googleapi: Error 404: No such object: rclone-test-doxaduw2yope/rclone-sync-test-include/, notFound
2025/03/06 01:56:06 DEBUG : rclone-sync-test-ignore-file/: Removing directory marker
    run.go:125: removing dir "rclone-sync-test-ignore-file" failed - try 1/3: removing directory marker failed: googleapi: Error 404: No such object: rclone-test-doxaduw2yope/rclone-sync-test-ignore-file/, notFound
2025/03/06 01:56:07 DEBUG : rclone-sync-test-ignore-file/: Removing directory marker
    run.go:125: removing dir "rclone-sync-test-ignore-file" failed - try 2/3: removing directory marker failed: googleapi: Error 404: No such object: rclone-test-doxaduw2yope/rclone-sync-test-ignore-file/, notFound
2025/03/06 01:56:08 DEBUG : rclone-sync-test-ignore-file/: Removing directory marker
    run.go:125: removing dir "rclone-sync-test-ignore-file" failed - try 3/3: removing directory marker failed: googleapi: Error 404: No such object: rclone-test-doxaduw2yope/rclone-sync-test-ignore-file/, notFound
    run.go:128: removing dir "rclone-sync-test-ignore-file" failed: removing directory marker failed: googleapi: Error 404: No such object: rclone-test-doxaduw2yope/rclone-sync-test-ignore-file/, notFound
2025/03/06 01:56:09 DEBUG : rclone-sync-test/: Removing directory marker
    run.go:125: removing dir "rclone-sync-test" failed - try 1/3: removing directory marker failed: googleapi: Error 404: No such object: rclone-test-doxaduw2yope/rclone-sync-test/, notFound
2025/03/06 01:56:10 DEBUG : rclone-sync-test/: Removing directory marker
    run.go:125: removing dir "rclone-sync-test" failed - try 2/3: removing directory marker failed: googleapi: Error 404: No such object: rclone-test-doxaduw2yope/rclone-sync-test/, notFound
2025/03/06 01:56:11 DEBUG : rclone-sync-test/: Removing directory marker
    run.go:125: removing dir "rclone-sync-test" failed - try 3/3: removing directory marker failed: googleapi: Error 404: No such object: rclone-test-doxaduw2yope/rclone-sync-test/, notFound
    run.go:128: removing dir "rclone-sync-test" failed: removing directory marker failed: googleapi: Error 404: No such object: rclone-test-doxaduw2yope/rclone-sync-test/, notFound
2025/03/06 01:56:12 DEBUG : dst/: Removing directory marker
2025/03/06 01:56:12 DEBUG : dst/: Removing directory marker
    run.go:125: removing dir "dst" failed - try 1/3: removing directory marker failed: googleapi: Error 404: No such object: rclone-test-doxaduw2yope/dst/, notFound
2025/03/06 01:56:13 DEBUG : dst/: Removing directory marker
    run.go:125: removing dir "dst" failed - try 2/3: removing directory marker failed: googleapi: Error 404: No such object: rclone-test-doxaduw2yope/dst/, notFound
2025/03/06 01:56:14 DEBUG : dst/: Removing directory marker
    run.go:125: removing dir "dst" failed - try 3/3: removing directory marker failed: googleapi: Error 404: No such object: rclone-test-doxaduw2yope/dst/, notFound
    run.go:128: removing dir "dst" failed: removing directory marker failed: googleapi: Error 404: No such object: rclone-test-doxaduw2yope/dst/, notFound
2025/03/06 01:56:15 DEBUG : CompareDest/: Removing directory marker
    fstest.go:292: Sleeping for 1s for list eventual consistency: 1/3
    fstest.go:292: Sleeping for 2s for list eventual consistency: 2/3
    fstest.go:292: Sleeping for 4s for list eventual consistency: 3/3
    fstest.go:321: 
        	Error Trace:	/home/rclone/go/src/github.com/rclone/rclone/fstest/fstest.go:321
        	            				/home/rclone/go/src/github.com/rclone/rclone/fstest/fstest.go:332
        	            				/home/rclone/go/src/github.com/rclone/rclone/fstest/run.go:173
        	            				/home/rclone/go/src/github.com/rclone/rclone/fstest/run.go:388
        	            				/home/rclone/go/pkg/mod/golang.org/toolchain@v0.0.1-go1.23.0.linux-amd64/src/testing/testing.go:1176
        	            				/home/rclone/go/pkg/mod/golang.org/toolchain@v0.0.1-go1.23.0.linux-amd64/src/testing/testing.go:1354
        	            				/home/rclone/go/pkg/mod/golang.org/toolchain@v0.0.1-go1.23.0.linux-amd64/src/testing/testing.go:1684
        	Error:      	Not equal: 
        	            	expected: []string{}
        	            	actual  : []string{"dst", "rclone-sync-test", "rclone-sync-test-ignore-file", "rclone-sync-test-include", "rclone-sync-test-include/layer2"}
        	            	
        	            	Diff:
        	            	--- Expected
        	            	+++ Actual
        	            	@@ -1,2 +1,7 @@
        	            	-([]string) {
        	            	+([]string) (len=5) {
        	            	+ (string) (len=3) "dst",
        	            	+ (string) (len=16) "rclone-sync-test",
        	            	+ (string) (len=28) "rclone-sync-test-ignore-file",
        	            	+ (string) (len=24) "rclone-sync-test-include",
        	            	+ (string) (len=31) "rclone-sync-test-include/layer2"
        	            	 }
        	Test:       	TestSyncCompareDest
        	Messages:   	directories
--- FAIL: TestSyncCompareDest (31.12s)
=== RUN   TestSyncMultipleCompareDest
    run.go:180: Remote "GCS bucket rclone-test-doxaduw2yope", Local "Local file system at /tmp/rclone3002156174", Modify Window "1ns"
2025/03/06 01:56:23 DEBUG : pre-dest1/: Creating directory marker
2025/03/06 01:56:23 DEBUG : pre-dest2/: Creating directory marker
2025/03/06 01:56:24 DEBUG : Creating backend with remote "TestGoogleCloudStorage,directory_markers:rclone-test-doxaduw2yope/dest"
2025/03/06 01:56:24 DEBUG : TestGoogleCloudStorage: detected overridden config - adding "{juk_h}" suffix to name
2025/03/06 01:56:24 DEBUG : Creating backend with remote "TestGoogleCloudStorage,directory_markers:rclone-test-doxaduw2yope/pre-dest1"
2025/03/06 01:56:24 DEBUG : TestGoogleCloudStorage: detected overridden config - adding "{juk_h}" suffix to name
2025/03/06 01:56:25 DEBUG : fs cache: renaming cache item "TestGoogleCloudStorage,directory_markers:rclone-test-doxaduw2yope/pre-dest1" to be canonical "TestGoogleCloudStorage{juk_h}:rclone-test-doxaduw2yope/pre-dest1"
2025/03/06 01:56:25 DEBUG : Creating backend with remote "TestGoogleCloudStorage,directory_markers:rclone-test-doxaduw2yope/pre-dest2"
2025/03/06 01:56:25 DEBUG : TestGoogleCloudStorage: detected overridden config - adding "{juk_h}" suffix to name
2025/03/06 01:56:25 DEBUG : fs cache: renaming cache item "TestGoogleCloudStorage,directory_markers:rclone-test-doxaduw2yope/pre-dest2" to be canonical "TestGoogleCloudStorage{juk_h}:rclone-test-doxaduw2yope/pre-dest2"
2025/03/06 01:56:26 DEBUG : 1: Size and modification time the same (differ by 0s, within tolerance 1ns)
2025/03/06 01:56:26 DEBUG : 1: Destination found in --compare-dest, skipping
2025/03/06 01:56:26 DEBUG : 2: Size and modification time the same (differ by 0s, within tolerance 1ns)
2025/03/06 01:56:26 DEBUG : 2: Destination found in --compare-dest, skipping
2025/03/06 01:56:27 DEBUG : 3: Need to transfer - File not found at Destination
2025/03/06 01:56:27 DEBUG : GCS bucket rclone-test-doxaduw2yope path dest: Waiting for checks to finish
2025/03/06 01:56:27 DEBUG : GCS bucket rclone-test-doxaduw2yope path dest: Waiting for transfers to finish
2025/03/06 01:56:27 DEBUG : /: Creating directory marker
2025/03/06 01:56:27 DEBUG : 3: md5 = eccbc87e4b5ce2fe28308fd9f2a7baf3 OK
2025/03/06 01:56:27 INFO  : 3: Copied (new)
2025/03/06 01:56:27 DEBUG : Waiting for deletions to finish
2025/03/06 01:56:28 DEBUG : rclone-sync-test-include/layer2/: Removing directory marker
    run.go:125: removing dir "rclone-sync-test-include/layer2" failed - try 1/3: removing directory marker failed: googleapi: Error 404: No such object: rclone-test-doxaduw2yope/rclone-sync-test-include/layer2/, notFound
2025/03/06 01:56:29 DEBUG : rclone-sync-test-include/layer2/: Removing directory marker
    run.go:125: removing dir "rclone-sync-test-include/layer2" failed - try 2/3: removing directory marker failed: googleapi: Error 404: No such object: rclone-test-doxaduw2yope/rclone-sync-test-include/layer2/, notFound
2025/03/06 01:56:30 DEBUG : rclone-sync-test-include/layer2/: Removing directory marker
    run.go:125: removing dir "rclone-sync-test-include/layer2" failed - try 3/3: removing directory marker failed: googleapi: Error 404: No such object: rclone-test-doxaduw2yope/rclone-sync-test-include/layer2/, notFound
    run.go:128: removing dir "rclone-sync-test-include/layer2" failed: removing directory marker failed: googleapi: Error 404: No such object: rclone-test-doxaduw2yope/rclone-sync-test-include/layer2/, notFound
2025/03/06 01:56:31 DEBUG : rclone-sync-test-include/: Removing directory marker
    run.go:125: removing dir "rclone-sync-test-include" failed - try 1/3: removing directory marker failed: googleapi: Error 404: No such object: rclone-test-doxaduw2yope/rclone-sync-test-include/, notFound
2025/03/06 01:56:32 DEBUG : rclone-sync-test-include/: Removing directory marker
    run.go:125: removing dir "rclone-sync-test-include" failed - try 2/3: removing directory marker failed: googleapi: Error 404: No such object: rclone-test-doxaduw2yope/rclone-sync-test-include/, notFound
2025/03/06 01:56:33 DEBUG : rclone-sync-test-include/: Removing directory marker
    run.go:125: removing dir "rclone-sync-test-include" failed - try 3/3: removing directory marker failed: googleapi: Error 404: No such object: rclone-test-doxaduw2yope/rclone-sync-test-include/, notFound
    run.go:128: removing dir "rclone-sync-test-include" failed: removing directory marker failed: googleapi: Error 404: No such object: rclone-test-doxaduw2yope/rclone-sync-test-include/, notFound
2025/03/06 01:56:34 DEBUG : rclone-sync-test-ignore-file/: Removing directory marker
    run.go:125: removing dir "rclone-sync-test-ignore-file" failed - try 1/3: removing directory marker failed: googleapi: Error 404: No such object: rclone-test-doxaduw2yope/rclone-sync-test-ignore-file/, notFound
2025/03/06 01:56:35 DEBUG : rclone-sync-test-ignore-file/: Removing directory marker
    run.go:125: removing dir "rclone-sync-test-ignore-file" failed - try 2/3: removing directory marker failed: googleapi: Error 404: No such object: rclone-test-doxaduw2yope/rclone-sync-test-ignore-file/, notFound
2025/03/06 01:56:36 DEBUG : rclone-sync-test-ignore-file/: Removing directory marker
    run.go:125: removing dir "rclone-sync-test-ignore-file" failed - try 3/3: removing directory marker failed: googleapi: Error 404: No such object: rclone-test-doxaduw2yope/rclone-sync-test-ignore-file/, notFound
    run.go:128: removing dir "rclone-sync-test-ignore-file" failed: removing directory marker failed: googleapi: Error 404: No such object: rclone-test-doxaduw2yope/rclone-sync-test-ignore-file/, notFound
2025/03/06 01:56:37 DEBUG : rclone-sync-test/: Removing directory marker
    run.go:125: removing dir "rclone-sync-test" failed - try 1/3: removing directory marker failed: googleapi: Error 404: No such object: rclone-test-doxaduw2yope/rclone-sync-test/, notFound
2025/03/06 01:56:38 DEBUG : rclone-sync-test/: Removing directory marker
    run.go:125: removing dir "rclone-sync-test" failed - try 2/3: removing directory marker failed: googleapi: Error 404: No such object: rclone-test-doxaduw2yope/rclone-sync-test/, notFound
2025/03/06 01:56:39 DEBUG : rclone-sync-test/: Removing directory marker
    run.go:125: removing dir "rclone-sync-test" failed - try 3/3: removing directory marker failed: googleapi: Error 404: No such object: rclone-test-doxaduw2yope/rclone-sync-test/, notFound
    run.go:128: removing dir "rclone-sync-test" failed: removing directory marker failed: googleapi: Error 404: No such object: rclone-test-doxaduw2yope/rclone-sync-test/, notFound
2025/03/06 01:56:40 DEBUG : pre-dest2/: Removing directory marker
2025/03/06 01:56:40 DEBUG : pre-dest1/: Removing directory marker
2025/03/06 01:56:41 DEBUG : dst/: Removing directory marker
    run.go:125: removing dir "dst" failed - try 1/3: removing directory marker failed: googleapi: Error 404: No such object: rclone-test-doxaduw2yope/dst/, notFound
2025/03/06 01:56:42 DEBUG : dst/: Removing directory marker
    run.go:125: removing dir "dst" failed - try 2/3: removing directory marker failed: googleapi: Error 404: No such object: rclone-test-doxaduw2yope/dst/, notFound
2025/03/06 01:56:43 DEBUG : dst/: Removing directory marker
    run.go:125: removing dir "dst" failed - try 3/3: removing directory marker failed: googleapi: Error 404: No such object: rclone-test-doxaduw2yope/dst/, notFound
    run.go:128: removing dir "dst" failed: removing directory marker failed: googleapi: Error 404: No such object: rclone-test-doxaduw2yope/dst/, notFound
2025/03/06 01:56:44 DEBUG : dest/: Removing directory marker
    run.go:125: removing dir "dest" failed - try 1/3: removing directory marker failed: googleapi: Error 404: No such object: rclone-test-doxaduw2yope/dest/, notFound
2025/03/06 01:56:45 DEBUG : dest/: Removing directory marker
    run.go:125: removing dir "dest" failed - try 2/3: removing directory marker failed: googleapi: Error 404: No such object: rclone-test-doxaduw2yope/dest/, notFound
2025/03/06 01:56:46 DEBUG : dest/: Removing directory marker
    run.go:125: removing dir "dest" failed - try 3/3: removing directory marker failed: googleapi: Error 404: No such object: rclone-test-doxaduw2yope/dest/, notFound
    run.go:128: removing dir "dest" failed: removing directory marker failed: googleapi: Error 404: No such object: rclone-test-doxaduw2yope/dest/, notFound
    fstest.go:292: Sleeping for 1s for list eventual consistency: 1/3
    fstest.go:292: Sleeping for 2s for list eventual consistency: 2/3
    fstest.go:292: Sleeping for 4s for list eventual consistency: 3/3
    fstest.go:321: 
        	Error Trace:	/home/rclone/go/src/github.com/rclone/rclone/fstest/fstest.go:321
        	            				/home/rclone/go/src/github.com/rclone/rclone/fstest/fstest.go:332
        	            				/home/rclone/go/src/github.com/rclone/rclone/fstest/run.go:173
        	            				/home/rclone/go/src/github.com/rclone/rclone/fstest/run.go:388
        	            				/home/rclone/go/pkg/mod/golang.org/toolchain@v0.0.1-go1.23.0.linux-amd64/src/testing/testing.go:1176
        	            				/home/rclone/go/pkg/mod/golang.org/toolchain@v0.0.1-go1.23.0.linux-amd64/src/testing/testing.go:1354
        	            				/home/rclone/go/pkg/mod/golang.org/toolchain@v0.0.1-go1.23.0.linux-amd64/src/testing/testing.go:1684
        	            				/home/rclone/go/pkg/mod/golang.org/toolchain@v0.0.1-go1.23.0.linux-amd64/src/runtime/panic.go:785
        	            				/home/rclone/go/pkg/mod/golang.org/toolchain@v0.0.1-go1.23.0.linux-amd64/src/runtime/panic.go:155
        	            				/home/rclone/go/src/github.com/rclone/rclone/backend/googlecloudstorage/googlecloudstorage.go:717
        	            				/home/rclone/go/src/github.com/rclone/rclone/backend/googlecloudstorage/googlecloudstorage.go:850
        	            				/home/rclone/go/src/github.com/rclone/rclone/backend/googlecloudstorage/googlecloudstorage.go:877
        	            				/home/rclone/go/src/github.com/rclone/rclone/fs/walk/walk.go:298
        	            				/home/rclone/go/src/github.com/rclone/rclone/fs/walk/walk.go:162
        	            				/home/rclone/go/src/github.com/rclone/rclone/fs/walk/walk.go:631
        	            				/home/rclone/go/src/github.com/rclone/rclone/fstest/fstest.go:274
        	            				/home/rclone/go/src/github.com/rclone/rclone/fstest/fstest.go:332
        	            				/home/rclone/go/src/github.com/rclone/rclone/fstest/fstest.go:344
        	            				/home/rclone/go/src/github.com/rclone/rclone/fs/sync/sync_test.go:2224
        	Error:      	Not equal: 
        	            	expected: []string{}
        	            	actual  : []string{"dest", "dst", "rclone-sync-test", "rclone-sync-test-ignore-file", "rclone-sync-test-include", "rclone-sync-test-include/layer2"}
        	            	
        	            	Diff:
        	            	--- Expected
        	            	+++ Actual
        	            	@@ -1,2 +1,8 @@
        	            	-([]string) {
        	            	+([]string) (len=6) {
        	            	+ (string) (len=4) "dest",
        	            	+ (string) (len=3) "dst",
        	            	+ (string) (len=16) "rclone-sync-test",
        	            	+ (string) (len=28) "rclone-sync-test-ignore-file",
        	            	+ (string) (len=24) "rclone-sync-test-include",
        	            	+ (string) (len=31) "rclone-sync-test-include/layer2"
        	            	 }
        	Test:       	TestSyncMultipleCompareDest
        	Messages:   	directories
--- FAIL: TestSyncMultipleCompareDest (31.39s)
panic: runtime error: slice bounds out of range [5:4] [recovered]
	panic: runtime error: slice bounds out of range [5:4]

goroutine 1883 [running]:
testing.tRunner.func1.2({0x240ff40, 0xc000440600})
	/home/rclone/go/pkg/mod/golang.org/toolchain@v0.0.1-go1.23.0.linux-amd64/src/testing/testing.go:1632 +0x230
testing.tRunner.func1()
	/home/rclone/go/pkg/mod/golang.org/toolchain@v0.0.1-go1.23.0.linux-amd64/src/testing/testing.go:1635 +0x35e
panic({0x240ff40?, 0xc000440600?})
	/home/rclone/go/pkg/mod/golang.org/toolchain@v0.0.1-go1.23.0.linux-amd64/src/runtime/panic.go:785 +0x132
github.com/rclone/rclone/backend/googlecloudstorage.(*Fs).list(0xc00041ac80, {0x29e8420, 0x3d1a900}, {0xc0007e4439, 0x18}, {0xc0007e4452, 0x4}, {0xc0007e4452, 0x4}, 0x0, ...)
	/home/rclone/go/src/github.com/rclone/rclone/backend/googlecloudstorage/googlecloudstorage.go:717 +0xffe
github.com/rclone/rclone/backend/googlecloudstorage.(*Fs).ListR.func1({0xc0007e4439?, 0x0?}, {0xc0007e4452?, 0x47233d?}, {0xc0007e4452?, 0x41d4f6?}, 0x40?)
	/home/rclone/go/src/github.com/rclone/rclone/backend/googlecloudstorage/googlecloudstorage.go:850 +0x95
github.com/rclone/rclone/backend/googlecloudstorage.(*Fs).ListR(0xc00041ac80, {0x29e8420, 0x3d1a900}, {0x0?, 0x24da380?}, 0xc0003d21e0)
	/home/rclone/go/src/github.com/rclone/rclone/backend/googlecloudstorage/googlecloudstorage.go:877 +0x12a
github.com/rclone/rclone/fs/walk.listR({0x29e8420, 0x3d1a900}, {0x29fcde0, 0xc00041ac80}, {0x0, 0x0}, 0x1, 0x3, 0xc000822090, 0xc000c18528, ...)
	/home/rclone/go/src/github.com/rclone/rclone/fs/walk/walk.go:298 +0x2a3
github.com/rclone/rclone/fs/walk.ListR({0x29e8420, 0x3d1a900}, {0x29fcde0, 0xc00041ac80}, {0x0, 0x0}, 0x1, 0xffffffffffffffff, 0x3, 0xc000822090)
	/home/rclone/go/src/github.com/rclone/rclone/fs/walk/walk.go:162 +0x1d5
github.com/rclone/rclone/fs/walk.GetAll({0x29e8420, 0x3d1a900}, {0x29fcde0, 0xc00041ac80}, {0x0, 0x0}, 0x1, 0xffffffffffffffff)
	/home/rclone/go/src/github.com/rclone/rclone/fs/walk/walk.go:631 +0x105
github.com/rclone/rclone/fstest.CheckListingWithRoot(0xc00080e340, {0x29fcde0, 0xc00041ac80}, {0x0, 0x0}, {0xc00040c000, 0x1, 0x1}, {0x0, 0x0, ...}, ...)
	/home/rclone/go/src/github.com/rclone/rclone/fstest/fstest.go:274 +0x3d6
github.com/rclone/rclone/fstest.CheckListingWithPrecision(...)
	/home/rclone/go/src/github.com/rclone/rclone/fstest/fstest.go:332
github.com/rclone/rclone/fstest.CheckItemsWithPrecision(...)
	/home/rclone/go/src/github.com/rclone/rclone/fstest/fstest.go:344
github.com/rclone/rclone/fs/sync.TestSyncMultipleCompareDest(0xc00080e340)
	/home/rclone/go/src/github.com/rclone/rclone/fs/sync/sync_test.go:2224 +0xa0b
testing.tRunner(0xc00080e340, 0x270da00)
	/home/rclone/go/pkg/mod/golang.org/toolchain@v0.0.1-go1.23.0.linux-amd64/src/testing/testing.go:1690 +0xf4
created by testing.(*T).Run in goroutine 1
	/home/rclone/go/pkg/mod/golang.org/toolchain@v0.0.1-go1.23.0.linux-amd64/src/testing/testing.go:1743 +0x390
"./sync.test -test.v -test.timeout 1h0m0s -remote 'TestGoogleCloudStorage,directory_markers:' -verbose -test.run '^(TestSyncCompareDest|TestSyncMultipleCompareDest|TestSyncOverlapWithFilter)$'" - Finished ERROR in 7m38.265630274s (try 4/5): exit status 2: Failed [TestSyncOverlapWithFilter TestSyncCompareDest TestSyncMultipleCompareDest]