"go test -v -timeout 30m0s -remote TestGooglePhotos: -verbose" - Starting (try 1/5) === RUN TestNewAlbums --- PASS: TestNewAlbums (0.00s) === RUN TestAlbumsAdd --- PASS: TestAlbumsAdd (0.00s) === RUN TestAlbumsDel --- PASS: TestAlbumsDel (0.00s) === RUN TestAlbumsGet --- PASS: TestAlbumsGet (0.00s) === RUN TestAlbumsGetDirs --- PASS: TestAlbumsGetDirs (0.00s) === RUN TestIntegration === RUN TestIntegration/CreateAlbum 2019/10/03 05:49:11 DEBUG : Google Photos path "": Mkdir: dir="album/rclone-test-loyihok1jihifad6jenuguz5" 2019/10/03 05:49:11 DEBUG : TestGooglePhotos: Loaded invalid token from config file - ignoring 2019/10/03 05:49:12 DEBUG : TestGooglePhotos: Saved new token in config file 2019/10/03 05:49:16 DEBUG : pacer: low level retry 1/10 (error Quota exceeded for quota metric 'photoslibrary.googleapis.com/all_requests' and limit 'ApiCallsPerProjectPerDay' of service 'photoslibrary.googleapis.com' for consumer 'project_number:202264815644'. (429 RESOURCE_EXHAUSTED)) 2019/10/03 05:49:16 DEBUG : pacer: Rate limited, increasing sleep to 1.867507027s 2019/10/03 05:49:18 DEBUG : pacer: low level retry 2/10 (error Quota exceeded for quota metric 'photoslibrary.googleapis.com/all_requests' and limit 'ApiCallsPerProjectPerDay' of service 'photoslibrary.googleapis.com' for consumer 'project_number:202264815644'. (429 RESOURCE_EXHAUSTED)) 2019/10/03 05:49:18 DEBUG : pacer: Rate limited, increasing sleep to 2.176653255s 2019/10/03 05:49:19 DEBUG : pacer: low level retry 3/10 (error Quota exceeded for quota metric 'photoslibrary.googleapis.com/all_requests' and limit 'ApiCallsPerProjectPerDay' of service 'photoslibrary.googleapis.com' for consumer 'project_number:202264815644'. (429 RESOURCE_EXHAUSTED)) 2019/10/03 05:49:19 DEBUG : pacer: Rate limited, increasing sleep to 4.299619776s 2019/10/03 05:49:22 DEBUG : pacer: low level retry 4/10 (error Quota exceeded for quota metric 'photoslibrary.googleapis.com/all_requests' and limit 'ApiCallsPerProjectPerDay' of service 'photoslibrary.googleapis.com' for consumer 'project_number:202264815644'. (429 RESOURCE_EXHAUSTED)) 2019/10/03 05:49:22 DEBUG : pacer: Rate limited, increasing sleep to 8.718142897s 2019/10/03 05:49:26 DEBUG : pacer: low level retry 5/10 (error Quota exceeded for quota metric 'photoslibrary.googleapis.com/all_requests' and limit 'ApiCallsPerProjectPerDay' of service 'photoslibrary.googleapis.com' for consumer 'project_number:202264815644'. (429 RESOURCE_EXHAUSTED)) 2019/10/03 05:49:26 DEBUG : pacer: Rate limited, increasing sleep to 16.942466207s 2019/10/03 05:49:36 DEBUG : pacer: Reducing sleep to 0s 2019/10/03 05:49:55 DEBUG : pacer: low level retry 1/10 (error Quota exceeded for quota metric 'photoslibrary.googleapis.com/all_requests' and limit 'ApiCallsPerProjectPerDay' of service 'photoslibrary.googleapis.com' for consumer 'project_number:202264815644'. (429 RESOURCE_EXHAUSTED)) 2019/10/03 05:49:55 DEBUG : pacer: Rate limited, increasing sleep to 1.257092588s 2019/10/03 05:49:57 DEBUG : pacer: Reducing sleep to 0s 2019/10/03 05:49:57 DEBUG : Google Photos path "": >Mkdir: err= === RUN TestIntegration/CreateAlbum/PutFile 2019/10/03 05:49:57 DEBUG : Google Photos path "": Put: src=rclone-test-image1.jpg 2019/10/03 05:49:57 DEBUG : album/rclone-test-loyihok1jihifad6jenuguz5/rclone-test-image1.jpg: Update: src=rclone-test-image1.jpg 2019/10/03 05:49:59 DEBUG : pacer: low level retry 1/10 (error Quota exceeded for quota metric 'photoslibrary.googleapis.com/all_requests' and limit 'ApiCallsPerProjectPerDay' of service 'photoslibrary.googleapis.com' for consumer 'project_number:202264815644'. (429 RESOURCE_EXHAUSTED)) 2019/10/03 05:49:59 DEBUG : pacer: Rate limited, increasing sleep to 1.880738245s 2019/10/03 05:50:01 DEBUG : pacer: low level retry 2/10 (error Quota exceeded for quota metric 'photoslibrary.googleapis.com/all_requests' and limit 'ApiCallsPerProjectPerDay' of service 'photoslibrary.googleapis.com' for consumer 'project_number:202264815644'. (429 RESOURCE_EXHAUSTED)) 2019/10/03 05:50:01 DEBUG : pacer: Rate limited, increasing sleep to 2.94816304s 2019/10/03 05:50:03 DEBUG : pacer: low level retry 3/10 (error Quota exceeded for quota metric 'photoslibrary.googleapis.com/all_requests' and limit 'ApiCallsPerProjectPerDay' of service 'photoslibrary.googleapis.com' for consumer 'project_number:202264815644'. (429 RESOURCE_EXHAUSTED)) 2019/10/03 05:50:03 DEBUG : pacer: Rate limited, increasing sleep to 4.043014343s 2019/10/03 05:50:09 DEBUG : pacer: Reducing sleep to 0s 2019/10/03 05:50:09 DEBUG : album/rclone-test-loyihok1jihifad6jenuguz5/rclone-test-image1.jpg: >Update: err= 2019/10/03 05:50:09 DEBUG : Google Photos path "": >Put: === RUN TestIntegration/CreateAlbum/PutFile/ObjectFs === RUN TestIntegration/CreateAlbum/PutFile/ObjectString === RUN TestIntegration/CreateAlbum/PutFile/ObjectHash === RUN TestIntegration/CreateAlbum/PutFile/ObjectSize 2019/10/03 05:50:09 DEBUG : album/rclone-test-loyihok1jihifad6jenuguz5/rclone-test-image1.jpg: Size: 2019/10/03 05:50:09 DEBUG : album/rclone-test-loyihok1jihifad6jenuguz5/rclone-test-image1.jpg: >Size: 2019/10/03 05:50:09 DEBUG : album/rclone-test-loyihok1jihifad6jenuguz5/rclone-test-image1.jpg: Size: 2019/10/03 05:50:09 DEBUG : Google Photos path "": List: dir="album/rclone-test-loyihok1jihifad6jenuguz5" 2019/10/03 05:50:10 DEBUG : Google Photos path "": >List: err= 2019/10/03 05:50:12 DEBUG : album/rclone-test-loyihok1jihifad6jenuguz5/rclone-test-image1.jpg: >Size: === RUN TestIntegration/CreateAlbum/PutFile/ObjectSetModTime === RUN TestIntegration/CreateAlbum/PutFile/ObjectStorable === RUN TestIntegration/CreateAlbum/PutFile/ObjectOpen 2019/10/03 05:50:12 DEBUG : album/rclone-test-loyihok1jihifad6jenuguz5/rclone-test-image1.jpg: Open: 2019/10/03 05:50:12 DEBUG : pacer: low level retry 1/10 (error Error 429 (Too Many Requests)!!1

429. That’s an error.

The rate limit for this service has been exceeded. That’s all we know. (429 429 Too Many Requests)) 2019/10/03 05:50:12 DEBUG : pacer: Rate limited, increasing sleep to 1.777236652s 2019/10/03 05:50:13 DEBUG : pacer: low level retry 2/10 (error Error 429 (Too Many Requests)!!1

429. That’s an error.

The rate limit for this service has been exceeded. That’s all we know. (429 429 Too Many Requests)) 2019/10/03 05:50:13 DEBUG : pacer: Rate limited, increasing sleep to 2.962538969s 2019/10/03 05:50:14 DEBUG : pacer: low level retry 3/10 (error Error 429 (Too Many Requests)!!1

429. That’s an error.

The rate limit for this service has been exceeded. That’s all we know. (429 429 Too Many Requests)) 2019/10/03 05:50:14 DEBUG : pacer: Rate limited, increasing sleep to 4.430482745s 2019/10/03 05:50:17 DEBUG : pacer: low level retry 4/10 (error Error 429 (Too Many Requests)!!1

429. That’s an error.

The rate limit for this service has been exceeded. That’s all we know. (429 429 Too Many Requests)) 2019/10/03 05:50:17 DEBUG : pacer: Rate limited, increasing sleep to 8.251872982s 2019/10/03 05:50:22 DEBUG : pacer: low level retry 5/10 (error Error 429 (Too Many Requests)!!1

429. That’s an error.

The rate limit for this service has been exceeded. That’s all we know. (429 429 Too Many Requests)) 2019/10/03 05:50:22 DEBUG : pacer: Rate limited, increasing sleep to 16.10261879s 2019/10/03 05:50:30 DEBUG : pacer: low level retry 6/10 (error Error 429 (Too Many Requests)!!1

429. That’s an error.

The rate limit for this service has been exceeded. That’s all we know. (429 429 Too Many Requests)) 2019/10/03 05:50:30 DEBUG : pacer: Rate limited, increasing sleep to 16.682254275s 2019/10/03 05:50:46 DEBUG : pacer: low level retry 7/10 (error Error 429 (Too Many Requests)!!1

429. That’s an error.

The rate limit for this service has been exceeded. That’s all we know. (429 429 Too Many Requests)) 2019/10/03 05:50:46 DEBUG : pacer: Rate limited, increasing sleep to 16.197971409s 2019/10/03 05:51:03 DEBUG : pacer: low level retry 8/10 (error Error 429 (Too Many Requests)!!1

429. That’s an error.

The rate limit for this service has been exceeded. That’s all we know. (429 429 Too Many Requests)) 2019/10/03 05:51:03 DEBUG : pacer: Rate limited, increasing sleep to 16.81643242s 2019/10/03 05:51:19 DEBUG : pacer: low level retry 9/10 (error Error 429 (Too Many Requests)!!1

429. That’s an error.

The rate limit for this service has been exceeded. That’s all we know. (429 429 Too Many Requests)) 2019/10/03 05:51:19 DEBUG : pacer: Rate limited, increasing sleep to 16.55894174s 2019/10/03 05:51:36 DEBUG : pacer: low level retry 10/10 (error Error 429 (Too Many Requests)!!1

429. That’s an error.

The rate limit for this service has been exceeded. That’s all we know. (429 429 Too Many Requests)) 2019/10/03 05:51:36 DEBUG : pacer: Rate limited, increasing sleep to 16.891736383s 2019/10/03 05:51:36 DEBUG : album/rclone-test-loyihok1jihifad6jenuguz5/rclone-test-image1.jpg: >Open: === RUN TestIntegration/CreateAlbum/PutFile/CheckFileInAlbum 2019/10/03 05:51:36 DEBUG : Google Photos path "": List: dir="album/rclone-test-loyihok1jihifad6jenuguz5" 2019/10/03 05:51:54 DEBUG : pacer: Reducing sleep to 0s 2019/10/03 05:51:54 DEBUG : Google Photos path "": >List: err= 2019/10/03 05:51:54 DEBUG : album/rclone-test-loyihok1jihifad6jenuguz5/rclone-test-image1.jpg: ModTime: 2019/10/03 05:51:54 DEBUG : album/rclone-test-loyihok1jihifad6jenuguz5/rclone-test-image1.jpg: >ModTime: === RUN TestIntegration/CreateAlbum/PutFile/CheckInByYear 2019/10/03 05:51:54 DEBUG : Google Photos path "": List: dir="media/by-year/2013" 2019/10/03 05:52:13 DEBUG : pacer: low level retry 1/10 (error Quota exceeded for quota metric 'photoslibrary.googleapis.com/all_requests' and limit 'ApiCallsPerProjectPerDay' of service 'photoslibrary.googleapis.com' for consumer 'project_number:202264815644'. (429 RESOURCE_EXHAUSTED)) 2019/10/03 05:52:13 DEBUG : pacer: Rate limited, increasing sleep to 1.241846219s 2019/10/03 05:52:15 DEBUG : pacer: Reducing sleep to 0s 2019/10/03 05:52:15 DEBUG : Google Photos path "": >List: err= === RUN TestIntegration/CreateAlbum/PutFile/CheckInByMonth 2019/10/03 05:52:15 DEBUG : Google Photos path "": List: dir="media/by-month/2013/2013-07" 2019/10/03 05:52:18 DEBUG : Google Photos path "": >List: err= === RUN TestIntegration/CreateAlbum/PutFile/CheckInByDay 2019/10/03 05:52:18 DEBUG : Google Photos path "": List: dir="media/by-day/2013/2013-07-26" 2019/10/03 05:52:20 DEBUG : pacer: low level retry 1/10 (error Quota exceeded for quota metric 'photoslibrary.googleapis.com/all_requests' and limit 'ApiCallsPerProjectPerDay' of service 'photoslibrary.googleapis.com' for consumer 'project_number:202264815644'. (429 RESOURCE_EXHAUSTED)) 2019/10/03 05:52:20 DEBUG : pacer: Rate limited, increasing sleep to 1.139093793s 2019/10/03 05:52:21 DEBUG : pacer: low level retry 2/10 (error Quota exceeded for quota metric 'photoslibrary.googleapis.com/all_requests' and limit 'ApiCallsPerProjectPerDay' of service 'photoslibrary.googleapis.com' for consumer 'project_number:202264815644'. (429 RESOURCE_EXHAUSTED)) 2019/10/03 05:52:21 DEBUG : pacer: Rate limited, increasing sleep to 2.112028898s 2019/10/03 05:52:22 DEBUG : pacer: Reducing sleep to 0s 2019/10/03 05:52:22 DEBUG : Google Photos path "": >List: err= === RUN TestIntegration/CreateAlbum/PutFile/NewObject 2019/10/03 05:52:22 DEBUG : Google Photos path "": NewObject: remote="album/rclone-test-loyihok1jihifad6jenuguz5/rclone-test-image1.jpg" 2019/10/03 05:52:22 DEBUG : Google Photos path "": List: dir="album/rclone-test-loyihok1jihifad6jenuguz5" 2019/10/03 05:52:26 DEBUG : Google Photos path "": >List: err= 2019/10/03 05:52:26 DEBUG : Google Photos path "": >NewObject: === RUN TestIntegration/CreateAlbum/PutFile/NewObjectWithID 2019/10/03 05:52:26 DEBUG : Google Photos path "": NewObject: remote="album/rclone-test-loyihok1jihifad6jenuguz5/rclone-test-image1 {ALOKJiij1W7NqR8m4fVOFogqyQjeUEMc14c2GWrK6P8tHiQttTrTvBblBfG2LUsKRCml_8syA24ZupQSng98A1G0agXejH5DSw}.jpg" 2019/10/03 05:52:28 DEBUG : Google Photos path "": >NewObject: === RUN TestIntegration/CreateAlbum/PutFile/NewFsIsFile 2019/10/03 05:52:28 DEBUG : Google Photos path "album/rclone-test-loyihok1jihifad6jenuguz5": NewObject: remote="rclone-test-image1.jpg" 2019/10/03 05:52:28 DEBUG : Google Photos path "album/rclone-test-loyihok1jihifad6jenuguz5": List: dir="" 2019/10/03 05:52:30 DEBUG : pacer: low level retry 1/10 (error Quota exceeded for quota metric 'photoslibrary.googleapis.com/all_requests' and limit 'ApiCallsPerProjectPerDay' of service 'photoslibrary.googleapis.com' for consumer 'project_number:202264815644'. (429 RESOURCE_EXHAUSTED)) 2019/10/03 05:52:30 DEBUG : pacer: Rate limited, increasing sleep to 1.245443575s 2019/10/03 05:52:31 DEBUG : pacer: Reducing sleep to 0s 2019/10/03 05:52:34 DEBUG : pacer: low level retry 1/10 (error Quota exceeded for quota metric 'photoslibrary.googleapis.com/all_requests' and limit 'ApiCallsPerProjectPerDay' of service 'photoslibrary.googleapis.com' for consumer 'project_number:202264815644'. (429 RESOURCE_EXHAUSTED)) 2019/10/03 05:52:34 DEBUG : pacer: Rate limited, increasing sleep to 1.21799441s 2019/10/03 05:52:35 DEBUG : pacer: Reducing sleep to 0s 2019/10/03 05:52:35 DEBUG : Google Photos path "album/rclone-test-loyihok1jihifad6jenuguz5": >List: err= 2019/10/03 05:52:35 DEBUG : Google Photos path "album/rclone-test-loyihok1jihifad6jenuguz5": >NewObject: 2019/10/03 05:52:35 DEBUG : Google Photos path "album/rclone-test-loyihok1jihifad6jenuguz5": NewObject: remote="rclone-test-image1.jpg" 2019/10/03 05:52:35 DEBUG : Google Photos path "album/rclone-test-loyihok1jihifad6jenuguz5": List: dir="" 2019/10/03 05:52:37 DEBUG : pacer: low level retry 1/10 (error Quota exceeded for quota metric 'photoslibrary.googleapis.com/all_requests' and limit 'ApiCallsPerProjectPerDay' of service 'photoslibrary.googleapis.com' for consumer 'project_number:202264815644'. (429 RESOURCE_EXHAUSTED)) 2019/10/03 05:52:37 DEBUG : pacer: Rate limited, increasing sleep to 1.115762827s 2019/10/03 05:52:39 DEBUG : pacer: low level retry 2/10 (error Quota exceeded for quota metric 'photoslibrary.googleapis.com/all_requests' and limit 'ApiCallsPerProjectPerDay' of service 'photoslibrary.googleapis.com' for consumer 'project_number:202264815644'. (429 RESOURCE_EXHAUSTED)) 2019/10/03 05:52:39 DEBUG : pacer: Rate limited, increasing sleep to 2.78792656s 2019/10/03 05:52:40 DEBUG : pacer: low level retry 3/10 (error Quota exceeded for quota metric 'photoslibrary.googleapis.com/all_requests' and limit 'ApiCallsPerProjectPerDay' of service 'photoslibrary.googleapis.com' for consumer 'project_number:202264815644'. (429 RESOURCE_EXHAUSTED)) 2019/10/03 05:52:40 DEBUG : pacer: Rate limited, increasing sleep to 4.892531327s 2019/10/03 05:52:42 DEBUG : pacer: Reducing sleep to 0s 2019/10/03 05:52:42 DEBUG : Google Photos path "album/rclone-test-loyihok1jihifad6jenuguz5": >List: err= 2019/10/03 05:52:42 DEBUG : Google Photos path "album/rclone-test-loyihok1jihifad6jenuguz5": >NewObject: === RUN TestIntegration/CreateAlbum/PutFile/RemoveFileFromAlbum 2019/10/03 05:52:45 DEBUG : Google Photos path "": List: dir="album/rclone-test-loyihok1jihifad6jenuguz5" 2019/10/03 05:52:47 DEBUG : Google Photos path "": >List: err= 2019/10/03 05:52:47 DEBUG : Google Photos path "": Rmdir: dir=%!q(MISSING) 2019/10/03 05:52:47 DEBUG : Google Photos path "": >Rmdir: err=google photos API does not implement deleting albums === RUN TestIntegration/UploadMkdir 2019/10/03 05:52:47 DEBUG : Google Photos path "": Mkdir: dir="upload/dir" 2019/10/03 05:52:47 DEBUG : Google Photos path "": >Mkdir: err= 2019/10/03 05:52:47 DEBUG : Google Photos path "": Mkdir: dir="upload/dir/subdir" 2019/10/03 05:52:47 DEBUG : Google Photos path "": >Mkdir: err= === RUN TestIntegration/UploadMkdir/List 2019/10/03 05:52:47 DEBUG : Google Photos path "": List: dir="upload" 2019/10/03 05:52:47 DEBUG : Google Photos path "": >List: err= 2019/10/03 05:52:47 DEBUG : Google Photos path "": List: dir="upload/dir" 2019/10/03 05:52:47 DEBUG : Google Photos path "": >List: err= === RUN TestIntegration/UploadMkdir/Rmdir 2019/10/03 05:52:47 DEBUG : Google Photos path "": Rmdir: dir=%!q(MISSING) 2019/10/03 05:52:47 DEBUG : Google Photos path "": >Rmdir: err= 2019/10/03 05:52:47 DEBUG : Google Photos path "": Rmdir: dir=%!q(MISSING) 2019/10/03 05:52:47 DEBUG : Google Photos path "": >Rmdir: err= === RUN TestIntegration/UploadMkdir/ListEmpty 2019/10/03 05:52:47 DEBUG : Google Photos path "": List: dir="upload" 2019/10/03 05:52:47 DEBUG : Google Photos path "": >List: err= 2019/10/03 05:52:47 DEBUG : Google Photos path "": List: dir="upload/dir" 2019/10/03 05:52:47 DEBUG : Google Photos path "": >List: err=directory not found === RUN TestIntegration/Upload 2019/10/03 05:52:47 DEBUG : Google Photos path "": Put: src=rclone-test-image2.jpg 2019/10/03 05:52:47 DEBUG : upload/dir/subdir/rclone-test-image2.jpg: Update: src=rclone-test-image2.jpg 2019/10/03 05:52:51 DEBUG : upload/dir/subdir/rclone-test-image2.jpg: >Update: err= 2019/10/03 05:52:51 DEBUG : Google Photos path "": >Put: === RUN TestIntegration/Upload/List 2019/10/03 05:52:51 DEBUG : Google Photos path "": List: dir="upload/dir/subdir" 2019/10/03 05:52:51 DEBUG : Google Photos path "": >List: err= 2019/10/03 05:52:51 DEBUG : upload/dir/subdir/rclone-test-image2.jpg: ModTime: 2019/10/03 05:52:51 DEBUG : Google Photos path "": List: dir="upload/dir/subdir" 2019/10/03 05:52:51 DEBUG : Google Photos path "": >List: err= 2019/10/03 05:52:51 DEBUG : upload/dir/subdir/rclone-test-image2.jpg: >ModTime: === RUN TestIntegration/Upload/NewObject 2019/10/03 05:52:51 DEBUG : Google Photos path "": NewObject: remote="upload/dir/subdir/rclone-test-image2.jpg" 2019/10/03 05:52:51 DEBUG : Google Photos path "": List: dir="upload/dir/subdir" 2019/10/03 05:52:51 DEBUG : Google Photos path "": >List: err= 2019/10/03 05:52:51 DEBUG : Google Photos path "": >NewObject: === RUN TestIntegration/Upload/NewObjectWithID 2019/10/03 05:52:51 DEBUG : Google Photos path "": NewObject: remote="upload/dir/subdir/rclone-test-image2 {ALOKJii7XWCj_vIu4ceOSuEIDk5JEZn8ypYEUqOZktpK248TRnFljSsuAXX25ExXLgpFqJhYkTRORq5zNgke4rdqS13zO1Kd7A}.jpg" 2019/10/03 05:52:53 DEBUG : Google Photos path "": >NewObject: === RUN TestIntegration/Name === RUN TestIntegration/Root === RUN TestIntegration/String === RUN TestIntegration/Features === RUN TestIntegration/Precision === RUN TestIntegration/Hashes --- FAIL: TestIntegration (222.72s) --- FAIL: TestIntegration/CreateAlbum (216.12s) --- FAIL: TestIntegration/CreateAlbum/PutFile (169.88s) --- PASS: TestIntegration/CreateAlbum/PutFile/ObjectFs (0.00s) --- PASS: TestIntegration/CreateAlbum/PutFile/ObjectString (0.00s) --- PASS: TestIntegration/CreateAlbum/PutFile/ObjectHash (0.00s) --- PASS: TestIntegration/CreateAlbum/PutFile/ObjectSize (3.13s) --- PASS: TestIntegration/CreateAlbum/PutFile/ObjectSetModTime (0.00s) --- PASS: TestIntegration/CreateAlbum/PutFile/ObjectStorable (0.00s) --- FAIL: TestIntegration/CreateAlbum/PutFile/ObjectOpen (83.97s) googlephotos_test.go:111: Error Trace: googlephotos_test.go:111 Error: Received unexpected error: Error 429 (Too Many Requests)!!1

429. That’s an error.

The rate limit for this service has been exceeded. That’s all we know. (429 429 Too Many Requests) Test: TestIntegration/CreateAlbum/PutFile/ObjectOpen --- PASS: TestIntegration/CreateAlbum/PutFile/CheckFileInAlbum (17.85s) --- PASS: TestIntegration/CreateAlbum/PutFile/CheckInByYear (20.89s) --- PASS: TestIntegration/CreateAlbum/PutFile/CheckInByMonth (2.95s) --- PASS: TestIntegration/CreateAlbum/PutFile/CheckInByDay (4.86s) --- PASS: TestIntegration/CreateAlbum/PutFile/NewObject (3.35s) --- PASS: TestIntegration/CreateAlbum/PutFile/NewObjectWithID (1.90s) --- PASS: TestIntegration/CreateAlbum/PutFile/NewFsIsFile (14.80s) --- PASS: TestIntegration/CreateAlbum/PutFile/RemoveFileFromAlbum (4.42s) --- PASS: TestIntegration/UploadMkdir (0.00s) --- PASS: TestIntegration/UploadMkdir/List (0.00s) --- PASS: TestIntegration/UploadMkdir/Rmdir (0.00s) --- PASS: TestIntegration/UploadMkdir/ListEmpty (0.00s) --- PASS: TestIntegration/Upload (6.59s) --- PASS: TestIntegration/Upload/List (0.00s) --- PASS: TestIntegration/Upload/NewObject (0.00s) --- PASS: TestIntegration/Upload/NewObjectWithID (2.07s) --- PASS: TestIntegration/Name (0.00s) --- PASS: TestIntegration/Root (0.00s) --- PASS: TestIntegration/String (0.00s) --- PASS: TestIntegration/Features (0.00s) --- PASS: TestIntegration/Precision (0.00s) --- PASS: TestIntegration/Hashes (0.00s) === RUN TestAddID --- PASS: TestAddID (0.00s) === RUN TestFileAddID --- PASS: TestFileAddID (0.00s) === RUN TestFindID --- PASS: TestFindID (0.00s) === RUN TestPatternMatch === RUN TestPatternMatch/#0,root="",itemPath="",isFile=false === RUN TestPatternMatch/#1,root="",itemPath="",isFile=true === RUN TestPatternMatch/#2,root="upload",itemPath="",isFile=false === RUN TestPatternMatch/#3,root="upload/dir",itemPath="",isFile=false === RUN TestPatternMatch/#4,root="upload/file.jpg",itemPath="",isFile=true === RUN TestPatternMatch/#5,root="media",itemPath="",isFile=false === RUN TestPatternMatch/#6,root="",itemPath="media",isFile=false === RUN TestPatternMatch/#7,root="media/all",itemPath="",isFile=false === RUN TestPatternMatch/#8,root="media",itemPath="all",isFile=false === RUN TestPatternMatch/#9,root="media/all",itemPath="file.jpg",isFile=true --- PASS: TestPatternMatch (0.00s) --- PASS: TestPatternMatch/#0,root="",itemPath="",isFile=false (0.00s) --- PASS: TestPatternMatch/#1,root="",itemPath="",isFile=true (0.00s) --- PASS: TestPatternMatch/#2,root="upload",itemPath="",isFile=false (0.00s) --- PASS: TestPatternMatch/#3,root="upload/dir",itemPath="",isFile=false (0.00s) --- PASS: TestPatternMatch/#4,root="upload/file.jpg",itemPath="",isFile=true (0.00s) --- PASS: TestPatternMatch/#5,root="media",itemPath="",isFile=false (0.00s) --- PASS: TestPatternMatch/#6,root="",itemPath="media",isFile=false (0.00s) --- PASS: TestPatternMatch/#7,root="media/all",itemPath="",isFile=false (0.00s) --- PASS: TestPatternMatch/#8,root="media",itemPath="all",isFile=false (0.00s) --- PASS: TestPatternMatch/#9,root="media/all",itemPath="file.jpg",isFile=true (0.00s) === RUN TestPatternMatchToEntries === RUN TestPatternMatchToEntries/#0,root="",itemPath="" === RUN TestPatternMatchToEntries/#1,root="upload",itemPath="" === RUN TestPatternMatchToEntries/#2,root="upload",itemPath="dir" === RUN TestPatternMatchToEntries/#3,root="media",itemPath="" === RUN TestPatternMatchToEntries/#4,root="media/all",itemPath="" === RUN TestPatternMatchToEntries/#5,root="media",itemPath="all" === RUN TestPatternMatchToEntries/#6,root="media/by-year",itemPath="" === RUN TestPatternMatchToEntries/#7,root="media/by-year/2000",itemPath="" === RUN TestPatternMatchToEntries/#8,root="media/by-month",itemPath="" === RUN TestPatternMatchToEntries/#9,root="media/by-month/2001",itemPath="" === RUN TestPatternMatchToEntries/#10,root="media/by-month/2001/2001-01",itemPath="" === RUN TestPatternMatchToEntries/#11,root="media/by-day",itemPath="" === RUN TestPatternMatchToEntries/#12,root="media/by-day/2001",itemPath="" === RUN TestPatternMatchToEntries/#13,root="media/by-day/2001/2001-01-02",itemPath="" === RUN TestPatternMatchToEntries/#14,root="album",itemPath="" 2019/10/03 05:52:53 DEBUG : &{0xc000141b00 0xc0004ccea0 [file.jpg] map[:[0xc0003fc0f0] upload:[upload/file1.jpg 0xc0003fc140] upload/dir:[upload/dir/file2.jpg]]}: Error reading media count: strconv.ParseInt: parsing "": invalid syntax === RUN TestPatternMatchToEntries/#15,root="album/sub",itemPath="" 2019/10/03 05:52:53 DEBUG : &{0xc000141b00 0xc0004ccea0 [file.jpg] map[:[0xc0003fc0f0] upload:[upload/file1.jpg 0xc0003fc140] upload/dir:[upload/dir/file2.jpg]]}: Error reading media count: strconv.ParseInt: parsing "": invalid syntax === RUN TestPatternMatchToEntries/#16,root="album/sub/one",itemPath="" === RUN TestPatternMatchToEntries/#17,root="shared-album",itemPath="" 2019/10/03 05:52:53 DEBUG : &{0xc000141b00 0xc0004ccea0 [file.jpg] map[:[0xc0003fc0f0] upload:[upload/file1.jpg 0xc0003fc140] upload/dir:[upload/dir/file2.jpg]]}: Error reading media count: strconv.ParseInt: parsing "": invalid syntax === RUN TestPatternMatchToEntries/#18,root="shared-album/sub",itemPath="" 2019/10/03 05:52:53 DEBUG : &{0xc000141b00 0xc0004ccea0 [file.jpg] map[:[0xc0003fc0f0] upload:[upload/file1.jpg 0xc0003fc140] upload/dir:[upload/dir/file2.jpg]]}: Error reading media count: strconv.ParseInt: parsing "": invalid syntax === RUN TestPatternMatchToEntries/#19,root="shared-album/sub/one",itemPath="" --- PASS: TestPatternMatchToEntries (0.00s) --- PASS: TestPatternMatchToEntries/#0,root="",itemPath="" (0.00s) --- PASS: TestPatternMatchToEntries/#1,root="upload",itemPath="" (0.00s) --- PASS: TestPatternMatchToEntries/#2,root="upload",itemPath="dir" (0.00s) --- PASS: TestPatternMatchToEntries/#3,root="media",itemPath="" (0.00s) --- PASS: TestPatternMatchToEntries/#4,root="media/all",itemPath="" (0.00s) --- PASS: TestPatternMatchToEntries/#5,root="media",itemPath="all" (0.00s) --- PASS: TestPatternMatchToEntries/#6,root="media/by-year",itemPath="" (0.00s) --- PASS: TestPatternMatchToEntries/#7,root="media/by-year/2000",itemPath="" (0.00s) --- PASS: TestPatternMatchToEntries/#8,root="media/by-month",itemPath="" (0.00s) --- PASS: TestPatternMatchToEntries/#9,root="media/by-month/2001",itemPath="" (0.00s) --- PASS: TestPatternMatchToEntries/#10,root="media/by-month/2001/2001-01",itemPath="" (0.00s) --- PASS: TestPatternMatchToEntries/#11,root="media/by-day",itemPath="" (0.00s) --- PASS: TestPatternMatchToEntries/#12,root="media/by-day/2001",itemPath="" (0.00s) --- PASS: TestPatternMatchToEntries/#13,root="media/by-day/2001/2001-01-02",itemPath="" (0.00s) --- PASS: TestPatternMatchToEntries/#14,root="album",itemPath="" (0.00s) --- PASS: TestPatternMatchToEntries/#15,root="album/sub",itemPath="" (0.00s) --- PASS: TestPatternMatchToEntries/#16,root="album/sub/one",itemPath="" (0.00s) --- PASS: TestPatternMatchToEntries/#17,root="shared-album",itemPath="" (0.00s) --- PASS: TestPatternMatchToEntries/#18,root="shared-album/sub",itemPath="" (0.00s) --- PASS: TestPatternMatchToEntries/#19,root="shared-album/sub/one",itemPath="" (0.00s) === RUN TestPatternYears --- PASS: TestPatternYears (0.00s) === RUN TestPatternMonths --- PASS: TestPatternMonths (0.00s) === RUN TestPatternDays --- PASS: TestPatternDays (0.00s) === RUN TestPatternYearMonthDayFilter --- PASS: TestPatternYearMonthDayFilter (0.00s) === RUN TestPatternAlbumsToEntries 2019/10/03 05:52:53 DEBUG : &{0xc0000f3f00 0xc0000f7080 [] map[]}: Error reading media count: strconv.ParseInt: parsing "": invalid syntax 2019/10/03 05:52:53 DEBUG : &{0xc0000f3f00 0xc0000f7080 [file.jpg] map[]}: Error reading media count: strconv.ParseInt: parsing "": invalid syntax --- PASS: TestPatternAlbumsToEntries (0.00s) FAIL exit status 1 FAIL github.com/rclone/rclone/backend/googlephotos 222.727s "go test -v -timeout 30m0s -remote TestGooglePhotos: -verbose" - Finished ERROR in 3m44.736145453s (try 1/5): exit status 1: Failed [TestIntegration/CreateAlbum/PutFile/ObjectOpen]