"go test -v -timeout 30m0s -remote TestGooglePhotos: -verbose -test.run '^TestIntegration$/^CreateAlbum$/^PutFile$/^ObjectOpen$'" - Starting (try 4/5) === RUN TestIntegration === RUN TestIntegration/CreateAlbum 2019/10/02 06:09:07 DEBUG : Google Photos path "": Mkdir: dir="album/rclone-test-nugeqix5duranew8posekoq8" 2019/10/02 06:09:15 DEBUG : Google Photos path "": >Mkdir: err= === RUN TestIntegration/CreateAlbum/PutFile 2019/10/02 06:09:15 DEBUG : Google Photos path "": Put: src=rclone-test-image1.jpg 2019/10/02 06:09:15 DEBUG : album/rclone-test-nugeqix5duranew8posekoq8/rclone-test-image1.jpg: Update: src=rclone-test-image1.jpg 2019/10/02 06:09:21 DEBUG : album/rclone-test-nugeqix5duranew8posekoq8/rclone-test-image1.jpg: >Update: err= 2019/10/02 06:09:21 DEBUG : Google Photos path "": >Put: === RUN TestIntegration/CreateAlbum/PutFile/ObjectOpen 2019/10/02 06:09:21 DEBUG : album/rclone-test-nugeqix5duranew8posekoq8/rclone-test-image1.jpg: Open: 2019/10/02 06:09:21 DEBUG : Google Photos path "": List: dir="album/rclone-test-nugeqix5duranew8posekoq8" 2019/10/02 06:09:22 DEBUG : Google Photos path "": >List: err= 2019/10/02 06:09:23 DEBUG : pacer: low level retry 1/10 (error Error 429 (Too Many Requests)!!1

429. That’s an error.

The rate limit for this service has been exceeded. That’s all we know. (429 429 Too Many Requests)) 2019/10/02 06:09:23 DEBUG : pacer: Rate limited, increasing sleep to 1.024542379s 2019/10/02 06:09:24 DEBUG : pacer: low level retry 2/10 (error Error 429 (Too Many Requests)!!1

429. That’s an error.

The rate limit for this service has been exceeded. That’s all we know. (429 429 Too Many Requests)) 2019/10/02 06:09:24 DEBUG : pacer: Rate limited, increasing sleep to 2.470480605s 2019/10/02 06:09:28 DEBUG : pacer: low level retry 3/10 (error Error 429 (Too Many Requests)!!1

429. That’s an error.

The rate limit for this service has been exceeded. That’s all we know. (429 429 Too Many Requests)) 2019/10/02 06:09:28 DEBUG : pacer: Rate limited, increasing sleep to 4.923233109s 2019/10/02 06:09:28 DEBUG : pacer: low level retry 4/10 (error Error 429 (Too Many Requests)!!1

429. That’s an error.

The rate limit for this service has been exceeded. That’s all we know. (429 429 Too Many Requests)) 2019/10/02 06:09:28 DEBUG : pacer: Rate limited, increasing sleep to 8.715009322s 2019/10/02 06:09:33 DEBUG : pacer: low level retry 5/10 (error Error 429 (Too Many Requests)!!1

429. That’s an error.

The rate limit for this service has been exceeded. That’s all we know. (429 429 Too Many Requests)) 2019/10/02 06:09:33 DEBUG : pacer: Rate limited, increasing sleep to 16.784297014s 2019/10/02 06:09:42 DEBUG : pacer: low level retry 6/10 (error Error 429 (Too Many Requests)!!1

429. That’s an error.

The rate limit for this service has been exceeded. That’s all we know. (429 429 Too Many Requests)) 2019/10/02 06:09:42 DEBUG : pacer: Rate limited, increasing sleep to 16.575597256s 2019/10/02 06:10:10 DEBUG : pacer: low level retry 7/10 (error Error 429 (Too Many Requests)!!1

429. That’s an error.

The rate limit for this service has been exceeded. That’s all we know. (429 429 Too Many Requests)) 2019/10/02 06:10:10 DEBUG : pacer: Rate limited, increasing sleep to 16.058453723s 2019/10/02 06:10:15 DEBUG : pacer: low level retry 8/10 (error Error 429 (Too Many Requests)!!1

429. That’s an error.

The rate limit for this service has been exceeded. That’s all we know. (429 429 Too Many Requests)) 2019/10/02 06:10:15 DEBUG : pacer: Rate limited, increasing sleep to 16.319742498s 2019/10/02 06:10:31 DEBUG : pacer: low level retry 9/10 (error Error 429 (Too Many Requests)!!1

429. That’s an error.

The rate limit for this service has been exceeded. That’s all we know. (429 429 Too Many Requests)) 2019/10/02 06:10:31 DEBUG : pacer: Rate limited, increasing sleep to 16.300534928s 2019/10/02 06:10:49 DEBUG : pacer: low level retry 10/10 (error Error 429 (Too Many Requests)!!1

429. That’s an error.

The rate limit for this service has been exceeded. That’s all we know. (429 429 Too Many Requests)) 2019/10/02 06:10:49 DEBUG : pacer: Rate limited, increasing sleep to 16.389260551s 2019/10/02 06:10:49 DEBUG : album/rclone-test-nugeqix5duranew8posekoq8/rclone-test-image1.jpg: >Open: 2019/10/02 06:10:49 DEBUG : Google Photos path "": Rmdir: dir=%!q(MISSING) 2019/10/02 06:10:49 DEBUG : Google Photos path "": >Rmdir: err=google photos API does not implement deleting albums --- FAIL: TestIntegration (102.01s) --- FAIL: TestIntegration/CreateAlbum (102.01s) --- FAIL: TestIntegration/CreateAlbum/PutFile (93.99s) --- FAIL: TestIntegration/CreateAlbum/PutFile/ObjectOpen (88.59s) googlephotos_test.go:111: Error Trace: googlephotos_test.go:111 Error: Received unexpected error: Error 429 (Too Many Requests)!!1

429. That’s an error.

The rate limit for this service has been exceeded. That’s all we know. (429 429 Too Many Requests) Test: TestIntegration/CreateAlbum/PutFile/ObjectOpen FAIL exit status 1 FAIL github.com/rclone/rclone/backend/googlephotos 102.019s "go test -v -timeout 30m0s -remote TestGooglePhotos: -verbose -test.run '^TestIntegration$/^CreateAlbum$/^PutFile$/^ObjectOpen$'" - Finished ERROR in 1m45.240592908s (try 4/5): exit status 1: Failed [TestIntegration/CreateAlbum/PutFile/ObjectOpen]