"go test -v -timeout 30m0s -remote TestGooglePhotos: -verbose" - Starting (try 1/5) === RUN TestNewAlbums --- PASS: TestNewAlbums (0.00s) === RUN TestAlbumsAdd --- PASS: TestAlbumsAdd (0.00s) === RUN TestAlbumsDel --- PASS: TestAlbumsDel (0.00s) === RUN TestAlbumsGet --- PASS: TestAlbumsGet (0.00s) === RUN TestAlbumsGetDirs --- PASS: TestAlbumsGetDirs (0.00s) === RUN TestIntegration === RUN TestIntegration/CreateAlbum 2019/10/02 06:02:43 DEBUG : Google Photos path "": Mkdir: dir="album/rclone-test-basotiv5folukod4jetelel8" 2019/10/02 06:02:43 DEBUG : TestGooglePhotos: Loaded invalid token from config file - ignoring 2019/10/02 06:02:44 DEBUG : TestGooglePhotos: Saved new token in config file 2019/10/02 06:02:54 DEBUG : Google Photos path "": >Mkdir: err= === RUN TestIntegration/CreateAlbum/PutFile 2019/10/02 06:02:54 DEBUG : Google Photos path "": Put: src=rclone-test-image1.jpg 2019/10/02 06:02:54 DEBUG : album/rclone-test-basotiv5folukod4jetelel8/rclone-test-image1.jpg: Update: src=rclone-test-image1.jpg 2019/10/02 06:02:58 DEBUG : album/rclone-test-basotiv5folukod4jetelel8/rclone-test-image1.jpg: >Update: err= 2019/10/02 06:02:58 DEBUG : Google Photos path "": >Put: === RUN TestIntegration/CreateAlbum/PutFile/ObjectFs === RUN TestIntegration/CreateAlbum/PutFile/ObjectString === RUN TestIntegration/CreateAlbum/PutFile/ObjectHash === RUN TestIntegration/CreateAlbum/PutFile/ObjectSize 2019/10/02 06:02:58 DEBUG : album/rclone-test-basotiv5folukod4jetelel8/rclone-test-image1.jpg: Size: 2019/10/02 06:02:58 DEBUG : album/rclone-test-basotiv5folukod4jetelel8/rclone-test-image1.jpg: >Size: 2019/10/02 06:02:58 DEBUG : album/rclone-test-basotiv5folukod4jetelel8/rclone-test-image1.jpg: Size: 2019/10/02 06:02:58 DEBUG : Google Photos path "": List: dir="album/rclone-test-basotiv5folukod4jetelel8" 2019/10/02 06:03:00 DEBUG : Google Photos path "": >List: err= 2019/10/02 06:03:02 DEBUG : album/rclone-test-basotiv5folukod4jetelel8/rclone-test-image1.jpg: >Size: === RUN TestIntegration/CreateAlbum/PutFile/ObjectSetModTime === RUN TestIntegration/CreateAlbum/PutFile/ObjectStorable === RUN TestIntegration/CreateAlbum/PutFile/ObjectOpen 2019/10/02 06:03:02 DEBUG : album/rclone-test-basotiv5folukod4jetelel8/rclone-test-image1.jpg: Open: 2019/10/02 06:03:02 DEBUG : pacer: low level retry 1/10 (error Error 429 (Too Many Requests)!!1

429. That’s an error.

The rate limit for this service has been exceeded. That’s all we know. (429 429 Too Many Requests)) 2019/10/02 06:03:02 DEBUG : pacer: Rate limited, increasing sleep to 1.806115243s 2019/10/02 06:03:03 DEBUG : pacer: low level retry 2/10 (error Error 429 (Too Many Requests)!!1

429. That’s an error.

The rate limit for this service has been exceeded. That’s all we know. (429 429 Too Many Requests)) 2019/10/02 06:03:03 DEBUG : pacer: Rate limited, increasing sleep to 2.168842985s 2019/10/02 06:03:04 DEBUG : pacer: low level retry 3/10 (error Error 429 (Too Many Requests)!!1

429. That’s an error.

The rate limit for this service has been exceeded. That’s all we know. (429 429 Too Many Requests)) 2019/10/02 06:03:04 DEBUG : pacer: Rate limited, increasing sleep to 4.705265134s 2019/10/02 06:03:07 DEBUG : pacer: low level retry 4/10 (error Error 429 (Too Many Requests)!!1

429. That’s an error.

The rate limit for this service has been exceeded. That’s all we know. (429 429 Too Many Requests)) 2019/10/02 06:03:07 DEBUG : pacer: Rate limited, increasing sleep to 8.776659784s 2019/10/02 06:03:11 DEBUG : pacer: low level retry 5/10 (error Error 429 (Too Many Requests)!!1

429. That’s an error.

The rate limit for this service has been exceeded. That’s all we know. (429 429 Too Many Requests)) 2019/10/02 06:03:11 DEBUG : pacer: Rate limited, increasing sleep to 16.506966462s 2019/10/02 06:03:20 DEBUG : pacer: low level retry 6/10 (error Error 429 (Too Many Requests)!!1

429. That’s an error.

The rate limit for this service has been exceeded. That’s all we know. (429 429 Too Many Requests)) 2019/10/02 06:03:20 DEBUG : pacer: Rate limited, increasing sleep to 16.879803912s 2019/10/02 06:03:37 DEBUG : pacer: low level retry 7/10 (error Error 429 (Too Many Requests)!!1

429. That’s an error.

The rate limit for this service has been exceeded. That’s all we know. (429 429 Too Many Requests)) 2019/10/02 06:03:37 DEBUG : pacer: Rate limited, increasing sleep to 16.863007204s 2019/10/02 06:03:53 DEBUG : pacer: low level retry 8/10 (error Error 429 (Too Many Requests)!!1

429. That’s an error.

The rate limit for this service has been exceeded. That’s all we know. (429 429 Too Many Requests)) 2019/10/02 06:03:53 DEBUG : pacer: Rate limited, increasing sleep to 16.004489095s 2019/10/02 06:04:10 DEBUG : pacer: low level retry 9/10 (error Error 429 (Too Many Requests)!!1

429. That’s an error.

The rate limit for this service has been exceeded. That’s all we know. (429 429 Too Many Requests)) 2019/10/02 06:04:10 DEBUG : pacer: Rate limited, increasing sleep to 16.622698526s 2019/10/02 06:04:26 DEBUG : pacer: low level retry 10/10 (error Error 429 (Too Many Requests)!!1

429. That’s an error.

The rate limit for this service has been exceeded. That’s all we know. (429 429 Too Many Requests)) 2019/10/02 06:04:26 DEBUG : pacer: Rate limited, increasing sleep to 16.642568742s 2019/10/02 06:04:26 DEBUG : album/rclone-test-basotiv5folukod4jetelel8/rclone-test-image1.jpg: >Open: === RUN TestIntegration/CreateAlbum/PutFile/CheckFileInAlbum 2019/10/02 06:04:26 DEBUG : Google Photos path "": List: dir="album/rclone-test-basotiv5folukod4jetelel8" 2019/10/02 06:04:45 DEBUG : pacer: Reducing sleep to 0s 2019/10/02 06:04:45 DEBUG : Google Photos path "": >List: err= 2019/10/02 06:04:45 DEBUG : album/rclone-test-basotiv5folukod4jetelel8/rclone-test-image1.jpg: ModTime: 2019/10/02 06:04:45 DEBUG : album/rclone-test-basotiv5folukod4jetelel8/rclone-test-image1.jpg: >ModTime: === RUN TestIntegration/CreateAlbum/PutFile/CheckInByYear 2019/10/02 06:04:45 DEBUG : Google Photos path "": List: dir="media/by-year/2013" 2019/10/02 06:05:03 DEBUG : Google Photos path "": >List: err= === RUN TestIntegration/CreateAlbum/PutFile/CheckInByMonth 2019/10/02 06:05:03 DEBUG : Google Photos path "": List: dir="media/by-month/2013/2013-07" 2019/10/02 06:05:07 DEBUG : Google Photos path "": >List: err= === RUN TestIntegration/CreateAlbum/PutFile/CheckInByDay 2019/10/02 06:05:07 DEBUG : Google Photos path "": List: dir="media/by-day/2013/2013-07-26" 2019/10/02 06:05:11 DEBUG : Google Photos path "": >List: err= === RUN TestIntegration/CreateAlbum/PutFile/NewObject 2019/10/02 06:05:11 DEBUG : Google Photos path "": NewObject: remote="album/rclone-test-basotiv5folukod4jetelel8/rclone-test-image1.jpg" 2019/10/02 06:05:11 DEBUG : Google Photos path "": List: dir="album/rclone-test-basotiv5folukod4jetelel8" 2019/10/02 06:05:13 DEBUG : Google Photos path "": >List: err= 2019/10/02 06:05:13 DEBUG : Google Photos path "": >NewObject: === RUN TestIntegration/CreateAlbum/PutFile/NewObjectWithID 2019/10/02 06:05:13 DEBUG : Google Photos path "": NewObject: remote="album/rclone-test-basotiv5folukod4jetelel8/rclone-test-image1 {ALOKJiij1W7NqR8m4fVOFogqyQjeUEMc14c2GWrK6P8tHiQttTrTvBblBfG2LUsKRCml_8syA24ZupQSng98A1G0agXejH5DSw}.jpg" 2019/10/02 06:05:15 DEBUG : Google Photos path "": >NewObject: === RUN TestIntegration/CreateAlbum/PutFile/NewFsIsFile 2019/10/02 06:05:15 DEBUG : Google Photos path "album/rclone-test-basotiv5folukod4jetelel8": NewObject: remote="rclone-test-image1.jpg" 2019/10/02 06:05:15 DEBUG : Google Photos path "album/rclone-test-basotiv5folukod4jetelel8": List: dir="" 2019/10/02 06:05:23 DEBUG : Google Photos path "album/rclone-test-basotiv5folukod4jetelel8": >List: err= 2019/10/02 06:05:23 DEBUG : Google Photos path "album/rclone-test-basotiv5folukod4jetelel8": >NewObject: 2019/10/02 06:05:23 DEBUG : Google Photos path "album/rclone-test-basotiv5folukod4jetelel8": NewObject: remote="rclone-test-image1.jpg" 2019/10/02 06:05:23 DEBUG : Google Photos path "album/rclone-test-basotiv5folukod4jetelel8": List: dir="" 2019/10/02 06:05:25 DEBUG : Google Photos path "album/rclone-test-basotiv5folukod4jetelel8": >List: err= 2019/10/02 06:05:25 DEBUG : Google Photos path "album/rclone-test-basotiv5folukod4jetelel8": >NewObject: === RUN TestIntegration/CreateAlbum/PutFile/RemoveFileFromAlbum 2019/10/02 06:05:30 DEBUG : Google Photos path "": List: dir="album/rclone-test-basotiv5folukod4jetelel8" 2019/10/02 06:05:31 DEBUG : Google Photos path "": >List: err= 2019/10/02 06:05:31 DEBUG : Google Photos path "": Rmdir: dir=%!q(MISSING) 2019/10/02 06:05:31 DEBUG : Google Photos path "": >Rmdir: err=google photos API does not implement deleting albums === RUN TestIntegration/UploadMkdir 2019/10/02 06:05:31 DEBUG : Google Photos path "": Mkdir: dir="upload/dir" 2019/10/02 06:05:31 DEBUG : Google Photos path "": >Mkdir: err= 2019/10/02 06:05:31 DEBUG : Google Photos path "": Mkdir: dir="upload/dir/subdir" 2019/10/02 06:05:31 DEBUG : Google Photos path "": >Mkdir: err= === RUN TestIntegration/UploadMkdir/List 2019/10/02 06:05:31 DEBUG : Google Photos path "": List: dir="upload" 2019/10/02 06:05:31 DEBUG : Google Photos path "": >List: err= 2019/10/02 06:05:31 DEBUG : Google Photos path "": List: dir="upload/dir" 2019/10/02 06:05:31 DEBUG : Google Photos path "": >List: err= === RUN TestIntegration/UploadMkdir/Rmdir 2019/10/02 06:05:31 DEBUG : Google Photos path "": Rmdir: dir=%!q(MISSING) 2019/10/02 06:05:31 DEBUG : Google Photos path "": >Rmdir: err= 2019/10/02 06:05:31 DEBUG : Google Photos path "": Rmdir: dir=%!q(MISSING) 2019/10/02 06:05:31 DEBUG : Google Photos path "": >Rmdir: err= === RUN TestIntegration/UploadMkdir/ListEmpty 2019/10/02 06:05:31 DEBUG : Google Photos path "": List: dir="upload" 2019/10/02 06:05:31 DEBUG : Google Photos path "": >List: err= 2019/10/02 06:05:31 DEBUG : Google Photos path "": List: dir="upload/dir" 2019/10/02 06:05:31 DEBUG : Google Photos path "": >List: err=directory not found === RUN TestIntegration/Upload 2019/10/02 06:05:31 DEBUG : Google Photos path "": Put: src=rclone-test-image2.jpg 2019/10/02 06:05:31 DEBUG : upload/dir/subdir/rclone-test-image2.jpg: Update: src=rclone-test-image2.jpg 2019/10/02 06:05:36 DEBUG : upload/dir/subdir/rclone-test-image2.jpg: >Update: err= 2019/10/02 06:05:36 DEBUG : Google Photos path "": >Put: === RUN TestIntegration/Upload/List 2019/10/02 06:05:36 DEBUG : Google Photos path "": List: dir="upload/dir/subdir" 2019/10/02 06:05:36 DEBUG : Google Photos path "": >List: err= 2019/10/02 06:05:36 DEBUG : upload/dir/subdir/rclone-test-image2.jpg: ModTime: 2019/10/02 06:05:36 DEBUG : Google Photos path "": List: dir="upload/dir/subdir" 2019/10/02 06:05:36 DEBUG : Google Photos path "": >List: err= 2019/10/02 06:05:36 DEBUG : upload/dir/subdir/rclone-test-image2.jpg: >ModTime: === RUN TestIntegration/Upload/NewObject 2019/10/02 06:05:36 DEBUG : Google Photos path "": NewObject: remote="upload/dir/subdir/rclone-test-image2.jpg" 2019/10/02 06:05:36 DEBUG : Google Photos path "": List: dir="upload/dir/subdir" 2019/10/02 06:05:36 DEBUG : Google Photos path "": >List: err= 2019/10/02 06:05:36 DEBUG : Google Photos path "": >NewObject: === RUN TestIntegration/Upload/NewObjectWithID 2019/10/02 06:05:36 DEBUG : Google Photos path "": NewObject: remote="upload/dir/subdir/rclone-test-image2 {ALOKJii7XWCj_vIu4ceOSuEIDk5JEZn8ypYEUqOZktpK248TRnFljSsuAXX25ExXLgpFqJhYkTRORq5zNgke4rdqS13zO1Kd7A}.jpg" 2019/10/02 06:05:38 DEBUG : Google Photos path "": >NewObject: === RUN TestIntegration/Name === RUN TestIntegration/Root === RUN TestIntegration/String === RUN TestIntegration/Features === RUN TestIntegration/Precision === RUN TestIntegration/Hashes --- FAIL: TestIntegration (174.37s) --- FAIL: TestIntegration/CreateAlbum (168.28s) --- FAIL: TestIntegration/CreateAlbum/PutFile (157.37s) --- PASS: TestIntegration/CreateAlbum/PutFile/ObjectFs (0.00s) --- PASS: TestIntegration/CreateAlbum/PutFile/ObjectString (0.00s) --- PASS: TestIntegration/CreateAlbum/PutFile/ObjectHash (0.00s) --- PASS: TestIntegration/CreateAlbum/PutFile/ObjectSize (3.97s) --- PASS: TestIntegration/CreateAlbum/PutFile/ObjectSetModTime (0.00s) --- PASS: TestIntegration/CreateAlbum/PutFile/ObjectStorable (0.00s) --- FAIL: TestIntegration/CreateAlbum/PutFile/ObjectOpen (84.45s) googlephotos_test.go:111: Error Trace: googlephotos_test.go:111 Error: Received unexpected error: Error 429 (Too Many Requests)!!1

429. That’s an error.

The rate limit for this service has been exceeded. That’s all we know. (429 429 Too Many Requests) Test: TestIntegration/CreateAlbum/PutFile/ObjectOpen --- PASS: TestIntegration/CreateAlbum/PutFile/CheckFileInAlbum (19.08s) --- PASS: TestIntegration/CreateAlbum/PutFile/CheckInByYear (18.02s) --- PASS: TestIntegration/CreateAlbum/PutFile/CheckInByMonth (3.45s) --- PASS: TestIntegration/CreateAlbum/PutFile/CheckInByDay (3.70s) --- PASS: TestIntegration/CreateAlbum/PutFile/NewObject (2.21s) --- PASS: TestIntegration/CreateAlbum/PutFile/NewObjectWithID (2.01s) --- PASS: TestIntegration/CreateAlbum/PutFile/NewFsIsFile (9.97s) --- PASS: TestIntegration/CreateAlbum/PutFile/RemoveFileFromAlbum (6.63s) --- PASS: TestIntegration/UploadMkdir (0.00s) --- PASS: TestIntegration/UploadMkdir/List (0.00s) --- PASS: TestIntegration/UploadMkdir/Rmdir (0.00s) --- PASS: TestIntegration/UploadMkdir/ListEmpty (0.00s) --- PASS: TestIntegration/Upload (6.09s) --- PASS: TestIntegration/Upload/List (0.00s) --- PASS: TestIntegration/Upload/NewObject (0.00s) --- PASS: TestIntegration/Upload/NewObjectWithID (1.95s) --- PASS: TestIntegration/Name (0.00s) --- PASS: TestIntegration/Root (0.00s) --- PASS: TestIntegration/String (0.00s) --- PASS: TestIntegration/Features (0.00s) --- PASS: TestIntegration/Precision (0.00s) --- PASS: TestIntegration/Hashes (0.00s) === RUN TestAddID --- PASS: TestAddID (0.00s) === RUN TestFileAddID --- PASS: TestFileAddID (0.00s) === RUN TestFindID --- PASS: TestFindID (0.00s) === RUN TestPatternMatch === RUN TestPatternMatch/#0,root="",itemPath="",isFile=false === RUN TestPatternMatch/#1,root="",itemPath="",isFile=true === RUN TestPatternMatch/#2,root="upload",itemPath="",isFile=false === RUN TestPatternMatch/#3,root="upload/dir",itemPath="",isFile=false === RUN TestPatternMatch/#4,root="upload/file.jpg",itemPath="",isFile=true === RUN TestPatternMatch/#5,root="media",itemPath="",isFile=false === RUN TestPatternMatch/#6,root="",itemPath="media",isFile=false === RUN TestPatternMatch/#7,root="media/all",itemPath="",isFile=false === RUN TestPatternMatch/#8,root="media",itemPath="all",isFile=false === RUN TestPatternMatch/#9,root="media/all",itemPath="file.jpg",isFile=true --- PASS: TestPatternMatch (0.00s) --- PASS: TestPatternMatch/#0,root="",itemPath="",isFile=false (0.00s) --- PASS: TestPatternMatch/#1,root="",itemPath="",isFile=true (0.00s) --- PASS: TestPatternMatch/#2,root="upload",itemPath="",isFile=false (0.00s) --- PASS: TestPatternMatch/#3,root="upload/dir",itemPath="",isFile=false (0.00s) --- PASS: TestPatternMatch/#4,root="upload/file.jpg",itemPath="",isFile=true (0.00s) --- PASS: TestPatternMatch/#5,root="media",itemPath="",isFile=false (0.00s) --- PASS: TestPatternMatch/#6,root="",itemPath="media",isFile=false (0.00s) --- PASS: TestPatternMatch/#7,root="media/all",itemPath="",isFile=false (0.00s) --- PASS: TestPatternMatch/#8,root="media",itemPath="all",isFile=false (0.00s) --- PASS: TestPatternMatch/#9,root="media/all",itemPath="file.jpg",isFile=true (0.00s) === RUN TestPatternMatchToEntries === RUN TestPatternMatchToEntries/#0,root="",itemPath="" === RUN TestPatternMatchToEntries/#1,root="upload",itemPath="" === RUN TestPatternMatchToEntries/#2,root="upload",itemPath="dir" === RUN TestPatternMatchToEntries/#3,root="media",itemPath="" === RUN TestPatternMatchToEntries/#4,root="media/all",itemPath="" === RUN TestPatternMatchToEntries/#5,root="media",itemPath="all" === RUN TestPatternMatchToEntries/#6,root="media/by-year",itemPath="" === RUN TestPatternMatchToEntries/#7,root="media/by-year/2000",itemPath="" === RUN TestPatternMatchToEntries/#8,root="media/by-month",itemPath="" === RUN TestPatternMatchToEntries/#9,root="media/by-month/2001",itemPath="" === RUN TestPatternMatchToEntries/#10,root="media/by-month/2001/2001-01",itemPath="" === RUN TestPatternMatchToEntries/#11,root="media/by-day",itemPath="" === RUN TestPatternMatchToEntries/#12,root="media/by-day/2001",itemPath="" === RUN TestPatternMatchToEntries/#13,root="media/by-day/2001/2001-01-02",itemPath="" === RUN TestPatternMatchToEntries/#14,root="album",itemPath="" 2019/10/02 06:05:38 DEBUG : &{0xc000247200 0xc0002a8390 [file.jpg] map[:[0xc00030c550] upload:[upload/file1.jpg 0xc00030c5a0] upload/dir:[upload/dir/file2.jpg]]}: Error reading media count: strconv.ParseInt: parsing "": invalid syntax === RUN TestPatternMatchToEntries/#15,root="album/sub",itemPath="" 2019/10/02 06:05:38 DEBUG : &{0xc000247200 0xc0002a8390 [file.jpg] map[:[0xc00030c550] upload:[upload/file1.jpg 0xc00030c5a0] upload/dir:[upload/dir/file2.jpg]]}: Error reading media count: strconv.ParseInt: parsing "": invalid syntax === RUN TestPatternMatchToEntries/#16,root="album/sub/one",itemPath="" === RUN TestPatternMatchToEntries/#17,root="shared-album",itemPath="" 2019/10/02 06:05:38 DEBUG : &{0xc000247200 0xc0002a8390 [file.jpg] map[:[0xc00030c550] upload:[upload/file1.jpg 0xc00030c5a0] upload/dir:[upload/dir/file2.jpg]]}: Error reading media count: strconv.ParseInt: parsing "": invalid syntax === RUN TestPatternMatchToEntries/#18,root="shared-album/sub",itemPath="" 2019/10/02 06:05:38 DEBUG : &{0xc000247200 0xc0002a8390 [file.jpg] map[:[0xc00030c550] upload:[upload/file1.jpg 0xc00030c5a0] upload/dir:[upload/dir/file2.jpg]]}: Error reading media count: strconv.ParseInt: parsing "": invalid syntax === RUN TestPatternMatchToEntries/#19,root="shared-album/sub/one",itemPath="" --- PASS: TestPatternMatchToEntries (0.00s) --- PASS: TestPatternMatchToEntries/#0,root="",itemPath="" (0.00s) --- PASS: TestPatternMatchToEntries/#1,root="upload",itemPath="" (0.00s) --- PASS: TestPatternMatchToEntries/#2,root="upload",itemPath="dir" (0.00s) --- PASS: TestPatternMatchToEntries/#3,root="media",itemPath="" (0.00s) --- PASS: TestPatternMatchToEntries/#4,root="media/all",itemPath="" (0.00s) --- PASS: TestPatternMatchToEntries/#5,root="media",itemPath="all" (0.00s) --- PASS: TestPatternMatchToEntries/#6,root="media/by-year",itemPath="" (0.00s) --- PASS: TestPatternMatchToEntries/#7,root="media/by-year/2000",itemPath="" (0.00s) --- PASS: TestPatternMatchToEntries/#8,root="media/by-month",itemPath="" (0.00s) --- PASS: TestPatternMatchToEntries/#9,root="media/by-month/2001",itemPath="" (0.00s) --- PASS: TestPatternMatchToEntries/#10,root="media/by-month/2001/2001-01",itemPath="" (0.00s) --- PASS: TestPatternMatchToEntries/#11,root="media/by-day",itemPath="" (0.00s) --- PASS: TestPatternMatchToEntries/#12,root="media/by-day/2001",itemPath="" (0.00s) --- PASS: TestPatternMatchToEntries/#13,root="media/by-day/2001/2001-01-02",itemPath="" (0.00s) --- PASS: TestPatternMatchToEntries/#14,root="album",itemPath="" (0.00s) --- PASS: TestPatternMatchToEntries/#15,root="album/sub",itemPath="" (0.00s) --- PASS: TestPatternMatchToEntries/#16,root="album/sub/one",itemPath="" (0.00s) --- PASS: TestPatternMatchToEntries/#17,root="shared-album",itemPath="" (0.00s) --- PASS: TestPatternMatchToEntries/#18,root="shared-album/sub",itemPath="" (0.00s) --- PASS: TestPatternMatchToEntries/#19,root="shared-album/sub/one",itemPath="" (0.00s) === RUN TestPatternYears --- PASS: TestPatternYears (0.00s) === RUN TestPatternMonths --- PASS: TestPatternMonths (0.00s) === RUN TestPatternDays --- PASS: TestPatternDays (0.00s) === RUN TestPatternYearMonthDayFilter --- PASS: TestPatternYearMonthDayFilter (0.00s) === RUN TestPatternAlbumsToEntries 2019/10/02 06:05:38 DEBUG : &{0xc0002bb300 0xc000204d80 [] map[]}: Error reading media count: strconv.ParseInt: parsing "": invalid syntax 2019/10/02 06:05:38 DEBUG : &{0xc0002bb300 0xc000204d80 [file.jpg] map[]}: Error reading media count: strconv.ParseInt: parsing "": invalid syntax --- PASS: TestPatternAlbumsToEntries (0.00s) FAIL exit status 1 FAIL github.com/rclone/rclone/backend/googlephotos 174.385s "go test -v -timeout 30m0s -remote TestGooglePhotos: -verbose" - Finished ERROR in 2m56.049741361s (try 1/5): exit status 1: Failed [TestIntegration/CreateAlbum/PutFile/ObjectOpen]